{"text_format":"1","workbook":"xlsx","n_sheets":8,"sheets":["Main","Model Parameters","Input Data","Water Budget","Model Sensitivity","Model Output","Definitions","Lookup Tables"],"not_rendered":{"charts":5,"images":7,"macros":1,"external_links":0,"defined_names":1,"comments":0,"pivot_tables":0},"unopened":[],"bounds":{"document_bytes":16777216,"sheet_cells":100000,"rows_first":2000,"rows_last":500,"rows_between":2000,"halvings":0,"cell_chars":16384,"cell_head_chars":4096},"cells_cut":0,"cells_raw":0,"read":"whole","date_system":"1900"}

{"sheet":"Main","index":0,"n_rows":12,"n_cols":11,"rows_kept":12,"cut":false,"hidden":false,"merged":[[11,1,11,7],[1,0,6,11],[10,1,10,7]]}
[]
["On behalf of the B.C. Ministry of Environment, Associated Environmental Consultants Inc. prepared this workbook to provide a monthly water budget for Similkameen Valley Aquifer (259).  Throuhgout the workbook, yellow cells indicate user-input parameters and data and blue cells indicate auto-populated terms."]
[]
[]
[]
[]
[]
["Revision Date","2016-06-01"]
["Revised By","Associated"]
[null,null,null,null,null,null,null,null,null,null,"Navigation"]
{"$rows_left_out":3}
{"sheet":"Model Parameters","index":1,"n_rows":49,"n_cols":8,"rows_kept":49,"cut":false,"hidden":false,"merged":[[34,5,36,7]]}
[null,{"$f":"Main!$B$11","v":"Similkameen Valley Aquifer"}]
[null,{"$f":"CONCATENATE(\"Aquifer #\", Main!$B$12)","v":"Aquifer #259"}]
[]
[]
[null,"MODEL SCENARIO","Units","Select Scenario",null,"WATER BUDGET OUTPUTS","Units"]
[]
[null,"Select 'Normal', 'Dry', 'Wet', or 'Other' Year","-","NORMAL",null,"Evaporation Direct from Similkameen River"]
[null,null,null,null,null,"Annual Total Evaporation","mm",{"$f":"'Lookup Tables'!AD16","v":967.40000000000009}]
[null,"SYSTEM CHARACTERISTICS","Units"]
[null,null,null,null,null,"Surface Water Outflow"]
{"$rows_left_out":40}
{"sheet":"Input Data","index":2,"n_rows":61,"n_cols":32,"rows_kept":61,"cut":false,"hidden":false,"merged":[[4,1,4,15],[4,17,4,31],[38,1,38,15]]}
[null,{"$f":"Main!$B$11","v":"Similkameen Valley Aquifer"}]
[null,{"$f":"CONCATENATE(\"Aquifer #\", Main!$B$12)","v":"Aquifer #259"}]
[]
[]
[null,"WATER BUDGET INPUTS",null,null,null,null,null,null,null,null,null,null,null,null,null,null,null,"WATER BUDGET OUTPUTS"]
[]
[null,"PRECIPITATION DATA","Units","JAN","FEB","MAR","APR","MAY","JUN","JUL","AUG","SEP","OCT","NOV","DEC","ANNUAL TOTAL",null,"EVAPORATION DATA","Units","JAN","FEB","MAR","APR","MAY","JUN","JUL","AUG","SEP","OCT","NOV","DEC","ANNUAL TOTAL"]
[null,"Normal Year","mm",39.700000000000003,20.5,16.5,18.399999999999999,29.6,37.6,29.6,24.3,23.8,26.1,44.5,36.4,{"$f":"SUM(D8:O8)","v":347},null,"Normal Year","mm",18.3,27.4,57.6,89,127.7,143.80000000000001,165.4,147.6,98.1,52.9,23.7,15.9,{"$f":"SUM(T8:AE8)","v":967.40000000000009}]
[null,"Dry Year","mm",19.600000000000001,21.3,16.2,11.9,7.4,21.3,14.3,2.2000000000000002,6.8,15.9,26.4,26.3,{"$f":"SUM(D9:O9)","v":189.60000000000002},null,"Dry Year","mm",18.399999999999999,25.3,57.9,84.6,135.19999999999999,134.80000000000001,161.69999999999999,155.30000000000001,104.7,49.3,27.2,16.8,{"$f":"SUM(T9:AE9)","v":971.2}]
[null,"Wet Year","mm",35.9,23.3,20.399999999999999,40.200000000000003,54.2,62.2,24,42.6,5.2,19,37.4,30.4,394.79999999999995,null,"Wet Year","mm",16.2,28.9,52.8,87.3,116.7,131,166.3,140.30000000000001,109,57.6,23.9,18,948]
{"$rows_left_out":52}
{"sheet":"Water Budget","index":3,"n_rows":43,"n_cols":16,"rows_kept":43,"cut":false,"hidden":false,"merged":[[4,1,4,15]]}
[null,{"$f":"Main!$B$11","v":"Similkameen Valley Aquifer"}]
[null,{"$f":"CONCATENATE(\"Aquifer #\", Main!$B$12)","v":"Aquifer #259"}]
[]
[]
[null,"WATER BUDGET"]
[]
[null,"INPUTS","Units","JAN","FEB","MAR","APR","MAY","JUN","JUL","AUG","SEP","OCT","NOV","DEC","ANNUAL TOTAL"]
[null,"Direct Precipitation to Similkameen river","m3",{"$f":"('Lookup Tables'!C13/1000) * 'Model Parameters'!$D$17","v":407337.76090000005},{"$f":"('Lookup Tables'!D13/1000)*'Model Parameters'!$D$17","v":210338.1385},{"$f":"('Lookup Tables'!E13/1000)*'Model Parameters'!$D$17","v":169296.55050000001},{"$f":"('Lookup Tables'!F13/1000)*'Model Parameters'!$D$17","v":188791.30479999998},{"$f":"('Lookup Tables'!G13/1000)*'Model Parameters'!$D$17","v":303707.7512},{"$f":"('Lookup Tables'!H13/1000)*'Model Parameters'!$D$17","v":385790.92720000003},{"$f":"('Lookup Tables'!I13/1000)*'Model Parameters'!$D$17","v":303707.7512},{"$f":"('Lookup Tables'!J13/1000)*'Model Parameters'!$D$17","v":249327.64710000003},{"$f":"('Lookup Tables'!K13/1000)*'Model Parameters'!$D$17","v":244197.4486},{"$f":"('Lookup Tables'!L13/1000)*'Model Parameters'!$D$17","v":267796.36170000001},{"$f":"('Lookup Tables'!M13/1000)*'Model Parameters'!$D$17","v":456587.66649999999},{"$f":"('Lookup Tables'!N13/1000)*'Model Parameters'!$D$17","v":373478.45079999999},{"$f":"SUM(D8:O8)","v":3560357.7590000005}]
[null,"Similkameen River Inflow","m3",{"$f":"('Lookup Tables'!C23*(60*60*24)) * 'Lookup Tables'!C3","v":40176000},{"$f":"('Lookup Tables'!D23*(60*60*24)) * 'Lookup Tables'!D3","v":29756160},{"$f":"('Lookup Tables'!E23*(60*60*24)) * 'Lookup Tables'!E3","v":49282559.999999993},{"$f":"('Lookup Tables'!F23*(60*60*24)) * 'Lookup Tables'!F3","v":142819200},{"$f":"('Lookup Tables'!G23*(60*60*24)) * 'Lookup Tables'!G3","v":415152000},{"$f":"('Lookup Tables'!H23*(60*60*24)) * 'Lookup Tables'!H3","v":357696000},{"$f":"('Lookup Tables'!I23*(60*60*24)) * 'Lookup Tables'!I3","v":114099840},{"$f":"('Lookup Tables'!J23*(60*60*24)) * 'Lookup Tables'!J3","v":30533760},{"$f":"('Lookup Tables'!K23*(60*60*24)) * 'Lookup Tables'!K3","v":19725120},{"$f":"('Lookup Tables'!L23*(60*60*24)) * 'Lookup Tables'!L3","v":31337279.999999996},{"$f":"('Lookup Tables'!M23*(60*60*24)) * 'Lookup Tables'!M3","v":64022400},{"$f":"('Lookup Tables'!N23*(60*60*24)) * 'Lookup Tables'!N3","v":39104640},{"$f":"SUM(D9:O9)","v":1333704960}]
[null,"Tributary Inflow","m3",{"$f":"IF('Lookup Tables'!$D$76=2, (('Lookup Tables'!C31*(60*60*24)) * 'Lookup Tables'!C3), IF('Lookup Tables'!$D$76=1, (('Lookup Tables'!C31*(60*60*24)) * 'Lookup Tables'!C3) + ((('Lookup Tables'!C31*(60*60*24)) * 'Lookup Tables'!C3) * ('Model Sensitivity'!$M$23/100)), \"Error\"))","v":7429881.6000000006},{"$f":"IF('Lookup Tables'!$D$76=2, ('Lookup Tables'!D31*60*60*24*'Lookup Tables'!D3), IF('Lookup Tables'!$D$76=1, ('Lookup Tables'!D31*60*60*24*'Lookup Tables'!D3) + (('Lookup Tables'!D31*60*60*24*'Lookup Tables'!D3) * ('Model Sensitivity'!$M$23/100)), \"Error\"))","v":6093964.8000000007},{"$f":"IF('Lookup Tables'!$D$76=2, ('Lookup Tables'!E31*60*60*24*'Lookup Tables'!E3), IF('Lookup Tables'!$D$76=1, ('Lookup Tables'!E31*60*60*24*'Lookup Tables'!E3) + (('Lookup Tables'!E31*60*60*24*'Lookup Tables'!E3) * ('Model Sensitivity'!$M$23/100)), \"Error\"))","v":8945855.9999999981},{"$f":"IF('Lookup Tables'!$D$76=2, ('Lookup Tables'!F31*60*60*24*'Lookup Tables'!F3), IF('Lookup Tables'!$D$76=1, ('Lookup Tables'!F31*60*60*24*'Lookup Tables'!F3) + (('Lookup Tables'!F31*60*60*24*'Lookup Tables'!F3) * ('Model Sensitivity'!$M$23/100)), \"Error\"))","v":30585600},{"$f":"IF('Lookup Tables'!$D$76=2, ('Lookup Tables'!G31*60*60*24*'Lookup Tables'!G3), IF('Lookup Tables'!$D$76=1, ('Lookup Tables'!G31*60*60*24*'Lookup Tables'!G3) + (('Lookup Tables'!G31*60*60*24*'Lookup Tables'!G3) * ('Model Sensitivity'!$M$23/100)), \"Error\"))","v":128991744},{"$f":"IF('Lookup Tables'!$D$76=2, ('Lookup Tables'!H31*60*60*24*'Lookup Tables'!H3), IF('Lookup Tables'!$D$76=1, ('Lookup Tables'!H31*60*60*24*'Lookup Tables'!H3) + (('Lookup Tables'!H31*60*60*24*'Lookup Tables'!H3) * ('Model Sensitivity'!$M$23/100)), \"Error\"))","v":116614080},{"$f":"IF('Lookup Tables'!$D$76=2, ('Lookup Tables'!I31*60*60*24*'Lookup Tables'!I3), IF('Lookup Tables'!$D$76=1, ('Lookup Tables'!I31*60*60*24*'Lookup Tables'!I3) + (('Lookup Tables'!I31*60*60*24*'Lookup Tables'!I3) * ('Model Sensitivity'!$M$23/100)), \"Error\"))","v":44166815.999999993},{"$f":"IF('Lookup Tables'!$D$76=2, ('Lookup Tables'!J31*60*60*24*'Lookup Tables'!J3), IF('Lookup Tables'!$D$76=1, ('Lookup Tables'!J31*60*60*24*'Lookup Tables'!J3) + (('Lookup Tables'!J31*60*60*24*'Lookup Tables'!J3) * ('Model Sensitivity'!$M$23/100)), \"Error\"))","v":15708816.000000004},{"$f":"IF('Lookup Tables'!$D$76=2, ('Lookup Tables'!K31*60*60*24*'Lookup Tables'!K3), IF('Lookup Tables'!$D$76=1, ('Lookup Tables'!K31*60*60*24*'Lookup Tables'!K3) + (('Lookup Tables'!K31*60*60*24*'Lookup Tables'!K3) * ('Model Sensitivity'!$M$23/100)), \"Error\"))","v":9854784.0000000019},{"$f":"IF('Lookup Tables'!$D$76=2, ('Lookup Tables'!L31*60*60*24*'Lookup Tables'!L3), IF('Lookup Tables'!$D$76=1, ('Lookup Tables'!L31*60*60*24*'Lookup Tables'!L3) + (('Lookup Tables'!L31*60*60*24*'Lookup Tables'!L3) * ('Model Sensitivity'!$M$23/100)), \"Error\"))","v":9553852.8000000007},{"$f":"IF('Lookup Tables'!$D$76=2, ('Lookup Tables'!M31*60*60*24*'Lookup Tables'!M3), IF('Lookup Tables'!$D$76=1, ('Lookup Tables'!M31*60*60*24*'Lookup Tables'!M3) + (('Lookup Tables'!M31*60*60*24*'Lookup Tables'!M3) * ('Model Sensitivity'!$M$23/100)), \"Error\"))","v":11500704.000000002},{"$f":"IF('Lookup Tables'!$D$76=2, ('Lookup Tables'!N31*60*60*24*'Lookup Tables'!N3), IF('Lookup Tables'!$D$76=1, ('Lookup Tables'!N31*60*60*24*'Lookup Tables'!N3) + (('Lookup Tables'!N31*60*60*24*'Lookup Tables'!N3) * ('Model Sensitivity'!$M$23/100)), \"Error\"))","v":8576236.8000000007},{"$f":"SUM(D10:O10)","v":398022336}]
{"$rows_left_out":34}
{"sheet":"Model Sensitivity","index":4,"n_rows":39,"n_cols":16,"rows_kept":39,"cut":false,"hidden":false,"merged":[[4,1,4,13],[12,7,12,13],[36,7,36,8]]}
[null,{"$f":"Main!$B$11","v":"Similkameen Valley Aquifer"}]
[null,{"$f":"CONCATENATE(\"Aquifer #\", Main!$B$12)","v":"Aquifer #259"}]
[]
[]
[null,"MODEL SENSITIVITY"]
[]
[null,null,"Units","JAN","FEB","MAR","APR","MAY","JUN","JUL","AUG","SEP","OCT","NOV","DEC"]
[null,"Simulated ΔhGW","m",{"$f":"'Water Budget'!D34","v":-0.10940118655038905},{"$f":"'Water Budget'!E34","v":-0.2304283466982463},{"$f":"'Water Budget'!F34","v":-7.5998631040106818E-2},{"$f":"'Water Budget'!G34","v":0.70211496892793601},{"$f":"'Water Budget'!H34","v":1.6766375572461512},{"$f":"'Water Budget'!I34","v":-0.38039324068764546},{"$f":"'Water Budget'!J34","v":-0.92615837991482608},{"$f":"'Water Budget'!K34","v":-0.54477528430819711},{"$f":"'Water Budget'!L34","v":-0.26696744510606185},{"$f":"'Water Budget'!M34","v":-6.2231964875571373E-2},{"$f":"'Water Budget'!N34","v":0.12580167426877092},{"$f":"'Water Budget'!O34","v":-0.19628057879142793}]
[]
[null,"Observed ΔhGW","m",{"$f":"'Lookup Tables'!C71-'Lookup Tables'!D71","v":0.10200000000000031},{"$f":"'Lookup Tables'!D71-'Lookup Tables'!E71","v":-0.1160000000000001},{"$f":"'Lookup Tables'!E71-'Lookup Tables'!F71","v":5.7999999999999829E-2},{"$f":"'Lookup Tables'!F71-'Lookup Tables'!G71","v":0.17700000000000005},{"$f":"'Lookup Tables'!G71-'Lookup Tables'!H71","v":0.49700000000000011},{"$f":"'Lookup Tables'!H71-'Lookup Tables'!I71","v":-8.5000000000000187E-2},{"$f":"'Lookup Tables'!I71-'Lookup Tables'!J71","v":-0.25199999999999978},{"$f":"'Lookup Tables'!J71-'Lookup Tables'!K71","v":-0.42799999999999994},{"$f":"'Lookup Tables'!K71-'Lookup Tables'!L71","v":-0.14800000000000013},{"$f":"'Lookup Tables'!L71-'Lookup Tables'!M71","v":1.5000000000000124E-2},{"$f":"'Lookup Tables'!M71-'Lookup Tables'!N71","v":0.18199999999999994},{"$f":"'Lookup Tables'!N71-'Lookup Tables'!O71","v":-2.0000000000002238E-3}]
{"$rows_left_out":30}
{"sheet":"Model Output","index":5,"n_rows":68,"n_cols":16,"rows_kept":68,"cut":false,"hidden":false,"merged":[[24,3,24,4],[24,5,24,7],[4,1,4,16],[23,5,23,7],[21,5,21,7],[22,5,22,7],[23,3,23,4],[21,3,21,4],[22,3,22,4]]}
[null,{"$f":"Main!$B$11","v":"Similkameen Valley Aquifer"}]
[null,{"$f":"CONCATENATE(\"Aquifer #\", Main!$B$12)","v":"Aquifer #259"}]
[]
[]
[null,"MODEL OUTPUT"]
[]
[null,"SYSTEM NET","Units","JAN","FEB","MAR","APR","MAY","JUN","JUL","AUG","SEP","OCT","NOV","DEC","ANNUAL TOTAL"]
[null,"Surplus/Deficit","m3",{"$f":"'Water Budget'!D33","v":-3431220.6076960117},{"$f":"'Water Budget'!E33","v":-7227074.1910479963},{"$f":"'Water Budget'!F33","v":-2383594.5221800059},{"$f":"'Water Budget'!G33","v":22020888.678824037},{"$f":"'Water Budget'!H33","v":52585474.796567798},{"$f":"'Water Budget'!I33","v":-11930520.752391934},{"$f":"'Water Budget'!J33","v":-29047707.976096004},{"$f":"'Water Budget'!K33","v":-17086141.759722002},{"$f":"'Water Budget'!L33","v":-8373073.7125959955},{"$f":"'Water Budget'!M33","v":-1951821.6124660075},{"$f":"'Water Budget'!N33","v":3945599.7767890096},{"$f":"'Water Budget'!O33","v":-6156075.5241850093},{"$f":"SUM(D8:O8)","v":-9035267.4062001221}]
[null,"Simulated Groundwater Level (Calibrated)","m bgl",{"$f":"'Lookup Tables'!C71-'Water Budget'!D34","v":2.7974011865503892},{"$f":"D9-'Water Budget'!E34","v":3.0278295332486356},{"$f":"E9-'Water Budget'!F34","v":3.1038281642887422},{"$f":"F9-'Water Budget'!G34","v":2.4017131953608062},{"$f":"G9-'Water Budget'!H34","v":0.72507563811465503},{"$f":"H9-'Water Budget'!I34","v":1.1054688788023004},{"$f":"I9-'Water Budget'!J34","v":2.0316272587171262},{"$f":"J9-'Water Budget'!K34","v":2.5764025430253232},{"$f":"K9-'Water Budget'!L34","v":2.8433699881313852},{"$f":"L9-'Water Budget'!M34","v":2.9056019530069568},{"$f":"M9-'Water Budget'!N34","v":2.7798002787381857},{"$f":"N9-'Water Budget'!O34","v":2.9760808575296136}]
[null,"Observed Groundwater Level (Well 75)","m bgl",{"$f":"'Lookup Tables'!D71","v":2.5859999999999999},{"$f":"'Lookup Tables'!E71","v":2.702},{"$f":"'Lookup Tables'!F71","v":2.6440000000000001},{"$f":"'Lookup Tables'!G71","v":2.4670000000000001},{"$f":"'Lookup Tables'!H71","v":1.97},{"$f":"'Lookup Tables'!I71","v":2.0550000000000002},{"$f":"'Lookup Tables'!J71","v":2.3069999999999999},{"$f":"'Lookup Tables'!K71","v":2.7349999999999999},{"$f":"'Lookup Tables'!L71","v":2.883},{"$f":"'Lookup Tables'!M71","v":2.8679999999999999},{"$f":"'Lookup Tables'!N71","v":2.6859999999999999},{"$f":"'Lookup Tables'!O71","v":2.6880000000000002}]
{"$rows_left_out":59}
{"sheet":"Definitions","index":6,"n_rows":58,"n_cols":12,"rows_kept":58,"cut":false,"hidden":false,"merged":[[13,11,13,19],[12,11,12,19],[22,11,22,19],[20,11,20,19],[19,11,19,19],[18,11,18,19],[17,11,17,19],[16,11,16,19],[15,11,15,19],[14,11,14,19],[23,11,23,19],[21,11,21,19],[31,11,31,19],[30,11,30,19],[29,11,29,19],[28,11,28,19],[27,11,27,19],[25,11,25,19],[24,11,24,19],[26,11,26,19],[4,1,4,9],[5,1,5,9],[7,1,7,9],[6,1,6,9],[8,1,8,9],[44,1,44,9],[11,1,11,9],[10,1,10,9],[29,1,29,9],[28,1,28,9],[27,1,27,9],[26,1,26,9],[25,1,25,9],[24,1,24,9],[23,1,23,9],[18,1,18,9],[17,1,17,9],[16,1,16,9],[15,1,15,9],[14,1,14,9],[13,1,13,9],[50,1,50,9],[48,1,48,9],[47,1,47,9],[34,1,34,9],[37,1,37,9],[38,1,38,9],[49,1,49,9],[46,1,46,9],[43,1,43,9],[42,1,42,9],[41,1,41,9],[40,1,40,9],[39,1,39,9],[36,1,36,9],[35,1,35,9],[45,1,45,9],[33,1,33,9],[4,11,4,19],[11,11,11,19],[10,11,10,19],[9,11,9,19],[8,11,8,19],[7,11,7,19],[6,11,6,19],[5,11,5,19],[30,1,30,9],[22,1,22,9],[21,1,21,9],[20,1,20,9],[31,1,31,9],[32,1,32,9],[12,1,12,9],[57,1,57,9],[56,1,56,9],[55,1,55,9],[54,1,54,9],[51,1,51,9],[53,1,53,9],[52,1,52,9]]}
[null,{"$f":"Main!$B$11","v":"Similkameen Valley Aquifer"}]
[null,{"$f":"CONCATENATE(\"Aquifer #\", Main!$B$12)","v":"Aquifer #259"}]
[]
[]
[null,"MODEL SCENARIO",null,null,null,null,null,null,null,null,null,"WATER BALANCE OUTPUTS"]
[null,"Normal: Represents 'average' conditions based on average data for the latest climate normal period (i.e., 1981-2010)."]
[null,"Dry: Represents 'dry' conditions based on data from 2001.",null,null,null,null,null,null,null,null,null,"Evaporation Direct from Similkameen River"]
[null,"Wet: Represents 'wet' conditions based on data from 1991.",null,null,null,null,null,null,null,null,null,"Annual Total Evaporation: Total annual evaporation for the current scenario (i.e., 'Normal', 'Dry', 'Wet', or 'Other'). Value is calculated based on Evaporation data entered on 'Input Data' tab. Included here for user reference only. Evaporation data included in the water budget is taken from the gridded climate dataset used within the AWDM (van der Gulik et al. 2013). "]
[null,"Other: Represents user-defined conditions based on data entered into 'Other' categories on 'Input Data' tab."]
[null,null,null,null,null,null,null,null,null,null,null,"Surface Water"]
{"$rows_left_out":49}
{"sheet":"Lookup Tables","index":7,"n_rows":100,"n_cols":32,"rows_kept":100,"cut":false,"hidden":false,"merged":[[85,2,86,2],[72,1,72,14],[4,1,4,14],[48,1,48,14],[7,16,7,29],[82,1,82,15]]}
[]
[null,"Number of Days in Month","JAN","FEB","MAR","APR","MAY","JUN","JUL","AUG","SEP","OCT","NOV","DEC","ANNUAL TOTAL",null,"Water Demand - Monthly Distribution","JAN","FEB","MAR","APR","MAY","JUN","JUL","AUG","SEP","OCT","NOV","DEC","ANNUAL TOTAL"]
[null,"Result to use for model run",31,28,31,30,31,30,31,31,30,31,30,31,{"$f":"SUM(C3:N3)","v":365},null,"ANNUAL",5.6000000000000001E-2,4.8000000000000001E-2,5.2999999999999999E-2,6.7000000000000004E-2,0.105,0.11,0.16300000000000001,0.14899999999999999,9.1999999999999998E-2,6.0999999999999999E-2,4.5999999999999999E-2,0.05,{"$f":"SUM(R3:AC3)","v":1}]
[null,null,null,null,null,null,null,null,null,null,null,null,null,null,null,null,"SEASONAL",0,0,0,0.01,0.08,0.21,0.28999999999999998,0.26,0.15,0,0,0,{"$f":"SUM(R4:AC4)","v":1}]
[null,"WATER BALANCE INPUTS",null,null,null,null,null,null,null,null,null,null,null,null,null,null,"OTHER"]
[null,null,null,null,null,null,null,null,null,null,null,null,null,null,null,null,"Other Demand",{"$f":"'Model Output'!D32/100","v":0},{"$f":"'Model Output'!E32/100","v":0},{"$f":"'Model Output'!F32/100","v":0},{"$f":"'Model Output'!G32/100","v":0},{"$f":"'Model Output'!H32/100","v":0},{"$f":"'Model Output'!I32/100","v":0},{"$f":"'Model Output'!J32/100","v":0},{"$f":"'Model Output'!K32/100","v":0},{"$f":"'Model Output'!L32/100","v":0},{"$f":"'Model Output'!M32/100","v":0},{"$f":"'Model Output'!N32/100","v":0},{"$f":"'Model Output'!O32/100","v":0},{"$f":"SUM(R6:AC6)","v":0}]
[null,"Precipitation Data (mm/month)","JAN","FEB","MAR","APR","MAY","JUN","JUL","AUG","SEP","OCT","NOV","DEC","ANNUAL TOTAL"]
[null,"NORMAL",{"$f":"'Input Data'!D8","v":39.700000000000003},{"$f":"'Input Data'!E8","v":20.5},{"$f":"'Input Data'!F8","v":16.5},{"$f":"'Input Data'!G8","v":18.399999999999999},{"$f":"'Input Data'!H8","v":29.6},{"$f":"'Input Data'!I8","v":37.6},{"$f":"'Input Data'!J8","v":29.6},{"$f":"'Input Data'!K8","v":24.3},{"$f":"'Input Data'!L8","v":23.8},{"$f":"'Input Data'!M8","v":26.1},{"$f":"'Input Data'!N8","v":44.5},{"$f":"'Input Data'!O8","v":36.4},{"$f":"'Input Data'!P8","v":347},null,"WATER BALANCE OUTPUTS"]
[null,"DRY",{"$f":"'Input Data'!D9","v":19.600000000000001},{"$f":"'Input Data'!E9","v":21.3},{"$f":"'Input Data'!F9","v":16.2},{"$f":"'Input Data'!G9","v":11.9},{"$f":"'Input Data'!H9","v":7.4},{"$f":"'Input Data'!I9","v":21.3},{"$f":"'Input Data'!J9","v":14.3},{"$f":"'Input Data'!K9","v":2.2000000000000002},{"$f":"'Input Data'!L9","v":6.8},{"$f":"'Input Data'!M9","v":15.9},{"$f":"'Input Data'!N9","v":26.4},{"$f":"'Input Data'!O9","v":26.3},{"$f":"'Input Data'!P9","v":189.60000000000002}]
[null,"WET",{"$f":"'Input Data'!D10","v":35.9},{"$f":"'Input Data'!E10","v":23.3},{"$f":"'Input Data'!F10","v":20.399999999999999},{"$f":"'Input Data'!G10","v":40.200000000000003},{"$f":"'Input Data'!H10","v":54.2},{"$f":"'Input Data'!I10","v":62.2},{"$f":"'Input Data'!J10","v":24},{"$f":"'Input Data'!K10","v":42.6},{"$f":"'Input Data'!L10","v":5.2},{"$f":"'Input Data'!M10","v":19},{"$f":"'Input Data'!N10","v":37.4},{"$f":"'Input Data'!O10","v":30.4},{"$f":"'Input Data'!P10","v":394.79999999999995},null,"Evaporation Data (mm/month)","JAN","FEB","MAR","APR","MAY","JUN","JUL","AUG","SEP","OCT","NOV","DEC","ANNUAL TOTAL"]
{"$rows_left_out":90}