{"text_format":"1","workbook":"xlsx","n_sheets":19,"sheets":["Title","Model Description","Analysis Dashboard","Groundwater Budget Report","User Specified Distributions","Hopington AB - Analysis","Fort Langley - Analysis","Beaver River - Analysis","West of Aldergrove - Analysis","S of Murrayville AC - Analysis","Salmon River - Analysis","Nicomekl Serpentine - Analysis","Assumption and Limitations","References","Form Control Selectors","Water Budget Distributions","Inflow Data","Outflow Data","Equivalent GW Change"],"not_rendered":{"charts":9,"images":8,"macros":1,"external_links":0,"defined_names":1,"comments":0,"pivot_tables":0},"unopened":[],"bounds":{"document_bytes":16777216,"sheet_cells":100000,"rows_first":2000,"rows_last":500,"rows_between":2000,"halvings":0,"cell_chars":16384,"cell_head_chars":4096},"cells_cut":0,"cells_raw":0,"read":"whole","date_system":"1900"}

{"sheet":"Title","index":0,"n_rows":18,"n_cols":11,"rows_kept":18,"cut":false,"hidden":false,"merged":[[19,10,19,11],[16,4,16,9],[19,4,19,9],[16,10,16,11],[17,10,17,11],[18,10,18,11]]}
[]
[null,"HOPINGTON - SALMON RIVER AREA GROUNDWATER BUDGET"]
[null,"Title Page"]
[]
[]
[]
[]
[]
[]
[]
[]
[]
[]
[]
[]
[]
[null,null,null,null,"VERSION CONTROL",null,null,null,null,null,"DATE"]
[null,null,null,null,"                       1544439 Hopington - Salmon River Area GW Budget  FINAL",null,null,null,null,null,"2016-06-16"]

{"sheet":"Model Description","index":1,"n_rows":3,"n_cols":2,"rows_kept":3,"cut":false,"hidden":false,"merged":[]}
[]
[null,"HOPINGTON - SALMON RIVER AREA GROUNDWATER BUDGET"]
[null,"Model Description"]

{"sheet":"Analysis Dashboard","index":2,"n_rows":175,"n_cols":16,"rows_kept":175,"cut":false,"hidden":false,"merged":[]}
[]
[]
[]
[]
[]
[]
[]
[]
[]
[]
[]
[]
[]
[]
[]
[]
[]
[]
[]
[]
[]
[]
[]
[]
[]
[]
[]
[]
[]
["TABULAR RESULTS"]
["INFLOW SOURCE / TYPE","JAN","FEB","MAR","APR","MAY","JUN","JUL","AUG","SEP","OCT","NOV","DEC","ANNUAL"]
[{"$f":"'Inflow Data'!Q13","v":"GW inflow from surrounding aquitards (m3)"},{"$f":"'Inflow Data'!R13","v":403062},{"$f":"'Inflow Data'!S13","v":364056},{"$f":"'Inflow Data'!T13","v":403062},{"$f":"'Inflow Data'!U13","v":390060},{"$f":"'Inflow Data'!V13","v":403062},{"$f":"'Inflow Data'!W13","v":390060},{"$f":"'Inflow Data'!X13","v":403062},{"$f":"'Inflow Data'!Y13","v":403062},{"$f":"'Inflow Data'!Z13","v":390060},{"$f":"'Inflow Data'!AA13","v":403062},{"$f":"'Inflow Data'!AB13","v":390060},{"$f":"'Inflow Data'!AC13","v":403062},{"$f":"'Inflow Data'!AD13","v":4745730}]
[{"$f":"'Inflow Data'!Q14","v":"GW inflow from Aldergrove CD (m3)"},{"$f":"'Inflow Data'!R14","v":60357},{"$f":"'Inflow Data'!S14","v":54516},{"$f":"'Inflow Data'!T14","v":60357},{"$f":"'Inflow Data'!U14","v":58410},{"$f":"'Inflow Data'!V14","v":60357},{"$f":"'Inflow Data'!W14","v":58410},{"$f":"'Inflow Data'!X14","v":60357},{"$f":"'Inflow Data'!Y14","v":60357},{"$f":"'Inflow Data'!Z14","v":58410},{"$f":"'Inflow Data'!AA14","v":60357},{"$f":"'Inflow Data'!AB14","v":58410},{"$f":"'Inflow Data'!AC14","v":60357},{"$f":"'Inflow Data'!AD14","v":710655}]
[{"$f":"'Inflow Data'!Q15","v":"GW inflow from Beaver River  (m3)"},{"$f":"'Inflow Data'!R15","v":112561},{"$f":"'Inflow Data'!S15","v":101668},{"$f":"'Inflow Data'!T15","v":112561},{"$f":"'Inflow Data'!U15","v":108930},{"$f":"'Inflow Data'!V15","v":112561},{"$f":"'Inflow Data'!W15","v":108930},{"$f":"'Inflow Data'!X15","v":112561},{"$f":"'Inflow Data'!Y15","v":112561},{"$f":"'Inflow Data'!Z15","v":108930},{"$f":"'Inflow Data'!AA15","v":112561},{"$f":"'Inflow Data'!AB15","v":108930},{"$f":"'Inflow Data'!AC15","v":112561},{"$f":"'Inflow Data'!AD15","v":1325315}]
[{"$f":"'Inflow Data'!Q16","v":"SW inflow to aquifer (m3) - Nicomekl R. / Bertrand Ck."},{"$f":"'Inflow Data'!R16","v":23792.5},{"$f":"'Inflow Data'!S16","v":21490},{"$f":"'Inflow Data'!T16","v":23792.5},{"$f":"'Inflow Data'!U16","v":23025},{"$f":"'Inflow Data'!V16","v":23792.5},{"$f":"'Inflow Data'!W16","v":23025},{"$f":"'Inflow Data'!X16","v":23792.5},{"$f":"'Inflow Data'!Y16","v":23792.5},{"$f":"'Inflow Data'!Z16","v":23025},{"$f":"'Inflow Data'!AA16","v":23792.5},{"$f":"'Inflow Data'!AB16","v":23025},{"$f":"'Inflow Data'!AC16","v":23792.5},{"$f":"'Inflow Data'!AD16","v":280137.5}]
[{"$f":"'Inflow Data'!Q17","v":"Recharge (m3)"},{"$f":"'Inflow Data'!R17","v":1945622.6077544768},{"$f":"'Inflow Data'!S17","v":1176467.0748115426},{"$f":"'Inflow Data'!T17","v":791397.8116823663},{"$f":"'Inflow Data'!U17","v":100816.20033359071},{"$f":"'Inflow Data'!V17","v":18199.649548243142},{"$f":"'Inflow Data'!W17","v":14881.256683102321},{"$f":"'Inflow Data'!X17","v":9732.3473648422696},{"$f":"'Inflow Data'!Y17","v":15571.755783747631},{"$f":"'Inflow Data'!Z17","v":181745.53942983842},{"$f":"'Inflow Data'!AA17","v":1055937.8792601577},{"$f":"'Inflow Data'!AB17","v":2041588.6556530478},{"$f":"'Inflow Data'!AC17","v":2104094.2216950441},{"$f":"'Inflow Data'!AD17","v":9456055}]
[{"$f":"'Inflow Data'!Q18","v":"SW inflow from Salmon River system (m3)"},{"$f":"'Inflow Data'!R18","v":27807},{"$f":"'Inflow Data'!S18","v":25116},{"$f":"'Inflow Data'!T18","v":27807},{"$f":"'Inflow Data'!U18","v":26910},{"$f":"'Inflow Data'!V18","v":27807},{"$f":"'Inflow Data'!W18","v":26910},{"$f":"'Inflow Data'!X18","v":27807},{"$f":"'Inflow Data'!Y18","v":27807},{"$f":"'Inflow Data'!Z18","v":26910},{"$f":"'Inflow Data'!AA18","v":27807},{"$f":"'Inflow Data'!AB18","v":26910},{"$f":"'Inflow Data'!AC18","v":27807},{"$f":"'Inflow Data'!AD18","v":327405}]
["TOTAL",{"$f":"SUM(B32:B37)","v":2573202.1077544768},{"$f":"SUM(C32:C37)","v":1743313.0748115426},1418977.3116823663,708151.20033359074,645779.14954824315,622216.25668310234,637311.84736484231,643151.25578374765,789080.53942983842,1683517.3792601577,2648923.6556530478,2731673.7216950441,16845297.5]
[]
["OUTFLOW SOURCE / TYPE","JAN","FEB","MAR","APR","MAY","JUN","JUL","AUG","SEP","OCT","NOV","DEC","ANNUAL"]
[{"$f":"'Outflow Data'!Q13","v":"GW outflow to surrounding aquitards (m3)"},{"$f":"'Outflow Data'!R13","v":419833},{"$f":"'Outflow Data'!S13","v":379204},{"$f":"'Outflow Data'!T13","v":419833},{"$f":"'Outflow Data'!U13","v":406290},{"$f":"'Outflow Data'!V13","v":419833},{"$f":"'Outflow Data'!W13","v":406290},{"$f":"'Outflow Data'!X13","v":419833},{"$f":"'Outflow Data'!Y13","v":419833},{"$f":"'Outflow Data'!Z13","v":406290},{"$f":"'Outflow Data'!AA13","v":419833},{"$f":"'Outflow Data'!AB13","v":406290},{"$f":"'Outflow Data'!AC13","v":419833},{"$f":"'Outflow Data'!AD13","v":4943195}]
[{"$f":"'Outflow Data'!Q14","v":"GW outflow to Aldergrove CD (m3)"},{"$f":"'Outflow Data'!R14","v":32705},{"$f":"'Outflow Data'!S14","v":29540},{"$f":"'Outflow Data'!T14","v":32705},{"$f":"'Outflow Data'!U14","v":31650},{"$f":"'Outflow Data'!V14","v":32705},{"$f":"'Outflow Data'!W14","v":31650},{"$f":"'Outflow Data'!X14","v":32705},{"$f":"'Outflow Data'!Y14","v":32705},{"$f":"'Outflow Data'!Z14","v":31650},{"$f":"'Outflow Data'!AA14","v":32705},{"$f":"'Outflow Data'!AB14","v":31650},{"$f":"'Outflow Data'!AC14","v":32705},{"$f":"'Outflow Data'!AD14","v":385075}]
[{"$f":"'Outflow Data'!Q15","v":"GW outflow to West of Aldergrove (m3)"},{"$f":"'Outflow Data'!R15","v":10478},{"$f":"'Outflow Data'!S15","v":9464},{"$f":"'Outflow Data'!T15","v":10478},{"$f":"'Outflow Data'!U15","v":10140},{"$f":"'Outflow Data'!V15","v":10478},{"$f":"'Outflow Data'!W15","v":10140},{"$f":"'Outflow Data'!X15","v":10478},{"$f":"'Outflow Data'!Y15","v":10478},{"$f":"'Outflow Data'!Z15","v":10140},{"$f":"'Outflow Data'!AA15","v":10478},{"$f":"'Outflow Data'!AB15","v":10140},{"$f":"'Outflow Data'!AC15","v":10478},{"$f":"'Outflow Data'!AD15","v":123370}]
[{"$f":"'Outflow Data'!Q16","v":"GW outflow from pumping - Private minor users (m3)"},{"$f":"'Outflow Data'!R16","v":131450.69236799999},{"$f":"'Outflow Data'!S16","v":128377.9842885},{"$f":"'Outflow Data'!T16","v":126947.3781765},{"$f":"'Outflow Data'!U16","v":135319.51899300001},{"$f":"'Outflow Data'!V16","v":157395.90345449996},{"$f":"'Outflow Data'!W16","v":163193.9849565},{"$f":"'Outflow Data'!X16","v":167052.4947105},{"$f":"'Outflow Data'!Y16","v":151159.35493499998},{"$f":"'Outflow Data'!Z16","v":153300.1056675},{"$f":"'Outflow Data'!AA16","v":136155.18554399998},{"$f":"'Outflow Data'!AB16","v":133682.57546099997},{"$f":"'Outflow Data'!AC16","v":135445.04092349997},{"$f":"'Outflow Data'!AD16","v":1719480.2194784998}]
[{"$f":"'Outflow Data'!Q17","v":"GW outflow to SW (m3) - Nicomekl R. / Bertrand Ck."},{"$f":"'Outflow Data'!R17","v":108979},{"$f":"'Outflow Data'!S17","v":90405.815353876867},{"$f":"'Outflow Data'!T17","v":89296.152690548668},{"$f":"'Outflow Data'!U17","v":80593.337999264491},{"$f":"'Outflow Data'!V17","v":73018.432042230066},{"$f":"'Outflow Data'!W17","v":69774.825754212245},{"$f":"'Outflow Data'!X17","v":72763.353620357098},{"$f":"'Outflow Data'!Y17","v":72223.043275743083},{"$f":"'Outflow Data'!Z17","v":69953.676872642871},{"$f":"'Outflow Data'!AA17","v":75653.035626182158},{"$f":"'Outflow Data'!AB17","v":86852.787852389272},{"$f":"'Outflow Data'!AC17","v":104129.2696453104},{"$f":"'Outflow Data'!AD17","v":993642.73073275725}]
[{"$f":"'Outflow Data'!Q18","v":"GW outflow to Salmon River System (m3)"},{"$f":"'Outflow Data'!R18","v":987707},{"$f":"'Outflow Data'!S18","v":784069.5969540946},{"$f":"'Outflow Data'!T18","v":780727.599041712},{"$f":"'Outflow Data'!U18","v":708435.18926677632},{"$f":"'Outflow Data'!V18","v":649026.04106895241},{"$f":"'Outflow Data'!W18","v":620903.59019317187},{"$f":"'Outflow Data'!X18","v":646962.22474652564},{"$f":"'Outflow Data'!Y18","v":642590.62286737585},{"$f":"'Outflow Data'!Z18","v":622350.65833320143},{"$f":"'Outflow Data'!AA18","v":670342.37915729196},{"$f":"'Outflow Data'!AB18","v":759079.8289875132},{"$f":"'Outflow Data'!AC18","v":900740.99985751137},{"$f":"'Outflow Data'!AD18","v":8772935.7304741256}]
[{"$f":"'Outflow Data'!Q19","v":""},{"$f":"'Outflow Data'!R19","v":""},{"$f":"'Outflow Data'!S19","v":""},{"$f":"'Outflow Data'!T19","v":""},{"$f":"'Outflow Data'!U19","v":""},{"$f":"'Outflow Data'!V19","v":""},{"$f":"'Outflow Data'!W19","v":""},{"$f":"'Outflow Data'!X19","v":""},{"$f":"'Outflow Data'!Y19","v":""},{"$f":"'Outflow Data'!Z19","v":""},{"$f":"'Outflow Data'!AA19","v":""},{"$f":"'Outflow Data'!AB19","v":""},{"$f":"'Outflow Data'!AC19","v":""},{"$f":"'Outflow Data'!AD19","v":""}]
[{"$f":"'Outflow Data'!Q20","v":""},{"$f":"'Outflow Data'!R20","v":""},{"$f":"'Outflow Data'!S20","v":""},{"$f":"'Outflow Data'!T20","v":""},{"$f":"'Outflow Data'!U20","v":""},{"$f":"'Outflow Data'!V20","v":""},{"$f":"'Outflow Data'!W20","v":""},{"$f":"'Outflow Data'!X20","v":""},{"$f":"'Outflow Data'!Y20","v":""},{"$f":"'Outflow Data'!Z20","v":""},{"$f":"'Outflow Data'!AA20","v":""},{"$f":"'Outflow Data'!AB20","v":""},{"$f":"'Outflow Data'!AC20","v":""},{"$f":"'Outflow Data'!AD20","v":""}]
[{"$f":"'Outflow Data'!Q21","v":""},{"$f":"'Outflow Data'!R21","v":""},{"$f":"'Outflow Data'!S21","v":""},{"$f":"'Outflow Data'!T21","v":""},{"$f":"'Outflow Data'!U21","v":""},{"$f":"'Outflow Data'!V21","v":""},{"$f":"'Outflow Data'!W21","v":""},{"$f":"'Outflow Data'!X21","v":""},{"$f":"'Outflow Data'!Y21","v":""},{"$f":"'Outflow Data'!Z21","v":""},{"$f":"'Outflow Data'!AA21","v":""},{"$f":"'Outflow Data'!AB21","v":""},{"$f":"'Outflow Data'!AC21","v":""},{"$f":"'Outflow Data'!AD21","v":""}]
[{"$f":"'Outflow Data'!Q22","v":""},{"$f":"'Outflow Data'!R22","v":""},{"$f":"'Outflow Data'!S22","v":""},{"$f":"'Outflow Data'!T22","v":""},{"$f":"'Outflow Data'!U22","v":""},{"$f":"'Outflow Data'!V22","v":""},{"$f":"'Outflow Data'!W22","v":""},{"$f":"'Outflow Data'!X22","v":""},{"$f":"'Outflow Data'!Y22","v":""},{"$f":"'Outflow Data'!Z22","v":""},{"$f":"'Outflow Data'!AA22","v":""},{"$f":"'Outflow Data'!AB22","v":""},{"$f":"'Outflow Data'!AC22","v":""},{"$f":"'Outflow Data'!AD22","v":""}]
[{"$f":"'Outflow Data'!Q23","v":""},{"$f":"'Outflow Data'!R23","v":""},{"$f":"'Outflow Data'!S23","v":""},{"$f":"'Outflow Data'!T23","v":""},{"$f":"'Outflow Data'!U23","v":""},{"$f":"'Outflow Data'!V23","v":""},{"$f":"'Outflow Data'!W23","v":""},{"$f":"'Outflow Data'!X23","v":""},{"$f":"'Outflow Data'!Y23","v":""},{"$f":"'Outflow Data'!Z23","v":""},{"$f":"'Outflow Data'!AA23","v":""},{"$f":"'Outflow Data'!AB23","v":""},{"$f":"'Outflow Data'!AC23","v":""},{"$f":"'Outflow Data'!AD23","v":""}]
["TOTAL",{"$f":"SUM(B41:B51)","v":1691152.692368},{"$f":"SUM(C41:C51)","v":1421061.3965964715},1459987.1299087605,1372428.0462590409,1342456.3765656825,1301952.4009038841,1349794.0730773828,1328989.0210781188,1293684.4408733444,1345166.6003274741,1427695.1923009024,1603331.3104263218,16937698.680685382]
[]
["SURPLUS/ DEFICIT (m3)",{"$f":"B38-B52","v":882049.41538647679},{"$f":"C38-C52","v":322251.67821507109},-41009.818226394244,-664276.84592545021,-696677.22701743932,-679736.14422078175,-712482.22571254044,-685837.76529437117,-504603.90144350601,338350.77893268364,1221228.4633521454,1128342.4112687223,-92401.180685382336]
[]
[{"$f":"'Equivalent GW Change'!Q13","v":"Equivalent GWL Change Across Aquifer (m) "},{"$f":"'Equivalent GW Change'!R13","v":0.36983203999432984},{"$f":"'Equivalent GW Change'!S13","v":0.13511600763734635},{"$f":"'Equivalent GW Change'!T13","v":-1.7194892338110793E-2},{"$f":"'Equivalent GW Change'!U13","v":-0.27852278655155144},{"$f":"'Equivalent GW Change'!V13","v":-0.2921078519989263},{"$f":"'Equivalent GW Change'!W13","v":-0.2850046726292586},{"$f":"'Equivalent GW Change'!X13","v":-0.29873468583335028},{"$f":"'Equivalent GW Change'!Y13","v":-0.28756300431629817},{"$f":"'Equivalent GW Change'!Z13","v":-0.21157396286939456},{"$f":"'Equivalent GW Change'!AA13","v":0.14186615468875624},{"$f":"'Equivalent GW Change'!AB13","v":0.51204547729649696},{"$f":"'Equivalent GW Change'!AC13","v":0.47309954350889821}]
[{"$f":"'Equivalent GW Change'!Q14","v":"Cumulative GWL Change Across Aquifer (m) "},{"$f":"'Equivalent GW Change'!R14","v":0.36983203999432984},{"$f":"'Equivalent GW Change'!S14","v":0.50494804763167622},{"$f":"'Equivalent GW Change'!T14","v":0.48775315529356544},{"$f":"'Equivalent GW Change'!U14","v":0.20923036874201401},{"$f":"'Equivalent GW Change'!V14","v":-8.2877483256912299E-2},{"$f":"'Equivalent GW Change'!W14","v":-0.3678821558861709},{"$f":"'Equivalent GW Change'!X14","v":-0.66661684171952118},{"$f":"'Equivalent GW Change'!Y14","v":-0.95417984603581929},{"$f":"'Equivalent GW Change'!Z14","v":-1.165753808905214},{"$f":"'Equivalent GW Change'!AA14","v":-1.0238876542164577},{"$f":"'Equivalent GW Change'!AB14","v":-0.5118421769199607},{"$f":"'Equivalent GW Change'!AC14","v":-3.8742633411062488E-2},{"$f":"'Equivalent GW Change'!AD14","v":""}]
[]
[]
[]
[]
[]
[]
[]
[]
[]
[]
[]
[]
[]
[]
[]
[]
[]
[]
[]
[]
[]
[]
[]
[]
[]
[]
[]
[]
[]
[]
[]
[]
[]
[]
[]
[]
[]
[]
[]
[]
[]
[]
[]
[]
[]
[]
[]
[]
[]
[]
[]
[]
[]
[]
[]
[]
[]
[]
[]
[]
[]
[]
[]
[]
[]
[]
[]
[]
[]
[]
[]
[]
[]
[]
[]
[]
[]
[]
[]
[]
[]
[]
[]
[]
[]
[]
[]
[]
[]
[]
[]
[]
[]
[]
[]
[]
[]
[]
[]
[]
[]
[]
[]
[]
[]
[]
[]
[]
[]
[]
[]
[]
[]
[]
[]
[]
[]
[null,null,null,"","JAN","FEB","MAR","APR","MAY","JUN","JUL","AUG","SEP","OCT","NOV","DEC"]

{"sheet":"Groundwater Budget Report","index":3,"n_rows":53,"n_cols":15,"rows_kept":53,"cut":false,"hidden":false,"merged":[[15,2,15,14],[16,2,16,14]]}
[]
[]
[]
[]
[]
[]
[]
[]
[]
[]
[]
[]
[]
[]
[]
[null,null,"GROUNDWATER BUDGET REPORT - HOPINGTON / SALMON RIVER AREA"]
[null,null,{"$f":"'Form Control Selectors'!B39","v":"HOPINGTON AB AQUIFER"}]
[]
[]
[]
[null,null,"MONTHLY GROUNDWATER LEVELS IN AQUIFER"]
[]
[]
[]
[]
[]
[]
[]
[]
[]
[]
[]
[]
[]
[]
[]
[]
[]
[null,null,"SUMMARY INFORMATION",null,null,null,null,null,null,"GROUNDWATER OUTFLOWS TO SALMON RIVER (WHERE APPLICABLE)"]
[]
[null,null,"TOTAL EST. INFLOWS TO AQUIFER:",null,null,{"$f":"'Analysis Dashboard'!N38","v":16845297.5},"m3 / YEAR",null,null,"BASE CASE* ANNUAL OUTFLOW TO SALMON R.",null,null,null,{"$f":"'Form Control Selectors'!C93","v":8705840.3212310113},"m3 / YEAR"]
[null,null,"TOTAL EST. OUTFLOWS FROM AQUIFER:",null,null,{"$f":"'Analysis Dashboard'!N52","v":16937698.680685382},"m3 / YEAR",null,null,"ANNUAL OUTFLOW TO SALMON R. (SCENARIO)",null,null,null,{"$f":"'Form Control Selectors'!E93","v":8772935.7304741256},"m3 / YEAR"]
[null,null,"TOTAL EST. WATER USE:",null,"MUNICIPAL",{"$f":"'Form Control Selectors'!E51","v":0},"m3 / YEAR"]
[null,null,null,null,"PRIVATE",{"$f":"'Form Control Selectors'!E61","v":1719480.2194784998},"m3 / YEAR",null,null,"GAIN/LOSS IN ANNUAL OUTFLOW",null,null,null,{"$f":"'Form Control Selectors'!E94","v":0.77069423246240376},"%"]
[null,null,"ALLOCATED WATER:",null,null,{"$f":"'Form Control Selectors'!B46","v":10000},{"$f":"'Form Control Selectors'!B47","v":"Input Units"}]
[null,null,null,null,null,null,null,null,null,"* BASE CASE IS AVERAGE HYDROLOGICAL YEAR, CURRENT DEMAND AND STORMWATER MANAGEMENT, NO CLIMATE CHANGE EFFECTS"]
[]
[null,null,"AQUIFER NAME",null,{"$f":"'Form Control Selectors'!B39","v":"HOPINGTON AB AQUIFER"},null,null,null,null,"AQUIFER AREA",null,null,{"$f":"'Form Control Selectors'!B44","v":23.85},"km2"]
[null,null,"HYDROLOGICAL SCENARIO",null,{"$f":"'Form Control Selectors'!B40","v":"AVERAGE YEAR"},null,null,null,null,"SPECIFIC YIELD/STORATIVITY",null,null,{"$f":"'Form Control Selectors'!B45","v":0.1},"(-)"]
[null,null,"MODIFYING SCENARIOS",null,{"$f":"'Form Control Selectors'!B41","v":"CURRENT DEMAND (2012)"}]
[null,null,null,null,{"$f":"'Form Control Selectors'!B42","v":"NO CLIMATE CHANGE IMPACTS"}]
[null,null,null,null,{"$f":"'Form Control Selectors'!B43","v":"CURRENT STORMWATER MANAGEMENT CONDITIONS"}]
[null,null,"*** USING WATER DEMAND DISTRIBUTIONS AND BASEFLOW ALLOCATION AS DEFINED IN INDIVIDUAL AQUIFER ANALYSIS SPREADSHEETS AND ASSUMPTIONS/LIMITATIONS AS DEFINED IN ASSOCIATED REPORT (GOLDER, 2016)."]

{"sheet":"User Specified Distributions","index":4,"n_rows":23,"n_cols":15,"rows_kept":23,"cut":false,"hidden":false,"merged":[]}
[]
[null,"HOPINGTON - SALMON RIVER AREA GROUNDWATER BUDGET"]
[null,"User-Specified Monthly Private Water Distributions"]
[]
[]
[]
[]
[]
[]
[]
[]
[]
[]
[]
[]
[]
[]
[]
[null,"JAN","FEB","MAR","APR","MAY","JUN","JUL","AUG","SEP","OCT","NOV","DEC",null,"TOTAL (MUST EQUAL 1.0 TO USE GOLDER, 2014 ESTIMATED WATER DEMAND)"]
["User-Specifed Distribution #1",0.01,0.02,0.05,0.1,0.1,0.125,0.125,0.125,0.125,0.1,0.1,0.02,null,{"$f":"SUM(B20:M20)","v":1}]
["User-Specifed Distribution #2",0.05,0.05,0.1,0.1,0.1,0.1,0.15,0.15,0.1,0.05,2.5000000000000001E-2,2.5000000000000001E-2,null,{"$f":"SUM(B21:M21)","v":1}]
["User-Specifed Distribution #3",0.02,0.04,0.06,0.08,0.1,0.15,0.2,0.15,0.1,0.06,0.03,0.01,null,1.0000000000000002]
["User-Specifed Distribution #4",0.05,0.06,7.0000000000000007E-2,0.08,0.09,0.1,0.12,0.13,0.11,0.08,7.0000000000000007E-2,0.04,null,1]

{"sheet":"Hopington AB - Analysis","index":5,"n_rows":156,"n_cols":31,"rows_kept":156,"cut":false,"hidden":false,"merged":[[14,11,14,12],[15,11,15,12],[16,11,16,12],[21,11,21,12],[10,11,10,12]]}
[]
[]
[]
[]
[]
[]
["AQUIFER - Hopington AB Aquifer"]
["TYPE - 4a, Unconfined glaciofluvial sand and gravel aquifer"]
["CLASSIFICATION - TBD"]
["RANKING - TBD"]
["AQUIFER SIZE - 23.85 km2",null,null,null,null,null,"ALLOCATED WATER USE",null,null,null,null,10000,null,"Input Units","User-Defined - Provided for accounting and reporting purposes and does not affect the moedl results directly"]
[]
["LOCATION",null,null,null,null,null,"AQUIFER PARAMETERS AND SELECTION"]
[]
[null,null,null,null,null,null,"Specific Yield",null,null,null,null,0.1,null,"(-)","Recommended value = 0.1"]
[null,null,null,null,null,null,"Aquifer Size - in Plan View",null,null,null,null,23.85,null,"km2","Recommended value = 23.85"]
[]
[]
[null,null,null,null,null,null,"Private Water Users Distribution Method"]
[]
[null,null,null,null,null,null,null,null,null,null,null,"USE SLIDER BAR TO ADJUST"]
[null,null,null,null,null,null,"Percent of Surplus/Deficit Apportioned to Baseflow",null,null,null,null,{"$f":"'Form Control Selectors'!H28","v":15},null,"%","Recommended value = 15%"]
[]
[]
[]
[]
[]
[]
[]
[]
[]
[]
[]
[]
[]
[]
[]
[]
[]
["*Golder interpretation of Township of Langley unconfined aquifers shown (Golder 2005, 2014)"]
[null,null,null,null,null,null,"                      ----- Average head fluctuation range for average conditions in provincial groundwater observation well (Well #354) installed in the Hopington AB aquifer (for calibration)"]
[]
[]
[]
["INFLOWS TO AQUIFER (AVERAGE YEAR - 1945-2012)",null,null,null,null,null,null,null,null,null,null,null,null,null,null,null,null,null,null,"Monthly Distributions"]
["INFLOW SOURCE / TYPE","JAN","FEB","MAR","APR","MAY","JUN","JUL","AUG","SEP","OCT","NOV","DEC","ANNUAL",null,"Flow per day to distribute",null,"Check",null,"JAN","FEB","MAR","APR","MAY","JUN","JUL","AUG","SEP","OCT","NOV","DEC"]
["GW inflow from surrounding aquitards (m3)",{"$f":"B$129*$P47","v":403062},364056,403062,390060,403062,390060,403062,403062,390060,403062,390060,403062,{"$f":"SUM(B47:M47)","v":4745730},null,13002,"m3/d",{"$f":"N47/365","v":13002}]
["GW inflow from Aldergrove CD (m3)",60357,54516,60357,58410,60357,58410,60357,60357,58410,60357,58410,60357,{"$f":"SUM(B48:M48)","v":710655},null,1947,"m3/d",{"$f":"N48/365","v":1947}]
["GW inflow from Beaver River  (m3)",112561,101668,112561,108930,112561,108930,112561,112561,108930,112561,108930,112561,1325315,null,3631,"m3/d",3631]
["SW inflow to aquifer (m3) - Nicomekl R. / Bertrand Ck.",23792.5,21490,23792.5,23025,23792.5,23025,23792.5,23792.5,23025,23792.5,23025,23792.5,{"$f":"SUM(B50:M50)","v":280137.5},null,767.5,"m3/d",767.5]
["Recharge (m3)",{"$f":"IF('Form Control Selectors'!$E$23=FALSE,(B$129*$P51)*(T51*(365/B$129)),(B$129*$P51)*(T51*(365/B$129))*1.09)","v":1945622.6077544768},{"$f":"IF('Form Control Selectors'!$E$23=FALSE,(C$129*$P51)*(U51*(365/C$129)),(C$129*$P51)*(U51*(365/C$129))*1.09)","v":1176467.0748115426},{"$f":"IF('Form Control Selectors'!$E$23=FALSE,(D$129*$P51)*(V51*(365/D$129)),(D$129*$P51)*(V51*(365/D$129))*1.09)","v":791397.8116823663},{"$f":"(E$129*$P51)*(W51*(365/E$129))","v":100816.20033359071},18199.649548243142,14881.256683102321,9732.3473648422696,15571.755783747631,181745.53942983842,{"$f":"IF('Form Control Selectors'!$E$23=FALSE,(K$129*$P51)*(AC51*(365/K$129)),(K$129*$P51)*(AC51*(365/K$129))*1.09)","v":1055937.8792601577},{"$f":"IF('Form Control Selectors'!$E$23=FALSE,(L$129*$P51)*(AD51*(365/L$129)),(L$129*$P51)*(AD51*(365/L$129))*1.09)","v":2041588.6556530478},{"$f":"IF('Form Control Selectors'!$E$23=FALSE,(M$129*$P51)*(AE51*(365/M$129)),(M$129*$P51)*(AE51*(365/M$129))*1.09)","v":2104094.2216950441},9456055,null,{"$f":"IF('Form Control Selectors'!F23=FALSE,25907,25907*0.99)","v":25907},"m3/d",25907,null,0.20575415516877568,0.12441415313379021,8.3692175191701648E-2,1.0661549698430341E-2,1.9246556358061735E-3,1.5737278054222743E-3,1.0292185657594282E-3,1.6467497052150852E-3,1.9220017166761236E-2,0.11166790794471455,0.21590278986882455,0.22251290011479888]
["SW inflow from Salmon River system (m3)",{"$f":"B$129*$P52","v":27807},25116,27807,26910,27807,26910,27807,27807,26910,27807,26910,27807,{"$f":"SUM(B52:M52)","v":327405},null,897,"m3/d",897]
[]
["TOTAL",{"$f":"SUM(B47:B53)","v":2573202.1077544768},{"$f":"SUM(C47:C53)","v":1743313.0748115426},1418977.3116823663,708151.20033359074,645779.14954824315,622216.25668310234,637311.84736484231,643151.25578374765,789080.53942983842,1683517.3792601577,2648923.6556530478,2731673.7216950441,16845297.5]
[]
["OUTFLOWS FROM AQUIFER (AVERAGE YEAR, 1945-2012)",null,null,null,null,null,null,null,null,null,null,null,null,null,null,null,null,null,null,"Monthly Distributions"]
["OUTFLOW SOURCE / TYPE","JAN","FEB","MAR","APR","MAY","JUN","JUL","AUG","SEP","OCT","NOV","DEC","ANNUAL",null,"Flow per day to distribute",null,"Check",null,"JAN","FEB","MAR","APR","MAY","JUN","JUL","AUG","SEP","OCT","NOV","DEC"]
["GW outflow to surrounding aquitards (m3)",{"$f":"B$129*$P58","v":419833},379204,419833,406290,419833,406290,419833,419833,406290,419833,406290,419833,{"$f":"SUM(B58:M58)","v":4943195},null,13543,"m3/d",{"$f":"N58/365","v":13543}]
["GW outflow to Aldergrove CD (m3)",32705,29540,32705,31650,32705,31650,32705,32705,31650,32705,31650,32705,{"$f":"SUM(B59:M59)","v":385075},null,1055,"m3/d",{"$f":"N59/365","v":1055}]
["GW outflow to West of Aldergrove (m3)",10478,9464,10478,10140,10478,10140,10478,10478,10140,10478,10140,10478,123370,null,338,"m3/d",338]
["GW outflow from pumping - Private minor users (m3)",{"$f":"(B$129*$P61)*(T61*(365/B$129))","v":131450.69236799999},{"$f":"(C$129*$P61)*(U61*(365/C$129))","v":128377.9842885},{"$f":"(D$129*$P61)*(V61*(365/D$129))","v":126947.3781765},{"$f":"(E$129*$P61)*(W61*(365/E$129))","v":135319.51899300001},{"$f":"(F$129*$P61)*(X61*(365/F$129))","v":157395.90345449996},{"$f":"(G$129*$P61)*(Y61*(365/G$129))","v":163193.9849565},{"$f":"(H$129*$P61)*(Z61*(365/H$129))","v":167052.4947105},{"$f":"(I$129*$P61)*(AA61*(365/I$129))","v":151159.35493499998},{"$f":"(J$129*$P61)*(AB61*(365/J$129))","v":153300.1056675},{"$f":"(K$129*$P61)*(AC61*(365/K$129))","v":136155.18554399998},{"$f":"(L$129*$P61)*(AD61*(365/L$129))","v":133682.57546099997},{"$f":"(M$129*$P61)*(AE61*(365/M$129))","v":135445.04092349997},1719480.2194784998,null,{"$f":"4710.9*'Form Control Selectors'!H43","v":4710.8999999999996},"m3/d",4710.9047108999994,null,{"$f":"VLOOKUP('Form Control Selectors'!$H$23,'Water Budget Distributions'!$B$16:$N$22,2,FALSE)","v":7.6448000000000002E-2},{"$f":"VLOOKUP('Form Control Selectors'!$H$23,'Water Budget Distributions'!$B$16:$N$22,3,FALSE)","v":7.4661000000000005E-2},{"$f":"VLOOKUP('Form Control Selectors'!$H$23,'Water Budget Distributions'!$B$16:$N$22,4,FALSE)","v":7.3829000000000006E-2},{"$f":"VLOOKUP('Form Control Selectors'!$H$23,'Water Budget Distributions'!$B$16:$N$22,5,FALSE)","v":7.8698000000000004E-2},{"$f":"VLOOKUP('Form Control Selectors'!$H$23,'Water Budget Distributions'!$B$16:$N$22,6,FALSE)","v":9.1536999999999993E-2},{"$f":"VLOOKUP('Form Control Selectors'!$H$23,'Water Budget Distributions'!$B$16:$N$22,7,FALSE)","v":9.4908999999999993E-2},{"$f":"VLOOKUP('Form Control Selectors'!$H$23,'Water Budget Distributions'!$B$16:$N$22,8,FALSE)","v":9.7153000000000003E-2},{"$f":"VLOOKUP('Form Control Selectors'!$H$23,'Water Budget Distributions'!$B$16:$N$22,9,FALSE)","v":8.7910000000000002E-2},{"$f":"VLOOKUP('Form Control Selectors'!$H$23,'Water Budget Distributions'!$B$16:$N$22,10,FALSE)","v":8.9154999999999998E-2},{"$f":"VLOOKUP('Form Control Selectors'!$H$23,'Water Budget Distributions'!$B$16:$N$22,11,FALSE)","v":7.9184000000000004E-2},{"$f":"VLOOKUP('Form Control Selectors'!$H$23,'Water Budget Distributions'!$B$16:$N$22,12,FALSE)","v":7.7745999999999996E-2},{"$f":"VLOOKUP('Form Control Selectors'!$H$23,'Water Budget Distributions'!$B$16:$N$22,13,FALSE)","v":7.8770999999999994E-2}]
["GW outflow to SW (m3) - Nicomekl R. / Bertrand Ck.",{"$f":"B$129*$P62+25000","v":108979},{"$f":"C$129*$P62+(0.11*(B66*'Form Control Selectors'!$H$29))","v":90405.815353876867},{"$f":"D$129*$P62+(0.11*(C66*'Form Control Selectors'!$H$29))","v":89296.152690548668},{"$f":"E$129*$P62+(0.11*(D66*'Form Control Selectors'!$H$29))","v":80593.337999264491},{"$f":"F$129*$P62+(0.11*(E66*'Form Control Selectors'!$H$29))","v":73018.432042230066},{"$f":"G$129*$P62+(0.11*(F66*'Form Control Selectors'!$H$29))","v":69774.825754212245},{"$f":"H$129*$P62+(0.11*(G66*'Form Control Selectors'!$H$29))","v":72763.353620357098},{"$f":"I$129*$P62+(0.11*(H66*'Form Control Selectors'!$H$29))","v":72223.043275743083},{"$f":"J$129*$P62+(0.11*(I66*'Form Control Selectors'!$H$29))","v":69953.676872642871},{"$f":"K$129*$P62+(0.11*(J66*'Form Control Selectors'!$H$29))","v":75653.035626182158},{"$f":"L$129*$P62+(0.11*(K66*'Form Control Selectors'!$H$29))","v":86852.787852389272},{"$f":"M$129*$P62+(0.11*(L66*'Form Control Selectors'!$H$29))","v":104129.2696453104},993642.73073275725,null,2709,"m3/d",2722.3088513226226]
["GW outflow to Salmon River System (m3)",{"$f":"B$129*$P63+(250000)","v":987707},{"$f":"C$129*$P63+(0.89*('Form Control Selectors'!$H$29*B66))","v":784069.5969540946},{"$f":"D$129*$P63+(0.89*('Form Control Selectors'!$H$29*C66))","v":780727.599041712},{"$f":"E$129*$P63+(0.89*('Form Control Selectors'!$H$29*D66))","v":708435.18926677632},{"$f":"F$129*$P63+(0.89*('Form Control Selectors'!$H$29*E66))","v":649026.04106895241},{"$f":"G$129*$P63+(0.89*('Form Control Selectors'!$H$29*F66))","v":620903.59019317187},{"$f":"H$129*$P63+(0.89*('Form Control Selectors'!$H$29*G66))","v":646962.22474652564},{"$f":"I$129*$P63+(0.89*('Form Control Selectors'!$H$29*H66))","v":642590.62286737585},{"$f":"J$129*$P63+(0.89*('Form Control Selectors'!$H$29*I66))","v":622350.65833320143},{"$f":"K$129*$P63+(0.89*('Form Control Selectors'!$H$29*J66))","v":670342.37915729196},{"$f":"L$129*$P63+(0.89*('Form Control Selectors'!$H$29*K66))","v":759079.8289875132},{"$f":"M$129*$P63+(0.89*('Form Control Selectors'!$H$29*L66))","v":900740.99985751137},8772935.7304741256,null,23797,"m3/d",24035.440357463358]
["TOTAL",{"$f":"SUM(B58:B63)","v":1691152.692368},{"$f":"SUM(C58:C63)","v":1421061.3965964715},1459987.1299087605,1372428.0462590409,1342456.3765656825,1301952.4009038841,1349794.0730773828,1328989.0210781188,1293684.4408733444,1345166.6003274741,1427695.1923009024,1603331.3104263218,16937698.680685382]
[]
["SURPLUS/ DEFICIT (m3)",{"$f":"B54-B64","v":882049.41538647679},{"$f":"C54-C64","v":322251.67821507109},-41009.818226394244,-664276.84592545021,-696677.22701743932,-679736.14422078175,-712482.22571254044,-685837.76529437117,-504603.90144350601,338350.77893268364,1221228.4633521454,1128342.4112687223,-92401.180685382336]
[]
["Equivalent GWL Change Across Aquifer (m) ",{"$f":"(B66/($L$16*1000000))/$L$15","v":0.36983203999432984},{"$f":"(C66/($L$16*1000000))/$L$15","v":0.13511600763734635},-1.7194892338110793E-2,-0.27852278655155144,-0.2921078519989263,-0.2850046726292586,-0.29873468583335028,-0.28756300431629817,-0.21157396286939456,0.14186615468875624,0.51204547729649696,0.47309954350889821,-3.8742633411061773E-2]
["Cumulative GWL Change Across Aquifer (m) ",{"$f":"B68","v":0.36983203999432984},{"$f":"C68+B69","v":0.50494804763167622},{"$f":"D68+C69","v":0.48775315529356544},0.20923036874201401,-8.2877483256912299E-2,-0.3678821558861709,-0.66661684171952118,-0.95417984603581929,-1.165753808905214,-1.0238876542164577,-0.5118421769199607,-3.8742633411062488E-2]
[]
["INFLOWS TO AQUIFER (DRY YEAR - 1951)",null,null,null,null,null,null,null,null,null,null,null,null,null,null,null,null,null,null,"Monthly Distributions"]
["INFLOW SOURCE / TYPE","JAN","FEB","MAR","APR","MAY","JUN","JUL","AUG","SEP","OCT","NOV","DEC","ANNUAL",null,"Flow per day to distribute",null,"Check",null,"JAN","FEB","MAR","APR","MAY","JUN","JUL","AUG","SEP","OCT","NOV","DEC"]
["GW inflow from surrounding aquitards (m3)",{"$f":"B$129*$P73","v":403062},364056,403062,390060,403062,390060,403062,403062,390060,403062,390060,403062,{"$f":"SUM(B73:M73)","v":4745730},null,13002,"m3/d",{"$f":"N73/365","v":13002}]
["GW inflow from Aldergrove CD (m3)",60357,54516,60357,58410,60357,58410,60357,60357,58410,60357,58410,60357,{"$f":"SUM(B74:M74)","v":710655},null,1947,"m3/d",{"$f":"N74/365","v":1947}]
["GW inflow from Beaver River  (m3)",112561,101668,112561,108930,112561,108930,112561,112561,108930,112561,108930,112561,1325315,null,3631,"m3/d",3631]
["SW inflow to aquifer (m3) - Nicomekl R. / Bertrand Ck.",23792.5,21490,23792.5,23025,23792.5,23025,23792.5,23792.5,23025,23792.5,23025,23792.5,280137.5,null,767.5,"m3/d",767.5]
["Recharge (m3)",{"$f":"IF('Form Control Selectors'!$E$23=FALSE,(B$129*$P77)*(T77*(365/B$129)),(B$129*$P77)*(T77*(365/B$129))*1.09)","v":768322.21263344632},{"$f":"IF('Form Control Selectors'!$E$23=FALSE,(C$129*$P77)*(U77*(365/C$129)),(C$129*$P77)*(U77*(365/C$129))*1.09)","v":470303.11417869717},{"$f":"IF('Form Control Selectors'!$E$23=FALSE,(D$129*$P77)*(V77*(365/D$129)),(D$129*$P77)*(V77*(365/D$129))*1.09)","v":257710.95831261843},{"$f":"(E$129*$P77)*(W77*(365/E$129))","v":0},{"$f":"(F$129*$P77)*(X77*(365/F$129))","v":0},{"$f":"(G$129*$P77)*(Y77*(365/G$129))","v":0},{"$f":"(H$129*$P77)*(Z77*(365/H$129))","v":0},{"$f":"(I$129*$P77)*(AA77*(365/I$129))","v":0},{"$f":"(J$129*$P77)*(AB77*(365/J$129))","v":0},{"$f":"(K$129*$P77)*(AC77*(365/K$129))","v":0},{"$f":"(L$129*$P77)*(AD77*(365/L$129))","v":0},{"$f":"IF('Form Control Selectors'!$E$23=FALSE,(M$129*$P77)*(AE77*(365/M$129)),(M$129*$P77)*(AE77*(365/M$129))*1.09)","v":1508708.7148752378},3005045,null,{"$f":"IF('Form Control Selectors'!F23=FALSE,8233,8233*0.99)","v":8233},"m3/d",8233,null,0.25567743998291087,0.15650451629799125,8.5759433989380685E-2,0,0,0,0,0,0,0,0,0.50205860972971716]
["SW inflow from Salmon River system (m3)",{"$f":"B$129*$P78","v":27807},25116,27807,26910,27807,26910,27807,27807,26910,27807,26910,27807,327405,null,897,"m3/d",897]
[]
["TOTAL",{"$f":"SUM(B73:B79)","v":1395901.7126334463},{"$f":"SUM(C73:C79)","v":1037149.1141786971},885290.45831261843,607335,627579.5,607335,627579.5,627579.5,607335,627579.5,607335,2136288.214875238,10394287.5]
[]
["OUTFLOWS FROM AQUIFER (DRY YEAR - 1951)",null,null,null,null,null,null,null,null,null,null,null,null,null,null,null,null,null,null,"Monthly Distributions"]
["OUTFLOW SOURCE / TYPE","JAN","FEB","MAR","APR","MAY","JUN","JUL","AUG","SEP","OCT","NOV","DEC","ANNUAL",null,"Flow per day to distribute",null,"Check",null,"JAN","FEB","MAR","APR","MAY","JUN","JUL","AUG","SEP","OCT","NOV","DEC"]
["GW outflow to surrounding aquitards (m3)",{"$f":"B$129*$P84","v":419833},379204,419833,406290,419833,406290,419833,419833,406290,419833,406290,419833,{"$f":"SUM(B84:M84)","v":4943195},null,13543,"m3/d",{"$f":"N84/365","v":13543}]
["GW outflow to Aldergrove CD (m3)",32705,29540,32705,31650,32705,31650,32705,32705,31650,32705,31650,32705,385075,null,1055,"m3/d",{"$f":"N85/365","v":1055}]
["GW outflow to West of Aldergrove (m3)",10478,9464,10478,10140,10478,10140,10478,10478,10140,10478,10140,10478,123370,null,338,"m3/d",338]
["GW outflow from pumping - Private minor users (m3)",{"$f":"(B$129*$P87)*(T87*(365/B$129))","v":131450.69236799999},{"$f":"(C$129*$P87)*(U87*(365/C$129))","v":128377.9842885},{"$f":"(D$129*$P87)*(V87*(365/D$129))","v":126947.3781765},{"$f":"(E$129*$P87)*(W87*(365/E$129))","v":135319.51899300001},{"$f":"(F$129*$P87)*(X87*(365/F$129))","v":157395.90345449996},{"$f":"(G$129*$P87)*(Y87*(365/G$129))","v":163193.9849565},{"$f":"(H$129*$P87)*(Z87*(365/H$129))","v":167052.4947105},{"$f":"(I$129*$P87)*(AA87*(365/I$129))","v":151159.35493499998},{"$f":"(J$129*$P87)*(AB87*(365/J$129))","v":153300.1056675},{"$f":"(K$129*$P87)*(AC87*(365/K$129))","v":136155.18554399998},{"$f":"(L$129*$P87)*(AD87*(365/L$129))","v":133682.57546099997},{"$f":"(M$129*$P87)*(AE87*(365/M$129))","v":135445.04092349997},1719480.2194784998,null,{"$f":"4710.9*'Form Control Selectors'!H43","v":4710.8999999999996},"m3/d",4710.9047108999994,null,{"$f":"VLOOKUP('Form Control Selectors'!$H$23,'Water Budget Distributions'!$B$16:$N$22,2,FALSE)","v":7.6448000000000002E-2},{"$f":"VLOOKUP('Form Control Selectors'!$H$23,'Water Budget Distributions'!$B$16:$N$22,3,FALSE)","v":7.4661000000000005E-2},{"$f":"VLOOKUP('Form Control Selectors'!$H$23,'Water Budget Distributions'!$B$16:$N$22,4,FALSE)","v":7.3829000000000006E-2},{"$f":"VLOOKUP('Form Control Selectors'!$H$23,'Water Budget Distributions'!$B$16:$N$22,5,FALSE)","v":7.8698000000000004E-2},{"$f":"VLOOKUP('Form Control Selectors'!$H$23,'Water Budget Distributions'!$B$16:$N$22,6,FALSE)","v":9.1536999999999993E-2},{"$f":"VLOOKUP('Form Control Selectors'!$H$23,'Water Budget Distributions'!$B$16:$N$22,7,FALSE)","v":9.4908999999999993E-2},{"$f":"VLOOKUP('Form Control Selectors'!$H$23,'Water Budget Distributions'!$B$16:$N$22,8,FALSE)","v":9.7153000000000003E-2},{"$f":"VLOOKUP('Form Control Selectors'!$H$23,'Water Budget Distributions'!$B$16:$N$22,9,FALSE)","v":8.7910000000000002E-2},{"$f":"VLOOKUP('Form Control Selectors'!$H$23,'Water Budget Distributions'!$B$16:$N$22,10,FALSE)","v":8.9154999999999998E-2},{"$f":"VLOOKUP('Form Control Selectors'!$H$23,'Water Budget Distributions'!$B$16:$N$22,11,FALSE)","v":7.9184000000000004E-2},{"$f":"VLOOKUP('Form Control Selectors'!$H$23,'Water Budget Distributions'!$B$16:$N$22,12,FALSE)","v":7.7745999999999996E-2},{"$f":"VLOOKUP('Form Control Selectors'!$H$23,'Water Budget Distributions'!$B$16:$N$22,13,FALSE)","v":7.8770999999999994E-2}]
["GW outflow to SW (m3) - Nicomekl R. / Bertrand Ck.",{"$f":"B$129*$P88+21000","v":104979},{"$f":"C$129*$P88+(0.11*(B92*'Form Control Selectors'!$H$29))","v":71623.858834379862},{"$f":"D$129*$P88+(0.11*(C92*'Form Control Selectors'!$H$29))","v":80461.740818031263},{"$f":"E$129*$P88+(0.11*(D92*'Form Control Selectors'!$H$29))","v":73112.666699541267},{"$f":"F$129*$P88+(0.11*(E92*'Form Control Selectors'!$H$29))","v":72477.065431684314},{"$f":"G$129*$P88+(0.11*(F92*'Form Control Selectors'!$H$29))","v":69555.736528248104},{"$f":"H$129*$P88+(0.11*(G92*'Form Control Selectors'!$H$29))","v":72550.676268980533},{"$f":"I$129*$P88+(0.11*(H92*'Form Control Selectors'!$H$29))","v":72094.361146929674},{"$f":"J$129*$P88+(0.11*(I92*'Form Control Selectors'!$H$29))","v":69716.045221533044},{"$f":"K$129*$P88+(0.11*(J92*'Form Control Selectors'!$H$29))","v":72689.878973256287},{"$f":"L$129*$P88+(0.11*(K92*'Form Control Selectors'!$H$29))","v":69874.286342535561},{"$f":"M$129*$P88+(0.11*(L92*'Form Control Selectors'!$H$29))","v":72989.832053513164},902125.14831863309,null,2709,"m3/d",2471.575748818173]
["GW outflow to Salmon River System (m3)",{"$f":"B$129*$P89+215000","v":952707},{"$f":"C$129*$P89+(0.89*(B92*'Form Control Selectors'!$H$29))","v":632106.49420543713},{"$f":"D$129*$P89+(0.89*(C92*'Form Control Selectors'!$H$29))","v":709249.17570952571},{"$f":"E$129*$P89+(0.89*(D92*'Form Control Selectors'!$H$29))","v":647909.75784174295},{"$f":"F$129*$P89+(0.89*(E92*'Form Control Selectors'!$H$29))","v":644645.89303817297},{"$f":"G$129*$P89+(0.89*(F92*'Form Control Selectors'!$H$29))","v":619130.95918309828},{"$f":"H$129*$P89+(0.89*(G92*'Form Control Selectors'!$H$29))","v":645241.47163084254},{"$f":"I$129*$P89+(0.89*(H92*'Form Control Selectors'!$H$29))","v":641549.46746152185},{"$f":"J$129*$P89+(0.89*(I92*'Form Control Selectors'!$H$29))","v":620428.00224694924},{"$f":"K$129*$P89+(0.89*(J92*'Form Control Selectors'!$H$29))","v":646367.74805634632},{"$f":"L$129*$P89+(0.89*(K92*'Form Control Selectors'!$H$29))","v":621708.31677142403},{"$f":"M$129*$P89+(0.89*(L92*'Form Control Selectors'!$H$29))","v":648794.64116024296},8029838.9273053044,null,23797,"m3/d",21999.558704946041]
["TOTAL",{"$f":"SUM(B84:B89)","v":1652152.692368},{"$f":"SUM(C84:C89)","v":1250316.3373283171},1379674.2947040568,1304421.9435342844,1337534.8619243572,1299960.6806678465,1347860.6426103231,1327819.1835434516,1291524.1531359823,1318228.8125736027,1273345.1785749595,1320245.514137256,16103084.295102438]
[]
["SURPLUS/ DEFICIT (m3)",{"$f":"B80-B90","v":-256250.97973455372},{"$f":"C80-C90","v":-213167.22314962},-494383.83639143838,-697086.94353428436,-709955.36192435725,-692625.68066784646,-720281.14261032315,-700239.6835434516,-684189.15313598234,-690649.31257360266,-666010.17857495951,816042.70073798206,-5708796.795102438]
[]
["Equivalent GWL Change Across Aquifer (m) ",{"$f":"(B92/($L$16*1000000))/$L$15","v":-0.10744275879855501},{"$f":"(C92/($L$16*1000000))/$L$15","v":-8.9378290628771492E-2},-0.20728882028991125,-0.29227964089487812,-0.29767520416115606,-0.29040909042676999,-0.30200467195401387,-0.29360154446266312,-0.28687176232116657,-0.2895804245591625,-0.27924955076518221,0.34215626865324189,-2.3936254906089887]
["Cumulative GWL Change Across Aquifer (m) ",{"$f":"B94","v":-0.10744275879855501},{"$f":"C94+B95","v":-0.19682104942732651},{"$f":"D94+C95","v":-0.40410986971723772},{"$f":"E94+D95","v":-0.69638951061211585},{"$f":"F94+E95","v":-0.99406471477327196},{"$f":"G94+F95","v":-1.284473805200042},{"$f":"H94+G95","v":-1.5864784771540559},{"$f":"I94+H95","v":-1.8800800216167191},{"$f":"J94+I95","v":-2.1669517839378858},{"$f":"K94+J95","v":-2.4565322084970482},{"$f":"L94+K95","v":-2.7357817592622302},{"$f":"M94+L95","v":-2.3936254906089882}]
[]
["INFLOWS TO AQUIFER (WET YEAR - 1971)",null,null,null,null,null,null,null,null,null,null,null,null,null,null,null,null,null,null,"Monthly Distributions"]
["INFLOW SOURCE / TYPE","JAN","FEB","MAR","APR","MAY","JUN","JUL","AUG","SEP","OCT","NOV","DEC","ANNUAL",null,"Flow per day to distribute",null,"Check",null,"JAN","FEB","MAR","APR","MAY","JUN","JUL","AUG","SEP","OCT","NOV","DEC"]
["GW inflow from surrounding aquitards (m3)",{"$f":"B$129*$P99","v":403062},364056,403062,390060,403062,390060,403062,403062,390060,403062,390060,403062,{"$f":"SUM(B99:M99)","v":4745730},null,13002,"m3/d",{"$f":"N99/365","v":13002}]
["GW inflow from Aldergrove CD (m3)",60357,54516,60357,58410,60357,58410,60357,60357,58410,60357,58410,60357,{"$f":"SUM(B100:M100)","v":710655},null,1947,"m3/d",{"$f":"N100/365","v":1947}]
["GW inflow from Beaver River  (m3)",112561,101668,112561,108930,112561,108930,112561,112561,108930,112561,108930,112561,1325315,null,3631,"m3/d",3631]
["SW inflow to aquifer (m3) - Nicomekl R. / Bertrand Ck.",23792.5,21490,23792.5,23025,23792.5,23025,23792.5,23792.5,23025,23792.5,23025,23792.5,280137.5,null,767.5,"m3/d",767.5]
["Recharge (m3)",{"$f":"IF('Form Control Selectors'!$E$23=FALSE,(B$129*$P103)*(T103*(365/B$129)),(B$129*$P103)*(T103*(365/B$129))*1.09)","v":3795035.1009453936},{"$f":"IF('Form Control Selectors'!$E$23=FALSE,(C$129*$P103)*(U103*(365/C$129)),(C$129*$P103)*(U103*(365/C$129))*1.09)","v":1427066.0348742951},{"$f":"IF('Form Control Selectors'!$E$23=FALSE,(D$129*$P103)*(V103*(365/D$129)),(D$129*$P103)*(V103*(365/D$129))*1.09)","v":1449179.6572550309},{"$f":"(E$129*$P103)*(W103*(365/E$129))","v":0},{"$f":"(F$129*$P103)*(X103*(365/F$129))","v":0},{"$f":"(G$129*$P103)*(Y103*(365/G$129))","v":0},{"$f":"(H$129*$P103)*(Z103*(365/H$129))","v":0},{"$f":"(I$129*$P103)*(AA103*(365/I$129))","v":0},{"$f":"(J$129*$P103)*(AB103*(365/J$129))","v":326558.56496446166},{"$f":"IF('Form Control Selectors'!$E$23=FALSE,(K$129*$P103)*(AC103*(365/K$129)),(K$129*$P103)*(AC103*(365/K$129))*1.09)","v":1758965.1347182472},{"$f":"IF('Form Control Selectors'!$E$23=FALSE,(L$129*$P103)*(AD103*(365/L$129)),(L$129*$P103)*(AD103*(365/L$129))*1.09)","v":3284327.9478481691},{"$f":"IF('Form Control Selectors'!$E$23=FALSE,(M$129*$P103)*(AE103*(365/M$129)),(M$129*$P103)*(AE103*(365/M$129))*1.09)","v":3270252.5593944006},15311384.999999998,null,{"$f":"IF('Form Control Selectors'!F23=FALSE,41949,41949*0.99)","v":41949},"m3/d",41948.999999999993,null,0.24785707504222471,9.3202935911695442E-2,9.4647196008397078E-2,0,0,0,0,0,2.1327826644321309E-2,0.11487955757877209,0.21450234239738397,0.21358306641720529]
["SW inflow from Salmon River system (m3)",{"$f":"B$129*$P104","v":27807},25116,27807,26910,27807,26910,27807,27807,26910,27807,26910,27807,327405,null,897,"m3/d",897]
[]
["TOTAL",{"$f":"SUM(B99:B105)","v":4422614.6009453936},{"$f":"SUM(C99:C105)","v":1993912.0348742951},2076759.1572550309,607335,627579.5,607335,627579.5,627579.5,933893.56496446161,2386544.6347182472,3891662.9478481691,3897832.0593944006,22700627.5]
[]
["OUTFLOWS FROM AQUIFER (WET YEAR - 1971)",null,null,null,null,null,null,null,null,null,null,null,null,null,null,null,null,null,null,"Monthly Distributions"]
["OUTFLOW SOURCE / TYPE","JAN","FEB","MAR","APR","MAY","JUN","JUL","AUG","SEP","OCT","NOV","DEC","ANNUAL",null,"Flow per day to distribute",null,"Check",null,"JAN","FEB","MAR","APR","MAY","JUN","JUL","AUG","SEP","OCT","NOV","DEC"]
["GW outflow to surrounding aquitards (m3)",{"$f":"B$129*$P110","v":419833},379204,419833,406290,419833,406290,419833,419833,406290,419833,406290,419833,{"$f":"SUM(B110:M110)","v":4943195},null,13543,"m3/d",{"$f":"N110/365","v":13543}]
["GW outflow to Aldergrove CD (m3)",32705,29540,32705,31650,32705,31650,32705,32705,31650,32705,31650,32705,385075,null,1055,"m3/d",{"$f":"N111/365","v":1055}]
["GW outflow to West of Aldergrove (m3)",10478,9464,10478,10140,10478,10140,10478,10478,10140,10478,10140,10478,123370,null,338,"m3/d",338]
["GW outflow from pumping - Private minor users (m3)",{"$f":"(B$129*$P113)*(T113*(365/B$129))","v":131450.69236799999},{"$f":"(C$129*$P113)*(U113*(365/C$129))","v":128377.9842885},{"$f":"(D$129*$P113)*(V113*(365/D$129))","v":126947.3781765},{"$f":"(E$129*$P113)*(W113*(365/E$129))","v":135319.51899300001},{"$f":"(F$129*$P113)*(X113*(365/F$129))","v":157395.90345449996},{"$f":"(G$129*$P113)*(Y113*(365/G$129))","v":163193.9849565},{"$f":"(H$129*$P113)*(Z113*(365/H$129))","v":167052.4947105},{"$f":"(I$129*$P113)*(AA113*(365/I$129))","v":151159.35493499998},{"$f":"(J$129*$P113)*(AB113*(365/J$129))","v":153300.1056675},{"$f":"(K$129*$P113)*(AC113*(365/K$129))","v":136155.18554399998},{"$f":"(L$129*$P113)*(AD113*(365/L$129))","v":133682.57546099997},{"$f":"(M$129*$P113)*(AE113*(365/M$129))","v":135445.04092349997},1719480.2194784998,null,{"$f":"4710.9*'Form Control Selectors'!H43","v":4710.8999999999996},"m3/d",4710.9047108999994,null,{"$f":"VLOOKUP('Form Control Selectors'!$H$23,'Water Budget Distributions'!$B$16:$N$22,2,FALSE)","v":7.6448000000000002E-2},{"$f":"VLOOKUP('Form Control Selectors'!$H$23,'Water Budget Distributions'!$B$16:$N$22,3,FALSE)","v":7.4661000000000005E-2},{"$f":"VLOOKUP('Form Control Selectors'!$H$23,'Water Budget Distributions'!$B$16:$N$22,4,FALSE)","v":7.3829000000000006E-2},{"$f":"VLOOKUP('Form Control Selectors'!$H$23,'Water Budget Distributions'!$B$16:$N$22,5,FALSE)","v":7.8698000000000004E-2},{"$f":"VLOOKUP('Form Control Selectors'!$H$23,'Water Budget Distributions'!$B$16:$N$22,6,FALSE)","v":9.1536999999999993E-2},{"$f":"VLOOKUP('Form Control Selectors'!$H$23,'Water Budget Distributions'!$B$16:$N$22,7,FALSE)","v":9.4908999999999993E-2},{"$f":"VLOOKUP('Form Control Selectors'!$H$23,'Water Budget Distributions'!$B$16:$N$22,8,FALSE)","v":9.7153000000000003E-2},{"$f":"VLOOKUP('Form Control Selectors'!$H$23,'Water Budget Distributions'!$B$16:$N$22,9,FALSE)","v":8.7910000000000002E-2},{"$f":"VLOOKUP('Form Control Selectors'!$H$23,'Water Budget Distributions'!$B$16:$N$22,10,FALSE)","v":8.9154999999999998E-2},{"$f":"VLOOKUP('Form Control Selectors'!$H$23,'Water Budget Distributions'!$B$16:$N$22,11,FALSE)","v":7.9184000000000004E-2},{"$f":"VLOOKUP('Form Control Selectors'!$H$23,'Water Budget Distributions'!$B$16:$N$22,12,FALSE)","v":7.7745999999999996E-2},{"$f":"VLOOKUP('Form Control Selectors'!$H$23,'Water Budget Distributions'!$B$16:$N$22,13,FALSE)","v":7.8770999999999994E-2}]
["GW outflow to SW (m3) - Nicomekl R. / Bertrand Ck.",{"$f":"B$129*$P114+47500","v":131479},{"$f":"C$129*$P114+(0.11*(B118*'Form Control Selectors'!$H$29))","v":116837.371491527},{"$f":"D$129*$P114+(0.11*(C118*'Form Control Selectors'!$H$29))","v":89466.302110936565},{"$f":"E$129*$P114+(0.11*(D118*'Form Control Selectors'!$H$29))","v":91421.216038155282},{"$f":"F$129*$P114+(0.11*(E118*'Form Control Selectors'!$H$29))","v":69730.783030892213},{"$f":"G$129*$P114+(0.11*(F118*'Form Control Selectors'!$H$29))","v":69967.678888366921},{"$f":"H$129*$P114+(0.11*(G118*'Form Control Selectors'!$H$29))","v":72488.884914962706},{"$f":"I$129*$P114+(0.11*(H118*'Form Control Selectors'!$H$29))","v":72103.629850032346},{"$f":"J$129*$P114+(0.11*(I118*'Form Control Selectors'!$H$29))","v":69714.654916067651},{"$f":"K$129*$P114+(0.11*(J118*'Form Control Selectors'!$H$29))","v":78078.303840989727},{"$f":"L$129*$P114+(0.11*(K118*'Form Control Selectors'!$H$29))","v":98088.947335226621},{"$f":"M$129*$P114+(0.11*(L118*'Form Control Selectors'!$H$29))","v":122949.04404410429},1082325.8164612614,null,2709,"m3/d",2965.2762094829077]
["GW outflow to Salmon River System (m3)",{"$f":"B$129*$P115+475000","v":1212707},{"$f":"C$129*$P115+(0.89*(B118*'Form Control Selectors'!$H$29))","v":997924.91479508206},{"$f":"D$129*$P115+(0.89*(C118*'Form Control Selectors'!$H$29))","v":782104.26253394131},{"$f":"E$129*$P115+(0.89*(D118*'Form Control Selectors'!$H$29))","v":796042.56612689269},{"$f":"F$129*$P115+(0.89*(E118*'Form Control Selectors'!$H$29))","v":622425.9717954006},{"$f":"G$129*$P115+(0.89*(F118*'Form Control Selectors'!$H$29))","v":622463.94736951415},{"$f":"H$129*$P115+(0.89*(G118*'Form Control Selectors'!$H$29))","v":644741.52340288018},{"$f":"I$129*$P115+(0.89*(H118*'Form Control Selectors'!$H$29))","v":641624.45969571627},{"$f":"J$129*$P115+(0.89*(I118*'Form Control Selectors'!$H$29))","v":620416.75341182004},{"$f":"K$129*$P115+(0.89*(J118*'Form Control Selectors'!$H$29))","v":689965.00380437134},{"$f":"L$129*$P115+(0.89*(K118*'Form Control Selectors'!$H$29))","v":849990.57389410632},{"$f":"M$129*$P115+(0.89*(L118*'Form Control Selectors'!$H$29))","v":1053010.0836295711},9533417.0604592972,null,23797,"m3/d",26118.950850573416]
["TOTAL",{"$f":"SUM(B110:B115)","v":1938652.692368},{"$f":"SUM(C110:C115)","v":1661348.2705751089},1461533.9428213779,1470863.301158048,1312568.6582807929,1303705.6112143812,1347298.9030283429,1327903.4444807486,1291511.5139953876,1367214.4931893609,1529842.096690333,1774420.1685971753,17786863.096399058]
[]
["SURPLUS/ DEFICIT (m3)",{"$f":"B106-B116","v":2483961.9085773937},{"$f":"C106-C116","v":332563.76429918618},615225.21443365305,-863528.30115804798,-684989.15828079288,-696370.61121438118,-719719.40302834287,-700323.94448074861,-357617.94903092599,1019330.1415288863,2361820.8511578362,2123411.8907972253,4913764.4036009423]
[]
["Equivalent GWL Change Across Aquifer (m) ",{"$f":"(B118/($L$16*1000000))/$L$15","v":1.0414934627158883},{"$f":"(C118/($L$16*1000000))/$L$15","v":0.13943973345877825},0.25795606475205579,-0.36206637365117317,-0.28720719424771185,-0.29197929191378663,-0.30176914173096137,-0.29363687399612098,-0.14994463271736938,0.42739209288422902,0.99028127931146159,0.89031945106801902,2.0602785759333089]
["Cumulative GWL Change Across Aquifer (m) ",{"$f":"B120","v":1.0414934627158883},{"$f":"C120+B121","v":1.1809331961746665},{"$f":"D120+C121","v":1.4388892609267223},{"$f":"E120+D121","v":1.0768228872755492},{"$f":"F120+E121","v":0.7896156930278373},{"$f":"G120+F121","v":0.49763640111405066},{"$f":"H120+G121","v":0.1958672593830893},{"$f":"I120+H121","v":-9.7769614613031686E-2},{"$f":"J120+I121","v":-0.24771424733040107},{"$f":"K120+J121","v":0.17967784555382796},{"$f":"L120+K121","v":1.1699591248652896},{"$f":"M120+L121","v":2.0602785759333084}]
[]
[]
[]
[]
[]
[]
[]
["Days in Month",31,28,31,30,31,30,31,31,30,31,30,31]
[]
[]
[]
[]
[]
[]
[]
[]
[]
[]
[]
[]
[]
[]
[]
[]
[]
[]
[]
[]
[]
[]
[]
[]
[]
[]
[null,"JAN","FEB","MAR","APR","MAY","JUN","JUL","AUG","SEP","OCT","NOV","DEC"]

{"sheet":"Fort Langley - Analysis","index":6,"n_rows":129,"n_cols":31,"rows_kept":129,"cut":false,"hidden":false,"merged":[[14,11,14,12],[15,11,15,12],[16,11,16,12],[21,11,21,12],[10,11,10,12]]}
[]
[]
[]
[]
[]
[]
["AQUIFER - Fort Langley Aquifer"]
["TYPE - 1a, Predominantly unconfined aquifer along major rivers of higher stream order / 4a, Unconfined glaciofluvial sand and gravel aquifer"]
["CLASSIFICATION - TBD"]
["RANKING - TBD"]
["AQUIFER SIZE - 5.19 km2",null,null,null,null,null,"ALLOCATED WATER USE",null,null,null,null,null,null,"Input Units","User-Defined - Provided for accounting and reporting purposes and does not affect the moedl results directly"]
[]
["LOCATION",null,null,null,null,null,"AQUIFER PARAMETERS AND SELECTION"]
[]
[null,null,null,null,null,null,"Specific Yield",null,null,null,null,0.14000000000000001,null,"(-)","Recommended value = 0.14"]
[null,null,null,null,null,null,"Aquifer Size - in Plan View",null,null,null,null,5.19,null,"km2","Recommended value = 5.19"]
[]
[]
[null,null,null,null,null,null,"Private Water Users Distribution Method"]
[]
[null,null,null,null,null,null,null,null,null,null,null,"USE SLIDER BAR TO ADJUST"]
[null,null,null,null,null,null,"Percent of Surplus/Deficit Apportioned to Baseflow",null,null,null,null,{"$f":"'Form Control Selectors'!I28","v":25},null,"%","Recommended value = 25%"]
[]
[]
[]
[]
[]
[]
[]
[]
[]
[]
[]
[]
[]
[]
[]
[]
[]
["*Golder interpretation of Township of Langley unconfined aquifers shown (Golder 2005, 2014)"]
[null,null,null,null,null,null,"                      ----- Average head fluctuation range for average conditions in provincial groundwater observation well (Well #452) installed in the Fort Langley aquifer (for calibration)"]
[]
[]
[]
["INFLOWS TO AQUIFER (AVERAGE YEAR - 1945-2012)",null,null,null,null,null,null,null,null,null,null,null,null,null,null,null,null,null,null,"Monthly Distributions "]
["INFLOW SOURCE / TYPE","JAN","FEB","MAR","APR","MAY","JUN","JUL","AUG","SEP","OCT","NOV","DEC","ANNUAL",null,"Flow per day to distribute",null,"Check",null,"JAN","FEB","MAR","APR","MAY","JUN","JUL","AUG","SEP","OCT","NOV","DEC"]
["GW inflow from surrounding aquitards (m3)",{"$f":"B$129*$P47","v":400210},361480,400210,387300,400210,387300,400210,400210,387300,400210,387300,400210,{"$f":"SUM(B47:M47)","v":4712150},null,12910,"m3/d",{"$f":"N47/365","v":12910}]
["Recharge (m3)",{"$f":"IF('Form Control Selectors'!$E$23=FALSE,(B$129*$P48)*(T48*(365/B$129)),(B$129*$P48)*(T48*(365/B$129))*1.09)","v":447304.69811427186},{"$f":"IF('Form Control Selectors'!$E$23=FALSE,(C$129*$P48)*(U48*(365/C$129)),(C$129*$P48)*(U48*(365/C$129))*1.09)","v":270473.44518026133},{"$f":"IF('Form Control Selectors'!$E$23=FALSE,(D$129*$P48)*(V48*(365/D$129)),(D$129*$P48)*(V48*(365/D$129))*1.09)","v":181944.82210064237},{"$f":"(E$129*$P48)*(W48*(365/E$129))","v":23177.958497969645},4184.1561228351793,3421.2472663845965,2237.4969753247015,3579.9951605195224,41783.865650135507,{"$f":"IF('Form Control Selectors'!$E$23=FALSE,(K$129*$P48)*(AC48*(365/K$129)),(K$129*$P48)*(AC48*(365/K$129))*1.09)","v":242763.40767597273},{"$f":"IF('Form Control Selectors'!$E$23=FALSE,(L$129*$P48)*(AD48*(365/L$129)),(L$129*$P48)*(AD48*(365/L$129))*1.09)","v":469367.59145926265},{"$f":"IF('Form Control Selectors'!$E$23=FALSE,(M$129*$P48)*(AE48*(365/M$129)),(M$129*$P48)*(AE48*(365/M$129))*1.09)","v":483737.81579642004},{"$f":"SUM(B48:M48)","v":2173976.5000000005},null,{"$f":"IF('Form Control Selectors'!F23=FALSE,5956.1,5956.1*0.99)","v":5956.1},"m3/d",{"$f":"N48/365","v":5956.1000000000013},null,0.20575415516877568,0.12441415313379021,8.3692175191701648E-2,1.0661549698430341E-2,1.9246556358061735E-3,1.5737278054222743E-3,1.0292185657594282E-3,1.6467497052150852E-3,1.9220017166761236E-2,0.11166790794471455,0.21590278986882455,0.22251290011479888]
["SW inflow from Fraser River (m3)",{"$f":"B$129*$P49","v":15004},13552,15004,14520,15004,14520,15004,15004,14520,15004,14520,15004,176660,null,484,"m3/d",{"$f":"N49/365","v":484}]
[]
[]
[]
[]
["TOTAL",{"$f":"SUM(B47:B53)","v":862518.69811427186},645505.44518026127,597158.82210064237,424997.95849796967,419398.15612283518,405241.2472663846,417451.4969753247,418793.99516051949,443603.8656501355,657977.40767597267,871187.59145926265,898951.81579641998,7062786.5]
[]
["OUTFLOWS FROM AQUIFER (AVERAGE YEAR, 1945-2012)",null,null,null,null,null,null,null,null,null,null,null,null,null,null,null,null,null,null,"Monthly Distributions (filled Fort Langley 2 Feb/Aug periods of shutdown / maintenance with average pumping during that time)"]
["OUTFLOW SOURCE / TYPE","JAN","FEB","MAR","APR","MAY","JUN","JUL","AUG","SEP","OCT","NOV","DEC","ANNUAL",null,"Flow per day to distribute",null,"Check",null,"JAN","FEB","MAR","APR","MAY","JUN","JUL","AUG","SEP","OCT","NOV","DEC"]
["GW outflow to Fraser River (m3)",{"$f":"B$129*$P58+35000","v":334041.5},{"$f":"C$129*$P58+(0.875*(B66*'Form Control Selectors'!$I$29))","v":323203.60783249699},{"$f":"D$129*$P58+(0.875*(C66*'Form Control Selectors'!$I$29))","v":309781.02128849539},{"$f":"E$129*$P58+(0.875*(D66*'Form Control Selectors'!$I$29))","v":293300.54729582916},{"$f":"F$129*$P58+(0.875*(E66*'Form Control Selectors'!$I$29))","v":266310.85351434856},{"$f":"G$129*$P58+(0.875*(F66*'Form Control Selectors'!$I$29))","v":253839.05448297056},{"$f":"H$129*$P58+(0.875*(G66*'Form Control Selectors'!$I$29))","v":261378.0012647165},{"$f":"I$129*$P58+(0.875*(H66*'Form Control Selectors'!$I$29))","v":260663.56602186064},{"$f":"J$129*$P58+(0.875*(I66*'Form Control Selectors'!$I$29))","v":257462.68416402349},{"$f":"K$129*$P58+(0.875*(J66*'Form Control Selectors'!$I$29))","v":272582.46968402376},{"$f":"L$129*$P58+(0.875*(K66*'Form Control Selectors'!$I$29))","v":312443.55359311309},{"$f":"M$129*$P58+(0.875*(L66*'Form Control Selectors'!$I$29))","v":359744.31920781045},{"$f":"SUM(B58:M58)","v":3504751.1783496886},null,9646.5,"m3/d",{"$f":"N58/365","v":9602.058022875859}]
["GW outflow from pumping - Muni - Ft. Langley 2 (m3)",{"$f":"(B$129*$P59)*(T59*(365/B$129))","v":214829.20048},209807.48923500002,207469.45691499999,221152.00423000002,257231.32749499998,266707.10271499999,273013.04565500002,247038.96784999996,250537.58592499999,222517.72983999999,218476.75570999997,221357.14408499998,{"$f":"SUM(B59:M59)","v":2810137.8101349999},null,{"$f":"7699*'Form Control Selectors'!I37","v":7699},"m3/d",{"$f":"N59/365","v":7699.0076989999998},null,7.6448000000000002E-2,7.4661000000000005E-2,7.3829000000000006E-2,7.8698000000000004E-2,9.1536999999999993E-2,9.4908999999999993E-2,9.7153000000000003E-2,8.7910000000000002E-2,8.9154999999999998E-2,7.9184000000000004E-2,7.7745999999999996E-2,7.8770999999999994E-2]
["GW outflow from pumping - Private minor users (m3)",{"$f":"(B$129*$P60)*(T60*(365/B$129))","v":11021.8904},{"$f":"(C$129*$P60)*(U60*(365/C$129))","v":10764.249675000001},10644.296075,11346.284150000001,13197.346974999999,13683.505074999999,14007.033775,12674.424249999998,12853.922125000001,11416.3532,11209.029549999999,11356.808924999998,144175.14417499999,null,{"$f":"395*'Form Control Selectors'!I43","v":395},"m3/d",{"$f":"N60/365","v":395.00039499999997},null,{"$f":"VLOOKUP('Form Control Selectors'!$I$23,'Water Budget Distributions'!$P$16:$AB$22,2,FALSE)","v":7.6448000000000002E-2},{"$f":"VLOOKUP('Form Control Selectors'!$I$23,'Water Budget Distributions'!$P$16:$AB$22,3,FALSE)","v":7.4661000000000005E-2},{"$f":"VLOOKUP('Form Control Selectors'!$I$23,'Water Budget Distributions'!$P$16:$AB$22,4,FALSE)","v":7.3829000000000006E-2},{"$f":"VLOOKUP('Form Control Selectors'!$I$23,'Water Budget Distributions'!$P$16:$AB$22,5,FALSE)","v":7.8698000000000004E-2},{"$f":"VLOOKUP('Form Control Selectors'!$I$23,'Water Budget Distributions'!$P$16:$AB$22,6,FALSE)","v":9.1536999999999993E-2},{"$f":"VLOOKUP('Form Control Selectors'!$I$23,'Water Budget Distributions'!$P$16:$AB$22,7,FALSE)","v":9.4908999999999993E-2},{"$f":"VLOOKUP('Form Control Selectors'!$I$23,'Water Budget Distributions'!$P$16:$AB$22,8,FALSE)","v":9.7153000000000003E-2},{"$f":"VLOOKUP('Form Control Selectors'!$I$23,'Water Budget Distributions'!$P$16:$AB$22,9,FALSE)","v":8.7910000000000002E-2},{"$f":"VLOOKUP('Form Control Selectors'!$I$23,'Water Budget Distributions'!$P$16:$AB$22,10,FALSE)","v":8.9154999999999998E-2},{"$f":"VLOOKUP('Form Control Selectors'!$I$23,'Water Budget Distributions'!$P$16:$AB$22,11,FALSE)","v":7.9184000000000004E-2},{"$f":"VLOOKUP('Form Control Selectors'!$I$23,'Water Budget Distributions'!$P$16:$AB$22,12,FALSE)","v":7.7745999999999996E-2},{"$f":"VLOOKUP('Form Control Selectors'!$I$23,'Water Budget Distributions'!$P$16:$AB$22,13,FALSE)","v":7.8770999999999994E-2}]
["GW outflow to Salmon River (m3)",{"$f":"B$129*$P61+10000","v":59875.9},{"$f":"C$129*$P61+(0.125*(B$66*'Form Control Selectors'!$I$29))","v":52635.143976070998},{"$f":"D$129*$P61+(0.125*(C$66*'Form Control Selectors'!$I$29))","v":51410.117326927917},{"$f":"E$129*$P61+(0.125*(D$66*'Form Control Selectors'!$I$29))","v":48824.935327975596},{"$f":"F$129*$P61+(0.125*(E$66*'Form Control Selectors'!$I$29))","v":45200.093359192659},{"$f":"G$129*$P61+(0.125*(F$66*'Form Control Selectors'!$I$29))","v":43187.579211852935},{"$f":"H$129*$P61+(0.125*(G$66*'Form Control Selectors'!$I$29))","v":44495.400180673787},{"$f":"I$129*$P61+(0.125*(H$66*'Form Control Selectors'!$I$29))","v":44393.338003122946},{"$f":"J$129*$P61+(0.125*(I$66*'Form Control Selectors'!$I$29))","v":43705.240594860501},{"$f":"K$129*$P61+(0.125*(J$66*'Form Control Selectors'!$I$29))","v":46096.038526289114},{"$f":"L$129*$P61+(0.125*(K$66*'Form Control Selectors'!$I$29))","v":51559.650513301865},{"$f":"M$129*$P61+(0.125*(L$66*'Form Control Selectors'!$I$29))","v":58547.731315401499},{"$f":"SUM(B61:M61)","v":589931.16833566991},null,1608.9,"m3/d",{"$f":"N61/365","v":1616.2497762621094}]
[]
[]
["TOTAL",{"$f":"SUM(B58:B63)","v":619768.49088000006},{"$f":"SUM(C58:C63)","v":596410.49071856798},579304.8916054233,574623.77100380475,581939.62134354119,577417.24148482352,592893.48087539035,564770.29612498358,564559.43280888395,552612.59125031286,593688.98936641484,651006.00353321189,7048995.3009953573]
[]
["SURPLUS/ DEFICIT (m3)",{"$f":"B54-B64","v":242750.2072342718},49094.954461693298,17853.930495219072,-149625.81250583509,-162541.46522070601,-172175.99421843892,-175441.98390006565,-145976.30096446408,-120955.56715874845,105364.81642565981,277498.60209284781,247945.81226320809,13791.199004642665]
[]
["Equivalent GWL Change Across Aquifer (m) ",{"$f":"(B66/($L$16*1000000))/$L$15","v":0.33409056872319265},{"$f":"(C66/($L$16*1000000))/$L$15","v":6.7568062842958021E-2},2.4571883423092584E-2,-0.20592597372121535,-0.22370143850909169,-0.23696118114291068,-0.2414560747317171,-0.20090324933176998,-0.1664678876393455,0.14501075753600304,0.38191384818723889,0.3412411399163337,1.8980455552769976E-2]
["Cumulative GWL Change Across Aquifer (m) ",{"$f":"B68","v":0.33409056872319265},{"$f":"C68+B69","v":0.40165863156615067},{"$f":"D68+C69","v":0.42623051498924325},0.2203045412680279,-3.3968972410637899E-3,-0.24035807838397447,-0.48181415311569153,-0.68271740244746149,-0.84918529008680699,-0.70417453255080398,-0.32226068436356509,1.8980455552768616E-2]
[]
["INFLOWS TO AQUIFER (DRY YEAR - 1951)",null,null,null,null,null,null,null,null,null,null,null,null,null,null,null,null,null,null,"Monthly Distributions "]
["INFLOW SOURCE / TYPE","JAN","FEB","MAR","APR","MAY","JUN","JUL","AUG","SEP","OCT","NOV","DEC","ANNUAL",null,"Flow per day to distribute",null,"Check",null,"JAN","FEB","MAR","APR","MAY","JUN","JUL","AUG","SEP","OCT","NOV","DEC"]
["GW inflow from surrounding aquitards (m3)",{"$f":"B$129*$P73","v":400210},361480,400210,387300,400210,387300,400210,400210,387300,400210,387300,400210,{"$f":"SUM(B73:M73)","v":4712150},null,12910,"m3/d",{"$f":"N73/365","v":12910}]
["Recharge (m3)",{"$f":"IF('Form Control Selectors'!$E$23=FALSE,(B$129*$P74)*(T74*(365/B$129)),(B$129*$P74)*(T74*(365/B$129))*1.09)","v":247210.68155787676},{"$f":"IF('Form Control Selectors'!$E$23=FALSE,(C$129*$P74)*(U74*(365/C$129)),(C$129*$P74)*(U74*(365/C$129))*1.09)","v":151321.86924078327},{"$f":"IF('Form Control Selectors'!$E$23=FALSE,(D$129*$P74)*(V74*(365/D$129)),(D$129*$P74)*(V74*(365/D$129))*1.09)","v":82919.510332822334},{"$f":"(E$129*$P74)*(W74*(365/E$129))","v":0},{"$f":"(F$129*$P74)*(X74*(365/F$129))","v":0},{"$f":"(G$129*$P74)*(Y74*(365/G$129))","v":0},{"$f":"(H$129*$P74)*(Z74*(365/H$129))","v":0},{"$f":"(I$129*$P74)*(AA74*(365/I$129))","v":0},{"$f":"(J$129*$P74)*(AB74*(365/J$129))","v":0},{"$f":"(K$129*$P74)*(AC74*(365/K$129))","v":0},{"$f":"(L$129*$P74)*(AD74*(365/L$129))","v":0},{"$f":"IF('Form Control Selectors'!$E$23=FALSE,(M$129*$P74)*(AE74*(365/M$129)),(M$129*$P74)*(AE74*(365/M$129))*1.09)","v":485432.93886851752},966884.99999999988,null,{"$f":"IF('Form Control Selectors'!F23=FALSE,2649,2649*0.99)","v":2649},"m3/d",{"$f":"N74/365","v":2648.9999999999995},null,0.25567743998291087,0.15650451629799125,8.5759433989380685E-2,0,0,0,0,0,0,0,0,0.50205860972971716]
["SW inflow from Fraser River (m3)",{"$f":"B$129*$P75","v":15004},13552,15004,14520,15004,14520,15004,15004,14520,15004,14520,15004,176660,null,484,"m3/d",{"$f":"N75/365","v":484}]
[]
[]
[]
[]
["TOTAL",{"$f":"SUM(B73:B79)","v":662424.68155787676},526353.86924078327,498133.51033282233,401820,415214,401820,415214,415214,401820,415214,401820,900646.93886851752,5855695]
[]
["OUTFLOWS FROM AQUIFER (DRY YEAR - 1951)",null,null,null,null,null,null,null,null,null,null,null,null,null,null,null,null,null,null,"Monthly Distributions (filled Fort Langley 2 Feb/Aug periods of shutdown / maintenance with average pumping during that time)"]
["OUTFLOW SOURCE / TYPE","JAN","FEB","MAR","APR","MAY","JUN","JUL","AUG","SEP","OCT","NOV","DEC","ANNUAL",null,"Flow per day to distribute",null,"Check",null,"JAN","FEB","MAR","APR","MAY","JUN","JUL","AUG","SEP","OCT","NOV","DEC"]
["GW outflow to Fraser River (m3)",{"$f":"B$129*$P84+63000","v":411917.39999999997},{"$f":"C$129*$P84+(0.875*(B92*'Form Control Selectors'!$I$29))","v":304821.88858578552},{"$f":"D$129*$P84+(0.875*(C92*'Form Control Selectors'!$I$29))","v":339595.73136341246},{"$f":"E$129*$P84+(0.875*(D92*'Form Control Selectors'!$I$29))","v":314010.70470288926},{"$f":"F$129*$P84+(0.875*(E92*'Form Control Selectors'!$I$29))","v":307447.37949115265},{"$f":"G$129*$P84+(0.875*(F92*'Form Control Selectors'!$I$29))","v":292465.26071189938},{"$f":"H$129*$P84+(0.875*(G92*'Form Control Selectors'!$I$29))","v":302357.29561796266},{"$f":"I$129*$P84+(0.875*(H92*'Form Control Selectors'!$I$29))","v":301363.81184519676},{"$f":"J$129*$P84+(0.875*(I92*'Form Control Selectors'!$I$29))","v":296330.12064182578},{"$f":"K$129*$P84+(0.875*(J92*'Form Control Selectors'!$I$29))","v":305109.63370360603},{"$f":"L$129*$P84+(0.875*(K92*'Form Control Selectors'!$I$29))","v":301032.88903409848},{"$f":"M$129*$P84+(0.875*(L92*'Form Control Selectors'!$I$29))","v":311307.06846585037},{"$f":"SUM(B84:M84)","v":3787759.1841636798},null,{"$f":"9646.5+1608.9","v":11255.4},"m3/d",{"$f":"N84/365","v":10377.422422366246}]
["GW outflow from pumping - Muni - Ft. Langley 2 (m3)",{"$f":"(B$129*$P85)*(T85*(365/B$129))","v":214829.20048},209807.48923500002,207469.45691499999,221152.00423000002,257231.32749499998,266707.10271499999,273013.04565500002,247038.96784999996,250537.58592499999,222517.72983999999,218476.75570999997,221357.14408499998,2810137.8101349999,null,{"$f":"7699*'Form Control Selectors'!I37","v":7699},"m3/d",{"$f":"N85/365","v":7699.0076989999998},null,7.6448000000000002E-2,7.4661000000000005E-2,7.3829000000000006E-2,7.8698000000000004E-2,9.1536999999999993E-2,9.4908999999999993E-2,9.7153000000000003E-2,8.7910000000000002E-2,8.9154999999999998E-2,7.9184000000000004E-2,7.7745999999999996E-2,7.8770999999999994E-2]
["GW outflow from pumping - Private minor users (m3)",{"$f":"(B$129*$P86)*(T86*(365/B$129))","v":11021.8904},{"$f":"(C$129*$P86)*(U86*(365/C$129))","v":10764.249675000001},10644.296075,11346.284150000001,13197.346974999999,13683.505074999999,14007.033775,12674.424249999998,12853.922125000001,11416.3532,11209.029549999999,11356.808924999998,144175.14417499999,null,{"$f":"395*'Form Control Selectors'!I43","v":395},"m3/d",{"$f":"N86/365","v":395.00039499999997},null,{"$f":"VLOOKUP('Form Control Selectors'!$I$23,'Water Budget Distributions'!$P$16:$AB$22,2,FALSE)","v":7.6448000000000002E-2},{"$f":"VLOOKUP('Form Control Selectors'!$I$23,'Water Budget Distributions'!$P$16:$AB$22,3,FALSE)","v":7.4661000000000005E-2},{"$f":"VLOOKUP('Form Control Selectors'!$I$23,'Water Budget Distributions'!$P$16:$AB$22,4,FALSE)","v":7.3829000000000006E-2},{"$f":"VLOOKUP('Form Control Selectors'!$I$23,'Water Budget Distributions'!$P$16:$AB$22,5,FALSE)","v":7.8698000000000004E-2},{"$f":"VLOOKUP('Form Control Selectors'!$I$23,'Water Budget Distributions'!$P$16:$AB$22,6,FALSE)","v":9.1536999999999993E-2},{"$f":"VLOOKUP('Form Control Selectors'!$I$23,'Water Budget Distributions'!$P$16:$AB$22,7,FALSE)","v":9.4908999999999993E-2},{"$f":"VLOOKUP('Form Control Selectors'!$I$23,'Water Budget Distributions'!$P$16:$AB$22,8,FALSE)","v":9.7153000000000003E-2},{"$f":"VLOOKUP('Form Control Selectors'!$I$23,'Water Budget Distributions'!$P$16:$AB$22,9,FALSE)","v":8.7910000000000002E-2},{"$f":"VLOOKUP('Form Control Selectors'!$I$23,'Water Budget Distributions'!$P$16:$AB$22,10,FALSE)","v":8.9154999999999998E-2},{"$f":"VLOOKUP('Form Control Selectors'!$I$23,'Water Budget Distributions'!$P$16:$AB$22,11,FALSE)","v":7.9184000000000004E-2},{"$f":"VLOOKUP('Form Control Selectors'!$I$23,'Water Budget Distributions'!$P$16:$AB$22,12,FALSE)","v":7.7745999999999996E-2},{"$f":"VLOOKUP('Form Control Selectors'!$I$23,'Water Budget Distributions'!$P$16:$AB$22,13,FALSE)","v":7.8770999999999994E-2}]
["GW outflow to Salmon River (m3)",{"$f":"B$129*$P87+22000","v":71875.899999999994},{"$f":"C$129*$P87+(0.125*(B$92*'Form Control Selectors'!$I$29))","v":43573.584083683651},{"$f":"D$129*$P87+(0.125*(C$92*'Form Control Selectors'!$I$29))","v":48544.233051916068},{"$f":"E$129*$P87+(0.125*(D$92*'Form Control Selectors'!$I$29))","v":44888.243528984181},{"$f":"F$129*$P87+(0.125*(E$92*'Form Control Selectors'!$I$29))","v":43951.611355878958},{"$f":"G$129*$P87+(0.125*(F$92*'Form Control Selectors'!$I$29))","v":41810.322958842764},{"$f":"H$129*$P87+(0.125*(G$92*'Form Control Selectors'!$I$29))","v":43224.456516851817},{"$f":"I$129*$P87+(0.125*(H$92*'Form Control Selectors'!$I$29))","v":43082.530263599547},{"$f":"J$129*$P87+(0.125*(I$92*'Form Control Selectors'!$I$29))","v":42362.445805975112},{"$f":"K$129*$P87+(0.125*(J$92*'Form Control Selectors'!$I$29))","v":43617.64767194372},{"$f":"L$129*$P87+(0.125*(K$92*'Form Control Selectors'!$I$29))","v":43034.269862014073},{"$f":"M$129*$P87+(0.125*(L$92*'Form Control Selectors'!$I$29))","v":44502.99549512149},{"$f":"SUM(B87:M87)","v":554468.24059481139},null,1608.9,"m3/d",{"$f":"N87/365","v":1519.0910701227708}]
[]
[]
["TOTAL",{"$f":"SUM(B84:B89)","v":709644.39088000008},{"$f":"SUM(C84:C89)","v":568967.21157946915},{"$f":"SUM(D84:D89)","v":606253.71740532853},{"$f":"SUM(E84:E89)","v":591397.23661187338},{"$f":"SUM(F84:F89)","v":621827.66531703155},{"$f":"SUM(G84:G89)","v":614666.19146074203},{"$f":"SUM(H84:H89)","v":632601.83156481455},{"$f":"SUM(I84:I89)","v":604159.73420879641},{"$f":"SUM(J84:J89)","v":602084.0744978009},{"$f":"SUM(K84:K89)","v":582661.36441554979},{"$f":"SUM(L84:L89)","v":573752.9441561125},{"$f":"SUM(M84:M89)","v":588524.01697097183},{"$f":"SUM(N84:N89)","v":7296540.379068491}]
[]
["SURPLUS/ DEFICIT (m3)",{"$f":"B80-B90","v":-47219.709322123323},-42613.342338685878,-108120.20707250619,-189577.23661187338,-206613.66531703155,-212846.19146074203,-217387.83156481455,-188945.73420879641,-200264.0744978009,-167447.36441554979,-171932.9441561125,312122.92189754569,-1440845.379068491]
[]
["Equivalent GWL Change Across Aquifer (m) ",{"$f":"(B92/($L$16*1000000))/$L$15","v":-6.4987213490398182E-2},{"$f":"(C92/($L$16*1000000))/$L$15","v":-5.8647594740828347E-2},-0.14880292743257115,-0.26091004213029639,-0.28435681986929745,-0.2929344776503468,-0.29918501454006952,-0.26004092239030607,-0.27561804912992138,-0.2304532953695978,-0.2366266778917045,0.42956636649813607,-1.982996668137202]
["Cumulative GWL Change Across Aquifer (m) ",{"$f":"B94","v":-6.4987213490398182E-2},{"$f":"C94+B95","v":-0.12363480823122652},{"$f":"D94+C95","v":-0.2724377356637977},{"$f":"E94+D95","v":-0.53334777779409404},{"$f":"F94+E95","v":-0.81770459766339143},{"$f":"G94+F95","v":-1.1106390753137383},{"$f":"H94+G95","v":-1.4098240898538079},{"$f":"I94+H95","v":-1.6698650122441139},{"$f":"J94+I95","v":-1.9454830613740353},{"$f":"K94+J95","v":-2.1759363567436329},{"$f":"L94+K95","v":-2.4125630346353373},{"$f":"M94+L95","v":-1.9829966681372011}]
[]
["INFLOWS TO AQUIFER (WET YEAR - 1971)",null,null,null,null,null,null,null,null,null,null,null,null,null,null,null,null,null,null,"Monthly Distributions "]
["INFLOW SOURCE / TYPE","JAN","FEB","MAR","APR","MAY","JUN","JUL","AUG","SEP","OCT","NOV","DEC","ANNUAL",null,"Flow per day to distribute",null,"Check",null,"JAN","FEB","MAR","APR","MAY","JUN","JUL","AUG","SEP","OCT","NOV","DEC"]
["GW inflow from surrounding aquitards (m3)",{"$f":"B$129*$P99","v":400210},361480,400210,387300,400210,387300,400210,400210,387300,400210,387300,400210,{"$f":"SUM(B99:M99)","v":4712150},null,12910,"m3/d",{"$f":"N99/365","v":12910}]
["Recharge (m3)",{"$f":"IF('Form Control Selectors'!$E$23=FALSE,(B$129*$P100)*(T100*(365/B$129)),(B$129*$P100)*(T100*(365/B$129))*1.09)","v":899612.12529025704},{"$f":"IF('Form Control Selectors'!$E$23=FALSE,(C$129*$P100)*(U100*(365/C$129)),(C$129*$P100)*(U100*(365/C$129))*1.09)","v":338285.64806765335},{"$f":"IF('Form Control Selectors'!$E$23=FALSE,(D$129*$P100)*(V100*(365/D$129)),(D$129*$P100)*(V100*(365/D$129))*1.09)","v":343527.67674423772},{"$f":"(E$129*$P100)*(W100*(365/E$129))","v":0},{"$f":"(F$129*$P100)*(X100*(365/F$129))","v":0},{"$f":"(G$129*$P100)*(Y100*(365/G$129))","v":0},{"$f":"(H$129*$P100)*(Z100*(365/H$129))","v":0},{"$f":"(I$129*$P100)*(AA100*(365/I$129))","v":0},{"$f":"(J$129*$P100)*(AB100*(365/J$129))","v":77410.626475162848},{"$f":"IF('Form Control Selectors'!$E$23=FALSE,(K$129*$P100)*(AC100*(365/K$129)),(K$129*$P100)*(AC100*(365/K$129))*1.09)","v":416962.24700560799},{"$f":"IF('Form Control Selectors'!$E$23=FALSE,(L$129*$P100)*(AD100*(365/L$129)),(L$129*$P100)*(AD100*(365/L$129))*1.09)","v":778549.12187184894},{"$f":"IF('Form Control Selectors'!$E$23=FALSE,(M$129*$P100)*(AE100*(365/M$129)),(M$129*$P100)*(AE100*(365/M$129))*1.09)","v":775212.55454523163},3629559.9999999995,null,{"$f":"IF('Form Control Selectors'!F23=FALSE,9944,9944*0.99)","v":9944},"m3/d",{"$f":"N100/365","v":9943.9999999999982},null,0.24785707504222471,9.3202935911695442E-2,9.4647196008397078E-2,0,0,0,0,0,2.1327826644321309E-2,0.11487955757877209,0.21450234239738397,0.21358306641720529]
["SW inflow from Fraser River (m3)",{"$f":"B$129*$P101","v":15004},13552,15004,14520,15004,14520,15004,15004,14520,15004,14520,15004,176660,null,484,"m3/d",{"$f":"N101/365","v":484}]
[]
[]
[]
[]
["TOTAL",{"$f":"SUM(B99:B105)","v":1314826.1252902569},713317.64806765341,758741.67674423777,401820,415214,401820,415214,415214,479230.62647516286,832176.24700560793,1180369.1218718491,1190426.5545452316,8518370]
[]
["OUTFLOWS FROM AQUIFER (WET YEAR - 1971)",null,null,null,null,null,null,null,null,null,null,null,null,null,null,null,null,null,null,"Monthly Distributions (filled Fort Langley 2 Feb/Aug periods of shutdown / maintenance with average pumping during that time)"]
["OUTFLOW SOURCE / TYPE","JAN","FEB","MAR","APR","MAY","JUN","JUL","AUG","SEP","OCT","NOV","DEC","ANNUAL",null,"Flow per day to distribute",null,"Check",null,"JAN","FEB","MAR","APR","MAY","JUN","JUL","AUG","SEP","OCT","NOV","DEC"]
["GW outflow to Fraser River (m3)",{"$f":"B$129*$P110+100000","v":448917.39999999997},{"$f":"C$129*$P110+(0.875*(B118*'Form Control Selectors'!$I$29))","v":439440.95440224372},{"$f":"D$129*$P110+(0.875*(C118*'Form Control Selectors'!$I$29))","v":346839.2915276757},{"$f":"E$129*$P110+(0.875*(D118*'Form Control Selectors'!$I$29))","v":369207.8510643206},{"$f":"F$129*$P110+(0.875*(E118*'Form Control Selectors'!$I$29))","v":293648.09290079481},{"$f":"G$129*$P110+(0.875*(F118*'Form Control Selectors'!$I$29))","v":295915.08235948882},{"$f":"H$129*$P110+(0.875*(G118*'Form Control Selectors'!$I$29))","v":301494.84020606527},{"$f":"I$129*$P110+(0.875*(H118*'Form Control Selectors'!$I$29))","v":301579.42569817114},{"$f":"J$129*$P110+(0.875*(I118*'Form Control Selectors'!$I$29))","v":296276.21717858221},{"$f":"K$129*$P110+(0.875*(J118*'Form Control Selectors'!$I$29))","v":322056.68411085877},{"$f":"L$129*$P110+(0.875*(K118*'Form Control Selectors'!$I$29))","v":388006.61796476203},{"$f":"M$129*$P110+(0.875*(L118*'Form Control Selectors'!$I$29))","v":459871.25664265145},{"$f":"SUM(B110:M110)","v":4263253.7140556145},null,{"$f":"9646.5+1608.9","v":11255.4},"m3/d",{"$f":"N110/365","v":11680.147161796203}]
["GW outflow from pumping - Muni - Ft. Langley 2 (m3)",{"$f":"(B$129*$P111)*(T111*(365/B$129))","v":214829.20048},209807.48923500002,207469.45691499999,221152.00423000002,257231.32749499998,266707.10271499999,273013.04565500002,247038.96784999996,250537.58592499999,222517.72983999999,218476.75570999997,221357.14408499998,2810137.8101349999,null,{"$f":"7699*'Form Control Selectors'!I37","v":7699},"m3/d",{"$f":"N111/365","v":7699.0076989999998},null,7.6448000000000002E-2,7.4661000000000005E-2,7.3829000000000006E-2,7.8698000000000004E-2,9.1536999999999993E-2,9.4908999999999993E-2,9.7153000000000003E-2,8.7910000000000002E-2,8.9154999999999998E-2,7.9184000000000004E-2,7.7745999999999996E-2,7.8770999999999994E-2]
["GW outflow from pumping - Private minor users (m3)",{"$f":"(B$129*$P112)*(T112*(365/B$129))","v":11021.8904},{"$f":"(C$129*$P112)*(U112*(365/C$129))","v":10764.249675000001},10644.296075,11346.284150000001,13197.346974999999,13683.505074999999,14007.033775,12674.424249999998,12853.922125000001,11416.3532,11209.029549999999,11356.808924999998,144175.14417499999,null,{"$f":"395*'Form Control Selectors'!I43","v":395},"m3/d",{"$f":"N112/365","v":395.00039499999997},null,{"$f":"VLOOKUP('Form Control Selectors'!$I$23,'Water Budget Distributions'!$P$16:$AB$22,2,FALSE)","v":7.6448000000000002E-2},{"$f":"VLOOKUP('Form Control Selectors'!$I$23,'Water Budget Distributions'!$P$16:$AB$22,3,FALSE)","v":7.4661000000000005E-2},{"$f":"VLOOKUP('Form Control Selectors'!$I$23,'Water Budget Distributions'!$P$16:$AB$22,4,FALSE)","v":7.3829000000000006E-2},{"$f":"VLOOKUP('Form Control Selectors'!$I$23,'Water Budget Distributions'!$P$16:$AB$22,5,FALSE)","v":7.8698000000000004E-2},{"$f":"VLOOKUP('Form Control Selectors'!$I$23,'Water Budget Distributions'!$P$16:$AB$22,6,FALSE)","v":9.1536999999999993E-2},{"$f":"VLOOKUP('Form Control Selectors'!$I$23,'Water Budget Distributions'!$P$16:$AB$22,7,FALSE)","v":9.4908999999999993E-2},{"$f":"VLOOKUP('Form Control Selectors'!$I$23,'Water Budget Distributions'!$P$16:$AB$22,8,FALSE)","v":9.7153000000000003E-2},{"$f":"VLOOKUP('Form Control Selectors'!$I$23,'Water Budget Distributions'!$P$16:$AB$22,9,FALSE)","v":8.7910000000000002E-2},{"$f":"VLOOKUP('Form Control Selectors'!$I$23,'Water Budget Distributions'!$P$16:$AB$22,10,FALSE)","v":8.9154999999999998E-2},{"$f":"VLOOKUP('Form Control Selectors'!$I$23,'Water Budget Distributions'!$P$16:$AB$22,11,FALSE)","v":7.9184000000000004E-2},{"$f":"VLOOKUP('Form Control Selectors'!$I$23,'Water Budget Distributions'!$P$16:$AB$22,12,FALSE)","v":7.7745999999999996E-2},{"$f":"VLOOKUP('Form Control Selectors'!$I$23,'Water Budget Distributions'!$P$16:$AB$22,13,FALSE)","v":7.8770999999999994E-2}]
["GW outflow to Salmon River (m3)",{"$f":"B$129*$P113+22000","v":71875.899999999994},{"$f":"C$129*$P113+(0.125*(B$118*'Form Control Selectors'!$I$29))","v":62804.879200320531},{"$f":"D$129*$P113+(0.125*(C$118*'Form Control Selectors'!$I$29))","v":49579.027361096538},{"$f":"E$129*$P113+(0.125*(D$118*'Form Control Selectors'!$I$29))","v":52773.550152045798},{"$f":"F$129*$P113+(0.125*(E$118*'Form Control Selectors'!$I$29))","v":41980.284700113552},{"$f":"G$129*$P113+(0.125*(F$118*'Form Control Selectors'!$I$29))","v":42303.154622784117},{"$f":"H$129*$P113+(0.125*(G$118*'Form Control Selectors'!$I$29))","v":43101.248600866471},{"$f":"I$129*$P113+(0.125*(H$118*'Form Control Selectors'!$I$29))","v":43113.332242595883},{"$f":"J$129*$P113+(0.125*(I$118*'Form Control Selectors'!$I$29))","v":42354.745311226034},{"$f":"K$129*$P113+(0.125*(J$118*'Form Control Selectors'!$I$29))","v":46038.654872979831},{"$f":"L$129*$P113+(0.125*(K$118*'Form Control Selectors'!$I$29))","v":55459.088280680291},{"$f":"M$129*$P113+(0.125*(L$118*'Form Control Selectors'!$I$29))","v":65726.450948950223},{"$f":"SUM(B113:M113)","v":617110.31629365939},null,1608.9,"m3/d",{"$f":"N113/365","v":1690.7131953250941}]
[]
[]
["TOTAL",{"$f":"SUM(B110:B115)","v":746644.39088000008},{"$f":"SUM(C110:C115)","v":722817.57251256425},{"$f":"SUM(D110:D115)","v":614532.07187877223},{"$f":"SUM(E110:E115)","v":654479.68959636637},{"$f":"SUM(F110:F115)","v":606057.05207090836},{"$f":"SUM(G110:G115)","v":618608.84477227298},{"$f":"SUM(H110:H115)","v":631616.16823693179},{"$f":"SUM(I110:I115)","v":604406.15004076692},{"$f":"SUM(J110:J115)","v":602022.47053980827},{"$f":"SUM(K110:K115)","v":602029.42202383862},{"$f":"SUM(L110:L115)","v":673151.49150544219},{"$f":"SUM(M110:M115)","v":758311.6606016017},{"$f":"SUM(N110:N115)","v":7834676.9846592732}]
[]
["SURPLUS/ DEFICIT (m3)",{"$f":"B106-B116","v":568181.73441025685},-9499.9244449108373,144209.60486546555,-252659.68959636637,-190843.05207090836,-216788.84477227298,-216402.16823693179,-189192.15004076692,-122791.84406464541,230146.82498176931,507217.63036640687,432114.89394362993,683693.01534072682]
[]
["Equivalent GWL Change Across Aquifer (m) ",{"$f":"(B118/($L$16*1000000))/$L$15","v":0.78197321003338394},{"$f":"(C118/($L$16*1000000))/$L$15","v":-1.307449001501629E-2},0.19847179309863133,-0.34772872226309709,-0.26265214983609736,-0.29836064515864708,-0.29782847266299445,-0.26038005785957458,-0.16899510606199478,0.31674487335778873,0.69806995646353809,0.59470808415033016,0.94094827324625208]
["Cumulative GWL Change Across Aquifer (m) ",{"$f":"B120","v":0.78197321003338394},{"$f":"C120+B121","v":0.76889872001836768},{"$f":"D120+C121","v":0.96737051311699895},{"$f":"E120+D121","v":0.61964179085390181},{"$f":"F120+E121","v":0.35698964101780445},{"$f":"G120+F121","v":5.8628995859157373E-2},{"$f":"H120+G121","v":-0.23919947680383707},{"$f":"I120+H121","v":-0.49957953466341165},{"$f":"J120+I121","v":-0.6685746407254064},{"$f":"K120+J121","v":-0.35182976736761767},{"$f":"L120+K121","v":0.34624018909592041},{"$f":"M120+L121","v":0.94094827324625063}]
[]
[]
[]
[]
[]
[]
[]
["Days in Month",31,28,31,30,31,30,31,31,30,31,30,31]

{"sheet":"Beaver River - Analysis","index":7,"n_rows":129,"n_cols":31,"rows_kept":129,"cut":false,"hidden":false,"merged":[[14,11,14,12],[15,11,15,12],[16,11,16,12],[10,11,10,12],[21,11,21,12]]}
[]
[]
[]
[]
[]
[]
["AQUIFER - Beaver River Aquifer"]
["TYPE - 4c, Confined glaciomarine aquifer"]
["CLASSIFICATION - TBD"]
["RANKING - TBD"]
["AQUIFER SIZE - 23.84 km2",null,null,null,null,null,"ALLOCATED WATER USE",null,null,null,null,null,null,"Input Units","User-Defined - Provided for accounting and reporting purposes and does not affect the moedl results directly"]
[]
["LOCATION",null,null,null,null,null,"AQUIFER PARAMETERS AND SELECTION"]
[]
[null,null,null,null,null,null,"Storativity",null,null,null,null,1.5E-3,null,"(-)","Recommended value = 0.0015"]
[null,null,null,null,null,null,"Aquifer Size - in Plan View",null,null,null,null,23.84,null,"km2","Recommended value = 23.84"]
[]
[]
[null,null,null,null,null,null,"Private Water Users Distribution Method"]
[]
[null,null,null,null,null,null,null,null,null,null,null,"USE SLIDER BAR TO ADJUST"]
[null,null,null,null,null,null,"Percent of Surplus/Deficit Apportioned to Baseflow",null,null,null,null,{"$f":"'Form Control Selectors'!J28","v":5},null,"%","Recommended value = 5%"]
[]
[]
[]
[]
[]
[]
[]
[]
[]
[]
[]
[]
[]
[]
[]
[]
[]
["*Golder interpretation of Township of Langley shallow confined aquifers shown (Golder 2005, 2014)"]
[]
[]
[]
[]
["INFLOWS TO AQUIFER (AVERAGE YEAR - 1945-2012)",null,null,null,null,null,null,null,null,null,null,null,null,null,null,null,null,null,null,"Monthly Distributions"]
["INFLOW SOURCE / TYPE","JAN","FEB","MAR","APR","MAY","JUN","JUL","AUG","SEP","OCT","NOV","DEC","ANNUAL",null,"Flow per day to distribute",null,"Check",null,"JAN","FEB","MAR","APR","MAY","JUN","JUL","AUG","SEP","OCT","NOV","DEC"]
["SW inflow from Nathan Creek (m3)",{"$f":"B$129*$P47","v":40380.6},36472.799999999996,40380.6,39078,40380.6,39078,40380.6,40380.6,39078,40380.6,39078,40380.6,{"$f":"SUM(B47:M47)","v":475448.99999999994},null,1302.5999999999999,"m3/d",{"$f":"N47/365","v":1302.5999999999999}]
["GW inflow from surrounding aquitards (m3)",1808261,1633268,1808261,1749930,1808261,1749930,1808261,1808261,1749930,1808261,1749930,1808261,21290815,null,58331,"m3/d",{"$f":"N48/365","v":58331}]
["GW inflow from Aldergrove CD (m3)",270072,243936,270072,261360,270072,261360,270072,270072,261360,270072,261360,270072,3179880,null,8712,"m3/d",8712]
[]
[]
[]
[]
["TOTAL",{"$f":"SUM(B47:B53)","v":2118713.6},1913676.8,2118713.6,2050368,2118713.6,2050368,2118713.6,2118713.6,2050368,2118713.6,2050368,2118713.6,24946144]
[]
["OUTFLOWS FROM AQUIFER (AVERAGE YEAR, 1945-2012)",null,null,null,null,null,null,null,null,null,null,null,null,null,null,null,null,null,null,"Monthly Distributions"]
["OUTFLOW SOURCE / TYPE","JAN","FEB","MAR","APR","MAY","JUN","JUL","AUG","SEP","OCT","NOV","DEC","ANNUAL",null,"Flow per day to distribute",null,"Check",null,"JAN","FEB","MAR","APR","MAY","JUN","JUL","AUG","SEP","OCT","NOV","DEC"]
["GW outflow to surrounding aquitards (m3)",{"$f":"B$129*$P58","v":1124339},1015532,1124339,1088070,1124339,1088070,1124339,1124339,1088070,1124339,1088070,1124339,{"$f":"SUM(B58:M58)","v":13238185},null,36269,"m3/d",{"$f":"N58/365","v":36269}]
["GW outflow to Hopington AB (m3)",112530,101640,112530,108900,112530,108900,112530,112530,108900,112530,108900,112530,{"$f":"SUM(B59:M59)","v":1324950},null,3630,"m3/d",{"$f":"N59/365","v":3630}]
["GW outflow to Aldergrove CD (m3)",370977,335076,370977,359010,370977,359010,370977,370977,359010,370977,359010,370977,4367955,null,11967,"m3/d",11967]
["GW outflow to Nathan Creek (m3)",{"$f":"B$129*$P61+700","v":413341},{"$f":"C$129*$P61+(B66*'Form Control Selectors'!$J$29)","v":373416.84126589162},{"$f":"D$129*$P61+(C66*'Form Control Selectors'!$J$29)","v":412862.81541005056},{"$f":"E$129*$P61+(D66*'Form Control Selectors'!$J$29)","v":399772.55378629162},{"$f":"F$129*$P61+(E66*'Form Control Selectors'!$J$29)","v":412728.50676052034},{"$f":"G$129*$P61+(F66*'Form Control Selectors'!$J$29)","v":399465.06760745472},{"$f":"H$129*$P61+(G66*'Form Control Selectors'!$J$29)","v":411930.98108612851},{"$f":"I$129*$P61+(H66*'Form Control Selectors'!$J$29)","v":411223.58853326907},{"$f":"J$129*$P61+(I66*'Form Control Selectors'!$J$29)","v":398625.04039326566},{"$f":"K$129*$P61+(J66*'Form Control Selectors'!$J$29)","v":412378.22005034814},{"$f":"L$129*$P61+(K66*'Form Control Selectors'!$J$29)","v":399724.11739584361},{"$f":"M$129*$P61+(L66*'Form Control Selectors'!$J$29)","v":413062.52740562911},4858531.2596946927,null,13311,"m3/d",13311.044547108748]
["GW outflow from pumping - ICI - W. Creek Springs (m3)",{"$f":"(B$129*$P62)*(T62*(365/B$129))","v":83349.774682167816},83575.650533096763,89153.708864117492,92865.311003301613,95437.741090385825,109123.31066997482,127284.8482484908,113743.20360141757,101018.5585997715,90607.032032780044,86233.334491573682,83927.526182921996,1156320,null,3168,"m3/d",3168,null,{"$f":"VLOOKUP('Form Control Selectors'!$J$23,'Water Budget Distributions'!$AD$16:$AQ$22,2,FALSE)","v":7.2081927738141538E-2},{"$f":"VLOOKUP('Form Control Selectors'!$J$23,'Water Budget Distributions'!$AD$16:$AQ$22,3,FALSE)","v":7.2277267999426423E-2},{"$f":"VLOOKUP('Form Control Selectors'!$J$23,'Water Budget Distributions'!$AD$16:$AQ$22,4,FALSE)","v":7.7101242618062032E-2},{"$f":"VLOOKUP('Form Control Selectors'!$J$23,'Water Budget Distributions'!$AD$16:$AQ$22,5,FALSE)","v":8.0311082575153611E-2},{"$f":"VLOOKUP('Form Control Selectors'!$J$23,'Water Budget Distributions'!$AD$16:$AQ$22,6,FALSE)","v":8.2535752292086817E-2},{"$f":"VLOOKUP('Form Control Selectors'!$J$23,'Water Budget Distributions'!$AD$16:$AQ$22,7,FALSE)","v":9.4371204052489638E-2},{"$f":"VLOOKUP('Form Control Selectors'!$J$23,'Water Budget Distributions'!$AD$16:$AQ$22,8,FALSE)","v":0.11007752892667325},{"$f":"VLOOKUP('Form Control Selectors'!$J$23,'Water Budget Distributions'!$AD$16:$AQ$22,9,FALSE)","v":9.8366545248216392E-2},{"$f":"VLOOKUP('Form Control Selectors'!$J$23,'Water Budget Distributions'!$AD$16:$AQ$22,10,FALSE)","v":8.7362113082686016E-2},{"$f":"VLOOKUP('Form Control Selectors'!$J$23,'Water Budget Distributions'!$AD$16:$AQ$22,11,FALSE)","v":7.8358094673429537E-2},{"$f":"VLOOKUP('Form Control Selectors'!$J$23,'Water Budget Distributions'!$AD$16:$AQ$22,12,FALSE)","v":7.4575666330750731E-2},{"$f":"VLOOKUP('Form Control Selectors'!$J$23,'Water Budget Distributions'!$AD$16:$AQ$22,13,FALSE)","v":7.2581574462883977E-2}]
["GW outflow from pumping - Private minor users (m3)",null,null,null,null,null,null,null,null,null,null,null,null,null,null,null,"m3/d",{"$f":"N63/365","v":0}]
["TOTAL",{"$f":"SUM(B58:B63)","v":2104536.7746821679},1909240.4917989885,2109862.5242741681,2048617.8647895933,2116012.2478509061,2064568.3782774296,2147061.829334619,2132812.7921346864,2055623.5989930371,2110831.2520831283,2041937.4518874174,2104836.053588551,24945941.259694692]
[]
["SURPLUS/ DEFICIT (m3)",{"$f":"B54-B64","v":14176.825317832176},4436.3082010115031,8851.0757258320227,1750.1352104067337,2701.3521490939893,-14200.378277429612,-28348.229334618896,-14099.19213468628,-5255.5989930371288,7882.3479168717749,8430.5481125826482,13877.54641144909,202.74030530825257]
[]
["Equivalent GWL Change Across Aquifer (m) ",{"$f":"(B66/($L$16*1000000))/$L$15","v":0.39644366101320405},{"$f":"(C66/($L$16*1000000))/$L$15","v":0.12405783559875569},0.24751330329507892,4.8941141230613355E-2,7.5541167480256965E-2,-0.39710230082297571,-0.79273571964817946,-0.39427271070151787,-0.14696865193056849,0.22042359946509435,0.23575358256662887,0.38807456407855395,5.6694716249511348E-3]
["Cumulative GWL Change Across Aquifer (m) ",{"$f":"B68","v":0.39644366101320405},{"$f":"C68+B69","v":0.52050149661195977},{"$f":"D68+C69","v":0.76801479990703869},0.81695594113765202,0.89249710861790899,0.49539480779493328,-0.29734091185324618,-0.691613622554764,-0.83858227448533251,-0.61815867502023814,-0.38240509245360926,5.6694716249446886E-3]
[]
["INFLOWS TO AQUIFER (DRY YEAR - 1951)",null,null,null,null,null,null,null,null,null,null,null,null,null,null,null,null,null,null,"Monthly Distributions"]
["INFLOW SOURCE / TYPE","JAN","FEB","MAR","APR","MAY","JUN","JUL","AUG","SEP","OCT","NOV","DEC","ANNUAL",null,"Flow per day to distribute",null,"Check",null,"JAN","FEB","MAR","APR","MAY","JUN","JUL","AUG","SEP","OCT","NOV","DEC"]
["SW inflow from Nathan Creek (m3)",{"$f":"B$129*$P73","v":40380.6},36472.799999999996,40380.6,39078,40380.6,39078,40380.6,40380.6,39078,40380.6,39078,40380.6,{"$f":"SUM(B73:M73)","v":475448.99999999994},null,1302.5999999999999,"m3/d",{"$f":"N73/365","v":1302.5999999999999}]
["GW inflow from surrounding aquitards (m3)",1808261,1633268,1808261,1749930,1808261,1749930,1808261,1808261,1749930,1808261,1749930,1808261,21290815,null,58331,"m3/d",{"$f":"N74/365","v":58331}]
["GW inflow from Aldergrove CD (m3)",270072,243936,270072,261360,270072,261360,270072,270072,261360,270072,261360,270072,3179880,null,8712,"m3/d",8712]
[]
[]
[]
[]
["TOTAL",{"$f":"SUM(B73:B79)","v":2118713.6},1913676.8,2118713.6,2050368,2118713.6,2050368,2118713.6,2118713.6,2050368,2118713.6,2050368,2118713.6,24946144]
[]
["OUTFLOWS FROM AQUIFER (DRY YEAR - 1951)",null,null,null,null,null,null,null,null,null,null,null,null,null,null,null,null,null,null,"Monthly Distributions"]
["OUTFLOW SOURCE / TYPE","JAN","FEB","MAR","APR","MAY","JUN","JUL","AUG","SEP","OCT","NOV","DEC","ANNUAL",null,"Flow per day to distribute",null,"Check",null,"JAN","FEB","MAR","APR","MAY","JUN","JUL","AUG","SEP","OCT","NOV","DEC"]
["GW outflow to surrounding aquitards (m3)",{"$f":"B$129*$P84","v":1124339},1015532,1124339,1088070,1124339,1088070,1124339,1124339,1088070,1124339,1088070,1124339,{"$f":"SUM(B84:M84)","v":13238185},null,36269,"m3/d",{"$f":"N84/365","v":36269}]
["GW outflow to Hopington AB (m3)",112530,101640,112530,108900,112530,108900,112530,112530,108900,112530,108900,112530,1324950,null,3630,"m3/d",{"$f":"N85/365","v":3630}]
["GW outflow to Aldergrove CD (m3)",370977,335076,370977,359010,370977,359010,370977,370977,359010,370977,359010,370977,4367955,null,11967,"m3/d",11967]
["GW outflow to Nathan Creek (m3)",{"$f":"B$129*$P87+700","v":413341},{"$f":"C$129*$P87+(B92*'Form Control Selectors'!$J$29)","v":373416.84126589162},{"$f":"D$129*$P87+(C92*'Form Control Selectors'!$J$29)","v":412862.81541005056},{"$f":"E$129*$P87+(D92*'Form Control Selectors'!$J$29)","v":399772.55378629162},{"$f":"F$129*$P87+(E92*'Form Control Selectors'!$J$29)","v":412728.50676052034},{"$f":"G$129*$P87+(F92*'Form Control Selectors'!$J$29)","v":399465.06760745472},{"$f":"H$129*$P87+(G92*'Form Control Selectors'!$J$29)","v":411930.98108612851},{"$f":"I$129*$P87+(H92*'Form Control Selectors'!$J$29)","v":411223.58853326907},{"$f":"J$129*$P87+(I92*'Form Control Selectors'!$J$29)","v":398625.04039326566},{"$f":"K$129*$P87+(J92*'Form Control Selectors'!$J$29)","v":412378.22005034814},{"$f":"L$129*$P87+(K92*'Form Control Selectors'!$J$29)","v":399724.11739584361},{"$f":"M$129*$P87+(L92*'Form Control Selectors'!$J$29)","v":413062.52740562911},4858531.2596946927,null,13311,"m3/d",13311.044547108748]
["GW outflow from pumping - ICI - W. Creek Springs (m3)",{"$f":"(B$129*$P88)*(T88*(365/B$129))","v":83349.774682167816},83575.650533096763,89153.708864117492,92865.311003301613,95437.741090385825,109123.31066997482,127284.8482484908,113743.20360141757,101018.5585997715,90607.032032780044,86233.334491573682,83927.526182921996,1156320,null,3168,"m3/d",3168,null,{"$f":"VLOOKUP('Form Control Selectors'!$J$23,'Water Budget Distributions'!$AD$16:$AQ$22,2,FALSE)","v":7.2081927738141538E-2},{"$f":"VLOOKUP('Form Control Selectors'!$J$23,'Water Budget Distributions'!$AD$16:$AQ$22,3,FALSE)","v":7.2277267999426423E-2},{"$f":"VLOOKUP('Form Control Selectors'!$J$23,'Water Budget Distributions'!$AD$16:$AQ$22,4,FALSE)","v":7.7101242618062032E-2},{"$f":"VLOOKUP('Form Control Selectors'!$J$23,'Water Budget Distributions'!$AD$16:$AQ$22,5,FALSE)","v":8.0311082575153611E-2},{"$f":"VLOOKUP('Form Control Selectors'!$J$23,'Water Budget Distributions'!$AD$16:$AQ$22,6,FALSE)","v":8.2535752292086817E-2},{"$f":"VLOOKUP('Form Control Selectors'!$J$23,'Water Budget Distributions'!$AD$16:$AQ$22,7,FALSE)","v":9.4371204052489638E-2},{"$f":"VLOOKUP('Form Control Selectors'!$J$23,'Water Budget Distributions'!$AD$16:$AQ$22,8,FALSE)","v":0.11007752892667325},{"$f":"VLOOKUP('Form Control Selectors'!$J$23,'Water Budget Distributions'!$AD$16:$AQ$22,9,FALSE)","v":9.8366545248216392E-2},{"$f":"VLOOKUP('Form Control Selectors'!$J$23,'Water Budget Distributions'!$AD$16:$AQ$22,10,FALSE)","v":8.7362113082686016E-2},{"$f":"VLOOKUP('Form Control Selectors'!$J$23,'Water Budget Distributions'!$AD$16:$AQ$22,11,FALSE)","v":7.8358094673429537E-2},{"$f":"VLOOKUP('Form Control Selectors'!$J$23,'Water Budget Distributions'!$AD$16:$AQ$22,12,FALSE)","v":7.4575666330750731E-2},{"$f":"VLOOKUP('Form Control Selectors'!$J$23,'Water Budget Distributions'!$AD$16:$AQ$22,13,FALSE)","v":7.2581574462883977E-2}]
[null,null,null,null,null,null,null,null,null,null,null,null,null,null,null,null,"m3/d",0]
["TOTAL",{"$f":"SUM(B84:B89)","v":2104536.7746821679},1909240.4917989885,2109862.5242741681,2048617.8647895933,2116012.2478509061,2064568.3782774296,2147061.829334619,2132812.7921346864,2055623.5989930371,2110831.2520831283,2041937.4518874174,2104836.053588551,24945941.259694692]
[]
["SURPLUS/ DEFICIT (m3)",{"$f":"B80-B90","v":14176.825317832176},4436.3082010115031,8851.0757258320227,1750.1352104067337,2701.3521490939893,-14200.378277429612,-28348.229334618896,-14099.19213468628,-5255.5989930371288,7882.3479168717749,8430.5481125826482,13877.54641144909,202.74030530825257]
[]
["Equivalent GWL Change Across Aquifer (m) ",{"$f":"(B92/($L$16*1000000))/$L$15","v":0.39644366101320405},{"$f":"(C92/($L$16*1000000))/$L$15","v":0.12405783559875569},0.24751330329507892,4.8941141230613355E-2,7.5541167480256965E-2,-0.39710230082297571,-0.79273571964817946,-0.39427271070151787,-0.14696865193056849,0.22042359946509435,0.23575358256662887,0.38807456407855395,5.6694716249511348E-3]
["Cumulative GWL Change Across Aquifer (m) ",{"$f":"B94","v":0.39644366101320405},{"$f":"C94+B95","v":0.52050149661195977},{"$f":"D94+C95","v":0.76801479990703869},{"$f":"E94+D95","v":0.81695594113765202},{"$f":"F94+E95","v":0.89249710861790899},{"$f":"G94+F95","v":0.49539480779493328},{"$f":"H94+G95","v":-0.29734091185324618},{"$f":"I94+H95","v":-0.691613622554764},{"$f":"J94+I95","v":-0.83858227448533251},{"$f":"K94+J95","v":-0.61815867502023814},{"$f":"L94+K95","v":-0.38240509245360926},{"$f":"M94+L95","v":5.6694716249446886E-3}]
[]
["INFLOWS TO AQUIFER (WET YEAR - 1971)",null,null,null,null,null,null,null,null,null,null,null,null,null,null,null,null,null,null,"Monthly Distributions"]
["INFLOW SOURCE / TYPE","JAN","FEB","MAR","APR","MAY","JUN","JUL","AUG","SEP","OCT","NOV","DEC","ANNUAL",null,"Flow per day to distribute",null,"Check",null,"JAN","FEB","MAR","APR","MAY","JUN","JUL","AUG","SEP","OCT","NOV","DEC"]
["SW inflow from Nathan Creek (m3)",{"$f":"B$129*$P99","v":40380.6},36472.799999999996,40380.6,39078,40380.6,39078,40380.6,40380.6,39078,40380.6,39078,40380.6,{"$f":"SUM(B99:M99)","v":475448.99999999994},null,1302.5999999999999,"m3/d",{"$f":"N99/365","v":1302.5999999999999}]
["GW inflow from surrounding aquitards (m3)",1808261,1633268,1808261,1749930,1808261,1749930,1808261,1808261,1749930,1808261,1749930,1808261,21290815,null,58331,"m3/d",{"$f":"N100/365","v":58331}]
["GW inflow from Aldergrove CD (m3)",270072,243936,270072,261360,270072,261360,270072,270072,261360,270072,261360,270072,3179880,null,8712,"m3/d",8712]
[]
[]
[]
[]
["TOTAL",{"$f":"SUM(B99:B105)","v":2118713.6},1913676.8,2118713.6,2050368,2118713.6,2050368,2118713.6,2118713.6,2050368,2118713.6,2050368,2118713.6,24946144]
[]
["OUTFLOWS FROM AQUIFER (WET YEAR - 1971)",null,null,null,null,null,null,null,null,null,null,null,null,null,null,null,null,null,null,"Monthly Distributions"]
["OUTFLOW SOURCE / TYPE","JAN","FEB","MAR","APR","MAY","JUN","JUL","AUG","SEP","OCT","NOV","DEC","ANNUAL",null,"Flow per day to distribute",null,"Check",null,"JAN","FEB","MAR","APR","MAY","JUN","JUL","AUG","SEP","OCT","NOV","DEC"]
["GW outflow to surrounding aquitards (m3)",{"$f":"B$129*$P110","v":1124339},1015532,1124339,1088070,1124339,1088070,1124339,1124339,1088070,1124339,1088070,1124339,{"$f":"SUM(B110:M110)","v":13238185},null,36269,"m3/d",{"$f":"N110/365","v":36269}]
["GW outflow to Hopington AB (m3)",112530,101640,112530,108900,112530,108900,112530,112530,108900,112530,108900,112530,1324950,null,3630,"m3/d",{"$f":"N111/365","v":3630}]
["GW outflow to Aldergrove CD (m3)",370977,335076,370977,359010,370977,359010,370977,370977,359010,370977,359010,370977,4367955,null,11967,"m3/d",11967]
["GW outflow to Nathan Creek (m3)",{"$f":"B$129*$P113+700","v":413341},{"$f":"C$129*$P113+(B118*'Form Control Selectors'!$J$29)","v":373416.84126589162},{"$f":"D$129*$P113+(C118*'Form Control Selectors'!$J$29)","v":412862.81541005056},{"$f":"E$129*$P113+(D118*'Form Control Selectors'!$J$29)","v":399772.55378629162},{"$f":"F$129*$P113+(E118*'Form Control Selectors'!$J$29)","v":412728.50676052034},{"$f":"G$129*$P113+(F118*'Form Control Selectors'!$J$29)","v":399465.06760745472},{"$f":"H$129*$P113+(G118*'Form Control Selectors'!$J$29)","v":411930.98108612851},{"$f":"I$129*$P113+(H118*'Form Control Selectors'!$J$29)","v":411223.58853326907},{"$f":"J$129*$P113+(I118*'Form Control Selectors'!$J$29)","v":398625.04039326566},{"$f":"K$129*$P113+(J118*'Form Control Selectors'!$J$29)","v":412378.22005034814},{"$f":"L$129*$P113+(K118*'Form Control Selectors'!$J$29)","v":399724.11739584361},{"$f":"M$129*$P113+(L118*'Form Control Selectors'!$J$29)","v":413062.52740562911},4858531.2596946927,null,13311,"m3/d",13311.044547108748]
["GW outflow from pumping - ICI - W. Creek Springs (m3)",{"$f":"(B$129*$P114)*(T114*(365/B$129))","v":83349.774682167816},83575.650533096763,89153.708864117492,92865.311003301613,95437.741090385825,109123.31066997482,127284.8482484908,113743.20360141757,101018.5585997715,90607.032032780044,86233.334491573682,83927.526182921996,1156320,null,3168,"m3/d",3168,null,{"$f":"VLOOKUP('Form Control Selectors'!$J$23,'Water Budget Distributions'!$AD$16:$AQ$22,2,FALSE)","v":7.2081927738141538E-2},{"$f":"VLOOKUP('Form Control Selectors'!$J$23,'Water Budget Distributions'!$AD$16:$AQ$22,3,FALSE)","v":7.2277267999426423E-2},{"$f":"VLOOKUP('Form Control Selectors'!$J$23,'Water Budget Distributions'!$AD$16:$AQ$22,4,FALSE)","v":7.7101242618062032E-2},{"$f":"VLOOKUP('Form Control Selectors'!$J$23,'Water Budget Distributions'!$AD$16:$AQ$22,5,FALSE)","v":8.0311082575153611E-2},{"$f":"VLOOKUP('Form Control Selectors'!$J$23,'Water Budget Distributions'!$AD$16:$AQ$22,6,FALSE)","v":8.2535752292086817E-2},{"$f":"VLOOKUP('Form Control Selectors'!$J$23,'Water Budget Distributions'!$AD$16:$AQ$22,7,FALSE)","v":9.4371204052489638E-2},{"$f":"VLOOKUP('Form Control Selectors'!$J$23,'Water Budget Distributions'!$AD$16:$AQ$22,8,FALSE)","v":0.11007752892667325},{"$f":"VLOOKUP('Form Control Selectors'!$J$23,'Water Budget Distributions'!$AD$16:$AQ$22,9,FALSE)","v":9.8366545248216392E-2},{"$f":"VLOOKUP('Form Control Selectors'!$J$23,'Water Budget Distributions'!$AD$16:$AQ$22,10,FALSE)","v":8.7362113082686016E-2},{"$f":"VLOOKUP('Form Control Selectors'!$J$23,'Water Budget Distributions'!$AD$16:$AQ$22,11,FALSE)","v":7.8358094673429537E-2},{"$f":"VLOOKUP('Form Control Selectors'!$J$23,'Water Budget Distributions'!$AD$16:$AQ$22,12,FALSE)","v":7.4575666330750731E-2},{"$f":"VLOOKUP('Form Control Selectors'!$J$23,'Water Budget Distributions'!$AD$16:$AQ$22,13,FALSE)","v":7.2581574462883977E-2}]
["GW outflow from pumping - Private minor users (m3)",null,null,null,null,null,null,null,null,null,null,null,null,null,null,null,"m3/d",0]
["TOTAL",{"$f":"SUM(B110:B115)","v":2104536.7746821679},1909240.4917989885,2109862.5242741681,2048617.8647895933,2116012.2478509061,2064568.3782774296,2147061.829334619,2132812.7921346864,2055623.5989930371,2110831.2520831283,2041937.4518874174,2104836.053588551,24945941.259694692]
[]
["SURPLUS/ DEFICIT (m3)",{"$f":"B106-B116","v":14176.825317832176},4436.3082010115031,8851.0757258320227,1750.1352104067337,2701.3521490939893,-14200.378277429612,-28348.229334618896,-14099.19213468628,-5255.5989930371288,7882.3479168717749,8430.5481125826482,13877.54641144909,202.74030530825257]
[]
["Equivalent GWL Change Across Aquifer (m) ",{"$f":"(B118/($L$16*1000000))/$L$15","v":0.39644366101320405},{"$f":"(C118/($L$16*1000000))/$L$15","v":0.12405783559875569},0.24751330329507892,4.8941141230613355E-2,7.5541167480256965E-2,-0.39710230082297571,-0.79273571964817946,-0.39427271070151787,-0.14696865193056849,0.22042359946509435,0.23575358256662887,0.38807456407855395,5.6694716249511348E-3]
["Cumulative GWL Change Across Aquifer (m) ",{"$f":"B120","v":0.39644366101320405},{"$f":"C120+B121","v":0.52050149661195977},{"$f":"D120+C121","v":0.76801479990703869},{"$f":"E120+D121","v":0.81695594113765202},{"$f":"F120+E121","v":0.89249710861790899},{"$f":"G120+F121","v":0.49539480779493328},{"$f":"H120+G121","v":-0.29734091185324618},{"$f":"I120+H121","v":-0.691613622554764},{"$f":"J120+I121","v":-0.83858227448533251},{"$f":"K120+J121","v":-0.61815867502023814},{"$f":"L120+K121","v":-0.38240509245360926},{"$f":"M120+L121","v":5.6694716249446886E-3}]
[]
[]
[]
[]
[]
[]
[]
["Days in Month",31,28,31,30,31,30,31,31,30,31,30,31]

{"sheet":"West of Aldergrove - Analysis","index":8,"n_rows":139,"n_cols":31,"rows_kept":139,"cut":false,"hidden":false,"merged":[[14,11,14,12],[15,11,15,12],[16,11,16,12],[10,11,10,12]]}
[]
[]
[]
[]
[]
[]
["AQUIFER - West of Aldergrove Aquifer"]
["TYPE - 4b, Confined sand and gravel aquifer of glacial and preglacial origin"]
["CLASSIFICATION - TBD"]
["RANKING - TBD"]
["AQUIFER SIZE - 73.0 km2",null,null,null,null,null,"ALLOCATED WATER USE",null,null,null,null,null,null,"Input Units","User-Defined - Provided for accounting and reporting purposes and does not affect the moedl results directly"]
[]
["LOCATION",null,null,null,null,null,"AQUIFER PARAMETERS AND SELECTION"]
[]
[null,null,null,null,null,null,"Storativity",null,null,null,null,1.9E-3,null,"(-)","Recommended value = 0.0019"]
[null,null,null,null,null,null,"Aquifer Size - in Plan View",null,null,null,null,73,null,"km2","Recommended value = 73.0"]
[]
[]
[null,null,null,null,null,null,"Private Water Users Distribution Method"]
[]
[]
[]
[]
[]
[]
[]
[]
[]
[]
[]
[]
[]
[]
[]
[]
[]
[]
[]
[]
["*Golder interpretation of Township of Langley shallow confined aquifers shown (Golder 2005, 2014)"]
[null,null,null,null,null,null,"                      ----- Average head fluctuation range for average conditions in provincial groundwater observation well (Well #415) installed in the West of Aldergrove aquifer (for calibration)"]
[]
[]
[]
["INFLOWS TO AQUIFER (AVERAGE YEAR - 1945-2012)",null,null,null,null,null,null,null,null,null,null,null,null,null,null,null,null,null,null,"Monthly Distributions"]
["INFLOW SOURCE / TYPE","JAN","FEB","MAR","APR","MAY","JUN","JUL","AUG","SEP","OCT","NOV","DEC","ANNUAL",null,"Flow per day to distribute",null,"Check",null,"JAN","FEB","MAR","APR","MAY","JUN","JUL","AUG","SEP","OCT","NOV","DEC"]
["GW inflow from surrounding aquitards (m3)",{"$f":"B$139*$P47","v":2411707},2178316,2411707,2333910,2411707,2333910,2411707,2411707,2333910,2411707,2333910,2411707,{"$f":"SUM(B47:M47)","v":28395905},null,77797,"m3/d",{"$f":"N47/365","v":77797}]
["GW inflow from Abbotsford (m3)",21359,19292,21359,20670,21359,20670,21359,21359,20670,21359,20670,21359,{"$f":"SUM(B48:M48)","v":251485},null,689,"m3/d",{"$f":"N48/365","v":689}]
["GW inflow from Brookswood (m3)",12896,11648,12896,12480,12896,12480,12896,12896,12480,12896,12480,12896,151840,null,416,"m3/d",{"$f":"N49/365","v":416}]
["GW inflow from Hopington AB (m3)",10478,9464,10478,10140,10478,10140,10478,10478,10140,10478,10140,10478,123370,null,338,"m3/d",338]
["GW inflow from Hopington C (m3)",233089,210532,233089,225570,233089,225570,233089,233089,225570,233089,225570,233089,2744435,null,7519,"m3/d",7519]
["GW inflow from South of Hopington (m3)",13702,12376,13702,13260,13702,13260,13702,13702,13260,13702,13260,13702,161330,null,442,"m3/d",442]
[]
["TOTAL",{"$f":"SUM(B47:B53)","v":2703231},2441628,2703231,2616030,2703231,2616030,2703231,2703231,2616030,2703231,2616030,2703231,31828365]
[]
["OUTFLOWS FROM AQUIFER (AVERAGE YEAR, 1945-2012)",null,null,null,null,null,null,null,null,null,null,null,null,null,null,null,null,null,null,"Monthly Distributions"]
["OUTFLOW SOURCE / TYPE","JAN","FEB","MAR","APR","MAY","JUN","JUL","AUG","SEP","OCT","NOV","DEC","ANNUAL",null,"Flow per day to distribute",null,"Check",null,"JAN","FEB","MAR","APR","MAY","JUN","JUL","AUG","SEP","OCT","NOV","DEC"]
["GW outflow to surrounding aquitards (m3)",{"$f":"B$139*$P58","v":2344344},2117472,2344344,2268720,2344344,2268720,2344344,2344344,2268720,2344344,2268720,2344344,{"$f":"SUM(B58:M58)","v":27602760},null,75624,"m3/d",{"$f":"N58/365","v":75624}]
["GW outflow to Abbotsford (m3)",174003,157164,174003,168390,174003,168390,174003,174003,168390,174003,168390,174003,{"$f":"SUM(B59:M59)","v":2048745},null,5613,"m3/d",{"$f":"N59/365","v":5613}]
["GW outflow to Hopington C (m3)",45942,41496,45942,44460,45942,44460,45942,45942,44460,45942,44460,45942,540930,null,1482,"m3/d",1482]
["GW outflow to South of Hopington (m3)",1829,1652,1829,1770,1829,1770,1829,1829,1770,1829,1770,1829,21535,null,59,"m3/d",59]
["GW outflow to Langley Upland Intertill (m3)",3379,3052,3379,3270,3379,3270,3379,3379,3270,3379,3270,3379,39785,null,109,"m3/d",109]
["GW outflow to South of Murrayville B (m3)",8339,7532,8339,8070,8339,8070,8339,8339,8070,8339,8070,8339,98185,null,269,"m3/d",269]
["GW outflow from pumping - Muni - Murrayville 2 (m3)",{"$f":"B$139*$P64*(T64*(365/B$139))","v":22919.76967331559},{"$f":"C$139*$P64*(U64*(365/C$139))","v":25928.543174004852},28329.800990124702,35525.415379266233,41986.544348512885,49579.875650037866,59978.230655945066,58955.943563159817,48683.876552972448,32984.286125635554,25192.976347697666,24359.737539327252,454424.99999999994,null,{"$f":"1245*'Form Control Selectors'!K37","v":1245},"m3/d",1244.9999999999998,null,5.0436859048942274E-2,5.7057915330373216E-2,6.2342082830224362E-2,7.817663064150572E-2,9.2394882210514132E-2,0.10910463915946057,0.13198708402034454,0.1297374562648618,0.10713291863997898,7.2584664412467526E-2,5.5439239363366158E-2,5.3605628077960613E-2]
["GW outflow from pumping - Muni - Tall Timbers (m3)",{"$f":"B$139*$P65*(T65*(365/B$139))","v":2021.9944396672759},{"$f":"C$139*$P65*(U65*(365/C$139))","v":1546.0162721452007},{"$f":"D$139*$P65*(V65*(365/D$139))","v":1609.0413924927132},{"$f":"E$139*$P65*(W65*(365/E$139))","v":1696.6464198974147},{"$f":"F$139*$P65*(X65*(365/F$139))","v":2012.6669443283777},{"$f":"G$139*$P65*(Y65*(365/G$139))","v":3278.3805568451357},{"$f":"H$139*$P65*(Z65*(365/H$139))","v":3245.5588938687838},{"$f":"I$139*$P65*(AA65*(365/I$139))","v":1741.2939344367803},{"$f":"J$139*$P65*(AB65*(365/J$139))","v":1708.8863292119981},{"$f":"K$139*$P65*(AC65*(365/K$139))","v":1108.5711096317011},{"$f":"L$139*$P65*(AD65*(365/L$139))","v":1551.4318147233655},{"$f":"M$139*$P65*(AE65*(365/M$139))","v":1474.5118927512549},{"$f":"SUM(B65:M65)","v":22995},null,{"$f":"63*'Form Control Selectors'!K43","v":63},"m3/d",63,null,8.7931917358872611E-2,6.7232714596442728E-2,6.9973533050346301E-2,7.3783275490211561E-2,8.7526285902516973E-2,0.14256927840161496,0.14114193928544397,7.5724893865482951E-2,7.431556117469007E-2,4.8209224163152917E-2,6.7468224167139185E-2,6.412315254408589E-2]
["GW outflow from pumping - Muni - Acadia 1 (m3)",{"$f":"B$139*$P66*(T66*(365/B$139))","v":501.0647907833071},{"$f":"C$139*$P66*(U66*(365/C$139))","v":524.61636024997961},{"$f":"D$139*$P66*(V66*(365/D$139))","v":491.81490648861734},{"$f":"E$139*$P66*(W66*(365/E$139))","v":596.23082715900398},{"$f":"F$139*$P66*(X66*(365/F$139))","v":718.89911746333019},{"$f":"G$139*$P66*(Y66*(365/G$139))","v":1130.9214113640455},{"$f":"H$139*$P66*(Z66*(365/H$139))","v":1536.5391062977233},{"$f":"I$139*$P66*(AA66*(365/I$139))","v":1237.8581042175128},{"$f":"J$139*$P66*(AB66*(365/J$139))","v":742.81987540957857},{"$f":"K$139*$P66*(AC66*(365/K$139))","v":567.02236189013092},{"$f":"L$139*$P66*(AD66*(365/L$139))","v":550.840107941067},{"$f":"M$139*$P66*(AE66*(365/M$139))","v":526.37303073570445},{"$f":"SUM(B66:M66)","v":9125},null,{"$f":"25*'Form Control Selectors'!K49","v":25},"m3/d",25,null,5.491120994885558E-2,5.749220386301146E-2,5.3897523998752583E-2,6.534036462016482E-2,7.8783464927488236E-2,0.12393659302619676,0.16838784726550393,0.13565568265397401,8.1404917853104511E-2,6.2139436919466405E-2,6.0366039226418304E-2,5.7684715697063509E-2]
["GW outflow - ICI - Britco, Poppy Est., Spring Valley (m3)",{"$f":"B$139*$P67*(T67*(365/B$139))","v":71378.768533055962},{"$f":"C$139*$P67*(U67*(365/C$139))","v":71572.203250092018},76349.119996322843,79527.647964632983,81730.616028477511,93450.612956957601,109003.72263199354,97406.979599320024,86509.895669564416,77593.711459890226,73848.180705694249,71873.541203998539,{"$f":"SUM(B67:M67)","v":990244.99999999977},null,2713,"m3/d",2712.9999999999995,null,{"$f":"VLOOKUP('Form Control Selectors'!$K$23,'Water Budget Distributions'!$AR$16:$BE$22,2,FALSE)","v":7.2081927738141538E-2},{"$f":"VLOOKUP('Form Control Selectors'!$K$23,'Water Budget Distributions'!$AR$16:$BE$22,3,FALSE)","v":7.2277267999426423E-2},{"$f":"VLOOKUP('Form Control Selectors'!$K$23,'Water Budget Distributions'!$AR$16:$BE$22,4,FALSE)","v":7.7101242618062032E-2},{"$f":"VLOOKUP('Form Control Selectors'!$K$23,'Water Budget Distributions'!$AR$16:$BE$22,5,FALSE)","v":8.0311082575153611E-2},{"$f":"VLOOKUP('Form Control Selectors'!$K$23,'Water Budget Distributions'!$AR$16:$BE$22,6,FALSE)","v":8.2535752292086817E-2},{"$f":"VLOOKUP('Form Control Selectors'!$K$23,'Water Budget Distributions'!$AR$16:$BE$22,7,FALSE)","v":9.4371204052489638E-2},{"$f":"VLOOKUP('Form Control Selectors'!$K$23,'Water Budget Distributions'!$AR$16:$BE$22,8,FALSE)","v":0.11007752892667325},{"$f":"VLOOKUP('Form Control Selectors'!$K$23,'Water Budget Distributions'!$AR$16:$BE$22,9,FALSE)","v":9.8366545248216392E-2},{"$f":"VLOOKUP('Form Control Selectors'!$K$23,'Water Budget Distributions'!$AR$16:$BE$22,10,FALSE)","v":8.7362113082686016E-2},{"$f":"VLOOKUP('Form Control Selectors'!$K$23,'Water Budget Distributions'!$AR$16:$BE$22,11,FALSE)","v":7.8358094673429537E-2},{"$f":"VLOOKUP('Form Control Selectors'!$K$23,'Water Budget Distributions'!$AR$16:$BE$22,12,FALSE)","v":7.4575666330750731E-2},{"$f":"VLOOKUP('Form Control Selectors'!$K$23,'Water Budget Distributions'!$AR$16:$BE$22,13,FALSE)","v":7.2581574462883977E-2}]
["GW outflow from pumping - Private minor users (m3)",null,null,null,null,null,null,null,null,null,null,null,null,null,null,null,"m3/d",0]
["TOTAL",{"$f":"SUM(B58:B68)","v":2674657.5974368225},{"$f":"SUM(C58:C68)","v":2427939.3790564919},2684615.7772854287,2612025.9405909553,2704284.7264387817,2642119.7905752044,2751600.0512881051,2737178.0752011342,2632325.4784271587,2690089.5910570472,2595823.4289760562,2676070.1636668127,{"$f":"SUM(N58:N68)","v":31828730}]
[]
["SURPLUS/ DEFICIT (m3)",{"$f":"B54-B69","v":28573.402563177515},{"$f":"C54-C69","v":13688.620943508111},18615.222714571282,4004.059409044683,-1053.7264387817122,-26089.790575204417,-48369.051288105082,-33947.075201134197,-16295.478427158669,13141.408942952752,20206.571023943834,27160.836333187297,-365]
[]
["Equivalent GWL Change Across Aquifer (m) ",{"$f":"(B71/($L$16*1000000))/$L$15","v":0.20600867024641323},{"$f":"(C71/($L$16*1000000))/$L$15","v":9.8692292310801094E-2},0.13421213204449375,2.8868488890012135E-2,-7.5971625002286391E-3,-0.18810231128481913,-0.34873144403824863,-0.24475180390147225,-0.11748722730467678,9.4747000309680987E-2,0.14568544357565852,0.19582434270502738,-2.6315789473684214E-3]
["Cumulative GWL Change Across Aquifer (m) ",{"$f":"B73","v":0.20600867024641323},{"$f":"C73+B74","v":0.30470096255721435},{"$f":"D73+C74","v":0.43891309460170813},0.46778158349172028,0.46018442099149165,0.27208210970667251,-7.6649334331576113E-2,-0.32140113823304839,-0.43888836553772514,-0.34414136522804417,-0.19845592165238565,-2.6315789473582707E-3]
[]
["INFLOWS TO AQUIFER (DRY YEAR - 1951)",null,null,null,null,null,null,null,null,null,null,null,null,null,null,null,null,null,null,"Monthly Distributions"]
["INFLOW SOURCE / TYPE","JAN","FEB","MAR","APR","MAY","JUN","JUL","AUG","SEP","OCT","NOV","DEC","ANNUAL",null,"Flow per day to distribute",null,"Check",null,"JAN","FEB","MAR","APR","MAY","JUN","JUL","AUG","SEP","OCT","NOV","DEC"]
["GW inflow from surrounding aquitards (m3)",{"$f":"B$139*$P78","v":2411707},2178316,2411707,2333910,2411707,2333910,2411707,2411707,2333910,2411707,2333910,2411707,{"$f":"SUM(B78:M78)","v":28395905},null,77797,"m3/d",{"$f":"N78/365","v":77797}]
["GW inflow from Abbotsford (m3)",21359,19292,21359,20670,21359,20670,21359,21359,20670,21359,20670,21359,{"$f":"SUM(B79:M79)","v":251485},null,689,"m3/d",{"$f":"N79/365","v":689}]
["GW inflow from Brookswood (m3)",12896,11648,12896,12480,12896,12480,12896,12896,12480,12896,12480,12896,151840,null,416,"m3/d",{"$f":"N80/365","v":416}]
["GW inflow from Hopington AB (m3)",10478,9464,10478,10140,10478,10140,10478,10478,10140,10478,10140,10478,123370,null,338,"m3/d",338]
["GW inflow from Hopington C (m3)",233089,210532,233089,225570,233089,225570,233089,233089,225570,233089,225570,233089,2744435,null,7519,"m3/d",7519]
["GW inflow from South of Hopington (m3)",13702,12376,13702,13260,13702,13260,13702,13702,13260,13702,13260,13702,161330,null,442,"m3/d",442]
[]
["TOTAL",{"$f":"SUM(B78:B84)","v":2703231},{"$f":"SUM(C78:C84)","v":2441628},2703231,2616030,2703231,2616030,2703231,2703231,2616030,2703231,2616030,2703231,31828365]
[]
["OUTFLOWS FROM AQUIFER (DRY YEAR - 1951)",null,null,null,null,null,null,null,null,null,null,null,null,null,null,null,null,null,null,"Monthly Distributions"]
["OUTFLOW SOURCE / TYPE","JAN","FEB","MAR","APR","MAY","JUN","JUL","AUG","SEP","OCT","NOV","DEC","ANNUAL",null,"Flow per day to distribute",null,"Check",null,"JAN","FEB","MAR","APR","MAY","JUN","JUL","AUG","SEP","OCT","NOV","DEC"]
["GW outflow to surrounding aquitards (m3)",{"$f":"B$139*$P89","v":2344344},2117472,2344344,2268720,2344344,2268720,2344344,2344344,2268720,2344344,2268720,2344344,{"$f":"SUM(B89:M89)","v":27602760},null,75624,"m3/d",{"$f":"N89/365","v":75624}]
["GW outflow to Abbotsford (m3)",174003,157164,174003,168390,174003,168390,174003,174003,168390,174003,168390,174003,{"$f":"SUM(B90:M90)","v":2048745},null,5613,"m3/d",{"$f":"N90/365","v":5613}]
["GW outflow to Hopington C (m3)",45942,41496,45942,44460,45942,44460,45942,45942,44460,45942,44460,45942,540930,null,1482,"m3/d",1482]
["GW outflow to South of Hopington (m3)",1829,1652,1829,1770,1829,1770,1829,1829,1770,1829,1770,1829,21535,null,59,"m3/d",59]
["GW outflow to Langley Upland Intertill (m3)",3379,3052,3379,3270,3379,3270,3379,3379,3270,3379,3270,3379,39785,null,109,"m3/d",109]
["GW outflow to South of Murrayville B (m3)",8339,7532,8339,8070,8339,8070,8339,8339,8070,8339,8070,8339,98185,null,269,"m3/d",269]
["GW outflow from pumping - Muni - Murrayville 2 (m3)",{"$f":"B$139*$P95*(T95*(365/B$139))","v":22919.76967331559},25928.543174004852,28329.800990124702,35525.415379266233,41986.544348512885,49579.875650037866,59978.230655945066,58955.943563159817,48683.876552972448,32984.286125635554,25192.976347697666,24359.737539327252,454424.99999999994,null,{"$f":"1245*'Form Control Selectors'!K37","v":1245},"m3/d",1244.9999999999998,null,5.0436859048942274E-2,5.7057915330373216E-2,6.2342082830224362E-2,7.817663064150572E-2,9.2394882210514132E-2,0.10910463915946057,0.13198708402034454,0.1297374562648618,0.10713291863997898,7.2584664412467526E-2,5.5439239363366158E-2,5.3605628077960613E-2]
["GW outflow from pumping - Muni - Tall Timbers (m3)",2021.9944396672759,1546.0162721452007,1609.0413924927132,1696.6464198974147,2012.6669443283777,3278.3805568451357,3245.5588938687838,1741.2939344367803,1708.8863292119981,1108.5711096317011,1551.4318147233655,1474.5118927512549,22995,null,{"$f":"63*'Form Control Selectors'!K43","v":63},"m3/d",63,null,8.7931917358872611E-2,6.7232714596442728E-2,6.9973533050346301E-2,7.3783275490211561E-2,8.7526285902516973E-2,0.14256927840161496,0.14114193928544397,7.5724893865482951E-2,7.431556117469007E-2,4.8209224163152917E-2,6.7468224167139185E-2,6.412315254408589E-2]
["GW outflow from pumping - Muni - Acadia 1 (m3)",501.0647907833071,524.61636024997961,491.81490648861734,596.23082715900398,718.89911746333019,1130.9214113640455,1536.5391062977233,1237.8581042175128,742.81987540957857,567.02236189013092,550.840107941067,526.37303073570445,9125,null,{"$f":"25*'Form Control Selectors'!K49","v":25},"m3/d",25,null,5.491120994885558E-2,5.749220386301146E-2,5.3897523998752583E-2,6.534036462016482E-2,7.8783464927488236E-2,0.12393659302619676,0.16838784726550393,0.13565568265397401,8.1404917853104511E-2,6.2139436919466405E-2,6.0366039226418304E-2,5.7684715697063509E-2]
["GW outflow - ICI - Britco, Poppy Est., Spring Valley (m3)",71378.768533055962,71572.203250092018,76349.119996322843,79527.647964632983,81730.616028477511,93450.612956957601,109003.72263199354,97406.979599320024,86509.895669564416,77593.711459890226,73848.180705694249,71873.541203998539,990244.99999999977,null,2713,"m3/d",2712.9999999999995,null,{"$f":"VLOOKUP('Form Control Selectors'!$K$23,'Water Budget Distributions'!$AR$16:$BE$22,2,FALSE)","v":7.2081927738141538E-2},{"$f":"VLOOKUP('Form Control Selectors'!$K$23,'Water Budget Distributions'!$AR$16:$BE$22,3,FALSE)","v":7.2277267999426423E-2},{"$f":"VLOOKUP('Form Control Selectors'!$K$23,'Water Budget Distributions'!$AR$16:$BE$22,4,FALSE)","v":7.7101242618062032E-2},{"$f":"VLOOKUP('Form Control Selectors'!$K$23,'Water Budget Distributions'!$AR$16:$BE$22,5,FALSE)","v":8.0311082575153611E-2},{"$f":"VLOOKUP('Form Control Selectors'!$K$23,'Water Budget Distributions'!$AR$16:$BE$22,6,FALSE)","v":8.2535752292086817E-2},{"$f":"VLOOKUP('Form Control Selectors'!$K$23,'Water Budget Distributions'!$AR$16:$BE$22,7,FALSE)","v":9.4371204052489638E-2},{"$f":"VLOOKUP('Form Control Selectors'!$K$23,'Water Budget Distributions'!$AR$16:$BE$22,8,FALSE)","v":0.11007752892667325},{"$f":"VLOOKUP('Form Control Selectors'!$K$23,'Water Budget Distributions'!$AR$16:$BE$22,9,FALSE)","v":9.8366545248216392E-2},{"$f":"VLOOKUP('Form Control Selectors'!$K$23,'Water Budget Distributions'!$AR$16:$BE$22,10,FALSE)","v":8.7362113082686016E-2},{"$f":"VLOOKUP('Form Control Selectors'!$K$23,'Water Budget Distributions'!$AR$16:$BE$22,11,FALSE)","v":7.8358094673429537E-2},{"$f":"VLOOKUP('Form Control Selectors'!$K$23,'Water Budget Distributions'!$AR$16:$BE$22,12,FALSE)","v":7.4575666330750731E-2},{"$f":"VLOOKUP('Form Control Selectors'!$K$23,'Water Budget Distributions'!$AR$16:$BE$22,13,FALSE)","v":7.2581574462883977E-2}]
["GW outflow from pumping - Private minor users (m3)",null,null,null,null,null,null,null,null,null,null,null,null,null,null,null,"m3/d",0]
["TOTAL",{"$f":"SUM(B89:B99)","v":2674657.5974368225},{"$f":"SUM(C89:C99)","v":2427939.3790564919},2684615.7772854287,2612025.9405909553,2704284.7264387817,2642119.7905752044,2751600.0512881051,2737178.0752011342,2632325.4784271587,2690089.5910570472,2595823.4289760562,2676070.1636668127,{"$f":"SUM(N89:N99)","v":31828730}]
[]
["SURPLUS/ DEFICIT (m3)",{"$f":"B85-B100","v":28573.402563177515},{"$f":"C85-C100","v":13688.620943508111},18615.222714571282,4004.059409044683,-1053.7264387817122,-26089.790575204417,-48369.051288105082,-33947.075201134197,-16295.478427158669,13141.408942952752,20206.571023943834,27160.836333187297,-365]
[]
["Equivalent GWL Change Across Aquifer (m) ",{"$f":"(B102/($L$16*1000000))/$L$15","v":0.20600867024641323},{"$f":"(C102/($L$16*1000000))/$L$15","v":9.8692292310801094E-2},0.13421213204449375,2.8868488890012135E-2,-7.5971625002286391E-3,-0.18810231128481913,-0.34873144403824863,-0.24475180390147225,-0.11748722730467678,9.4747000309680987E-2,0.14568544357565852,0.19582434270502738,-2.6315789473684214E-3]
["Cumulative GWL Change Across Aquifer (m) ",{"$f":"B104","v":0.20600867024641323},{"$f":"C104+B105","v":0.30470096255721435},{"$f":"D104+C105","v":0.43891309460170813},{"$f":"E104+D105","v":0.46778158349172028},{"$f":"F104+E105","v":0.46018442099149165},{"$f":"G104+F105","v":0.27208210970667251},{"$f":"H104+G105","v":-7.6649334331576113E-2},{"$f":"I104+H105","v":-0.32140113823304839},{"$f":"J104+I105","v":-0.43888836553772514},{"$f":"K104+J105","v":-0.34414136522804417},{"$f":"L104+K105","v":-0.19845592165238565},{"$f":"M104+L105","v":-2.6315789473582707E-3}]
[]
["INFLOWS TO AQUIFER (WET YEAR - 1971)",null,null,null,null,null,null,null,null,null,null,null,null,null,null,null,null,null,null,"Monthly Distributions"]
["INFLOW SOURCE / TYPE","JAN","FEB","MAR","APR","MAY","JUN","JUL","AUG","SEP","OCT","NOV","DEC","ANNUAL",null,"Flow per day to distribute",null,"Check",null,"JAN","FEB","MAR","APR","MAY","JUN","JUL","AUG","SEP","OCT","NOV","DEC"]
["GW inflow from surrounding aquitards (m3)",{"$f":"B$139*$P109","v":2411707},2178316,2411707,2333910,2411707,2333910,2411707,2411707,2333910,2411707,2333910,2411707,{"$f":"SUM(B109:M109)","v":28395905},null,77797,"m3/d",{"$f":"N109/365","v":77797}]
["GW inflow from Abbotsford (m3)",21359,19292,21359,20670,21359,20670,21359,21359,20670,21359,20670,21359,{"$f":"SUM(B110:M110)","v":251485},null,689,"m3/d",{"$f":"N110/365","v":689}]
["GW inflow from Brookswood (m3)",12896,11648,12896,12480,12896,12480,12896,12896,12480,12896,12480,12896,151840,null,416,"m3/d",{"$f":"N111/365","v":416}]
["GW inflow from Hopington AB (m3)",10478,9464,10478,10140,10478,10140,10478,10478,10140,10478,10140,10478,123370,null,338,"m3/d",338]
["GW inflow from Hopington C (m3)",233089,210532,233089,225570,233089,225570,233089,233089,225570,233089,225570,233089,2744435,null,7519,"m3/d",7519]
["GW inflow from South of Hopington (m3)",13702,12376,13702,13260,13702,13260,13702,13702,13260,13702,13260,13702,161330,null,442,"m3/d",442]
[]
["TOTAL",{"$f":"SUM(B109:B115)","v":2703231},{"$f":"SUM(C109:C115)","v":2441628},2703231,2616030,2703231,2616030,2703231,2703231,2616030,2703231,2616030,2703231,31828365]
[]
["OUTFLOWS FROM AQUIFER (WET YEAR - 1971)",null,null,null,null,null,null,null,null,null,null,null,null,null,null,null,null,null,null,"Monthly Distributions"]
["OUTFLOW SOURCE / TYPE","JAN","FEB","MAR","APR","MAY","JUN","JUL","AUG","SEP","OCT","NOV","DEC","ANNUAL",null,"Flow per day to distribute",null,"Check",null,"JAN","FEB","MAR","APR","MAY","JUN","JUL","AUG","SEP","OCT","NOV","DEC"]
["GW outflow to surrounding aquitards (m3)",{"$f":"B$139*$P120","v":2344344},2117472,2344344,2268720,2344344,2268720,2344344,2344344,2268720,2344344,2268720,2344344,{"$f":"SUM(B120:M120)","v":27602760},null,75624,"m3/d",{"$f":"N120/365","v":75624}]
["GW outflow to Abbotsford (m3)",174003,157164,174003,168390,174003,168390,174003,174003,168390,174003,168390,174003,{"$f":"SUM(B121:M121)","v":2048745},null,5613,"m3/d",{"$f":"N121/365","v":5613}]
["GW outflow to Hopington C (m3)",45942,41496,45942,44460,45942,44460,45942,45942,44460,45942,44460,45942,540930,null,1482,"m3/d",1482]
["GW outflow to South of Hopington (m3)",1829,1652,1829,1770,1829,1770,1829,1829,1770,1829,1770,1829,21535,null,59,"m3/d",59]
["GW outflow to Langley Upland Intertill (m3)",3379,3052,3379,3270,3379,3270,3379,3379,3270,3379,3270,3379,39785,null,109,"m3/d",109]
["GW outflow to South of Murrayville B (m3)",8339,7532,8339,8070,8339,8070,8339,8339,8070,8339,8070,8339,98185,null,269,"m3/d",269]
["GW outflow from pumping - Muni - Murrayville 2 (m3)",{"$f":"B$139*$P126*(T126*(365/B$139))","v":22919.76967331559},25928.543174004852,28329.800990124702,35525.415379266233,41986.544348512885,49579.875650037866,59978.230655945066,58955.943563159817,48683.876552972448,32984.286125635554,25192.976347697666,24359.737539327252,454424.99999999994,null,{"$f":"1245*'Form Control Selectors'!K37","v":1245},"m3/d",1244.9999999999998,null,5.0436859048942274E-2,5.7057915330373216E-2,6.2342082830224362E-2,7.817663064150572E-2,9.2394882210514132E-2,0.10910463915946057,0.13198708402034454,0.1297374562648618,0.10713291863997898,7.2584664412467526E-2,5.5439239363366158E-2,5.3605628077960613E-2]
["GW outflow from pumping - Muni - Tall Timbers (m3)",2021.9944396672759,1546.0162721452007,1609.0413924927132,1696.6464198974147,2012.6669443283777,3278.3805568451357,3245.5588938687838,1741.2939344367803,1708.8863292119981,1108.5711096317011,1551.4318147233655,1474.5118927512549,22995,null,{"$f":"63*'Form Control Selectors'!K43","v":63},"m3/d",63,null,8.7931917358872611E-2,6.7232714596442728E-2,6.9973533050346301E-2,7.3783275490211561E-2,8.7526285902516973E-2,0.14256927840161496,0.14114193928544397,7.5724893865482951E-2,7.431556117469007E-2,4.8209224163152917E-2,6.7468224167139185E-2,6.412315254408589E-2]
["GW outflow from pumping - Muni - Acadia 1 (m3)",501.0647907833071,524.61636024997961,491.81490648861734,596.23082715900398,718.89911746333019,1130.9214113640455,1536.5391062977233,1237.8581042175128,742.81987540957857,567.02236189013092,550.840107941067,526.37303073570445,9125,null,{"$f":"25*'Form Control Selectors'!K49","v":25},"m3/d",25,null,5.491120994885558E-2,5.749220386301146E-2,5.3897523998752583E-2,6.534036462016482E-2,7.8783464927488236E-2,0.12393659302619676,0.16838784726550393,0.13565568265397401,8.1404917853104511E-2,6.2139436919466405E-2,6.0366039226418304E-2,5.7684715697063509E-2]
["GW outflow - ICI - Britco, Poppy Est., Spring Valley (m3)",71378.768533055962,71572.203250092018,76349.119996322843,79527.647964632983,81730.616028477511,93450.612956957601,109003.72263199354,97406.979599320024,86509.895669564416,77593.711459890226,73848.180705694249,71873.541203998539,990244.99999999977,null,2713,"m3/d",2712.9999999999995,null,{"$f":"VLOOKUP('Form Control Selectors'!$K$23,'Water Budget Distributions'!$AR$16:$BE$22,2,FALSE)","v":7.2081927738141538E-2},{"$f":"VLOOKUP('Form Control Selectors'!$K$23,'Water Budget Distributions'!$AR$16:$BE$22,3,FALSE)","v":7.2277267999426423E-2},{"$f":"VLOOKUP('Form Control Selectors'!$K$23,'Water Budget Distributions'!$AR$16:$BE$22,4,FALSE)","v":7.7101242618062032E-2},{"$f":"VLOOKUP('Form Control Selectors'!$K$23,'Water Budget Distributions'!$AR$16:$BE$22,5,FALSE)","v":8.0311082575153611E-2},{"$f":"VLOOKUP('Form Control Selectors'!$K$23,'Water Budget Distributions'!$AR$16:$BE$22,6,FALSE)","v":8.2535752292086817E-2},{"$f":"VLOOKUP('Form Control Selectors'!$K$23,'Water Budget Distributions'!$AR$16:$BE$22,7,FALSE)","v":9.4371204052489638E-2},{"$f":"VLOOKUP('Form Control Selectors'!$K$23,'Water Budget Distributions'!$AR$16:$BE$22,8,FALSE)","v":0.11007752892667325},{"$f":"VLOOKUP('Form Control Selectors'!$K$23,'Water Budget Distributions'!$AR$16:$BE$22,9,FALSE)","v":9.8366545248216392E-2},{"$f":"VLOOKUP('Form Control Selectors'!$K$23,'Water Budget Distributions'!$AR$16:$BE$22,10,FALSE)","v":8.7362113082686016E-2},{"$f":"VLOOKUP('Form Control Selectors'!$K$23,'Water Budget Distributions'!$AR$16:$BE$22,11,FALSE)","v":7.8358094673429537E-2},{"$f":"VLOOKUP('Form Control Selectors'!$K$23,'Water Budget Distributions'!$AR$16:$BE$22,12,FALSE)","v":7.4575666330750731E-2},{"$f":"VLOOKUP('Form Control Selectors'!$K$23,'Water Budget Distributions'!$AR$16:$BE$22,13,FALSE)","v":7.2581574462883977E-2}]
["GW outflow from pumping - Private minor users (m3)",null,null,null,null,null,null,null,null,null,null,null,null,null,null,null,"m3/d",0]
["TOTAL",{"$f":"SUM(B120:B130)","v":2674657.5974368225},{"$f":"SUM(C120:C130)","v":2427939.3790564919},2684615.7772854287,2612025.9405909553,2704284.7264387817,2642119.7905752044,2751600.0512881051,2737178.0752011342,2632325.4784271587,2690089.5910570472,2595823.4289760562,2676070.1636668127,{"$f":"SUM(N120:N130)","v":31828730}]
[]
["SURPLUS/ DEFICIT (m3)",{"$f":"B116-B131","v":28573.402563177515},{"$f":"C116-C131","v":13688.620943508111},18615.222714571282,4004.059409044683,-1053.7264387817122,-26089.790575204417,-48369.051288105082,-33947.075201134197,-16295.478427158669,13141.408942952752,20206.571023943834,27160.836333187297,-365]
[]
["Equivalent GWL Change Across Aquifer (m) ",{"$f":"(B133/($L$16*1000000))/$L$15","v":0.20600867024641323},{"$f":"(C133/($L$16*1000000))/$L$15","v":9.8692292310801094E-2},0.13421213204449375,2.8868488890012135E-2,-7.5971625002286391E-3,-0.18810231128481913,-0.34873144403824863,-0.24475180390147225,-0.11748722730467678,9.4747000309680987E-2,0.14568544357565852,0.19582434270502738,-2.6315789473684214E-3]
["Cumulative GWL Change Across Aquifer (m) ",{"$f":"B135","v":0.20600867024641323},{"$f":"C135+B136","v":0.30470096255721435},{"$f":"D135+C136","v":0.43891309460170813},{"$f":"E135+D136","v":0.46778158349172028},{"$f":"F135+E136","v":0.46018442099149165},{"$f":"G135+F136","v":0.27208210970667251},{"$f":"H135+G136","v":-7.6649334331576113E-2},{"$f":"I135+H136","v":-0.32140113823304839},{"$f":"J135+I136","v":-0.43888836553772514},{"$f":"K135+J136","v":-0.34414136522804417},{"$f":"L135+K136","v":-0.19845592165238565},{"$f":"M135+L136","v":-2.6315789473582707E-3}]
[]
[]
["Days in Month",31,28,31,30,31,30,31,31,30,31,30,31]

{"sheet":"S of Murrayville AC - Analysis","index":9,"n_rows":129,"n_cols":31,"rows_kept":129,"cut":false,"hidden":false,"merged":[[14,11,14,12],[15,11,15,12],[16,11,16,12],[10,11,10,12]]}
[]
[]
[]
[]
[]
[]
["AQUIFER - South of Murrayville AC / Beaver River B  Aquifer"]
["TYPE - 4b, Confined sand and gravel aquifer of glacial and preglacial origin"]
["CLASSIFICATION - TBD"]
["RANKING - TBD"]
["AQUIFER SIZE - 73.47 km2",null,null,null,null,null,"ALLOCATED WATER USE",null,null,null,null,null,null,"Units","User-Defined - Provided for accounting and reporting purposes and does not affect the moedl results directly"]
[]
["LOCATION",null,null,null,null,null,"AQUIFER PARAMETERS AND SELECTION"]
[]
[null,null,null,null,null,null,"Storativity",null,null,null,null,1E-3,null,"(-)","Recommended value = 0.001"]
[null,null,null,null,null,null,"Aquifer Size - in Plan View",null,null,null,null,73.47,null,"km2","Recommended value = 73.47"]
[]
[]
[null,null,null,null,null,null,"Private Water Users Distribution Method",null,null,null,null,null,null,null,"    NOT USED CURRENTLY"]
[]
[]
[]
[]
[]
[]
[]
[]
[]
[]
[]
[]
[]
[]
[]
[]
[]
[]
[]
[]
["*Golder interpretation of Township of Langley deep confined aquifers shown (Golder 2005, 2014)"]
[]
[]
[]
[]
["INFLOWS TO AQUIFER (AVERAGE YEAR - 1945-2012)",null,null,null,null,null,null,null,null,null,null,null,null,null,null,null,null,null,null,"Monthly Distributions"]
["INFLOW SOURCE / TYPE","JAN","FEB","MAR","APR","MAY","JUN","JUL","AUG","SEP","OCT","NOV","DEC","ANNUAL",null,"Flow per day to distribute",null,"Check",null,"JAN","FEB","MAR","APR","MAY","JUN","JUL","AUG","SEP","OCT","NOV","DEC"]
["GW inflow from surrounding aquitards (m3)",{"$f":"B$129*$P47","v":1719074},1552712,1719074,1663620,1719074,1663620,1719074,1719074,1663620,1719074,1663620,1719074,{"$f":"SUM(B47:M47)","v":20240710},null,55454,"m3/d",{"$f":"N47/365","v":55454}]
["GW inflow from South of Murrayville B aquifer (m3)",2092.5,1890,2092.5,2025,2092.5,2025,2092.5,2092.5,2025,2092.5,2025,2092.5,{"$f":"SUM(B48:M48)","v":24637.5},null,67.5,"m3/d",{"$f":"N48/365","v":67.5}]
["GW inflow from Langley Upland Intertill aquifer (m3)",67208,60704,67208,65040,67208,65040,67208,67208,65040,67208,65040,67208,791320,null,2168,"m3/d",{"$f":"N49/365","v":2168}]
[]
[]
[]
[]
["TOTAL",{"$f":"SUM(B47:B53)","v":1788374.5},{"$f":"SUM(C47:C53)","v":1615306},1788374.5,1730685,1788374.5,1730685,1788374.5,1788374.5,1730685,1788374.5,1730685,1788374.5,21056667.5]
[]
["OUTFLOWS FROM AQUIFER (AVERAGE YEAR, 1945-2012)",null,null,null,null,null,null,null,null,null,null,null,null,null,null,null,null,null,null,"Monthly Distributions"]
["OUTFLOW SOURCE / TYPE","JAN","FEB","MAR","APR","MAY","JUN","JUL","AUG","SEP","OCT","NOV","DEC","ANNUAL",null,"Flow per day to distribute",null,"Check",null,"JAN","FEB","MAR","APR","MAY","JUN","JUL","AUG","SEP","OCT","NOV","DEC"]
["GW outflow to surrounding aquitards (m3)",{"$f":"B$129*$P58","v":1754972},1585136,1754972,1698360,1754972,1698360,1754972,1754972,1698360,1754972,1698360,1754972,{"$f":"SUM(B58:M58)","v":20663380},null,56612,"m3/d",{"$f":"N58/365","v":56612}]
["GW outflow to South of Murrayville B aquifer (m3)",372,336,372,360,372,360,372,372,360,372,360,372,{"$f":"SUM(B59:M59)","v":4380},null,12,"m3/d",{"$f":"N59/365","v":12}]
["GW outflow to Langley Upland Intertill aquifer (m3)",19313,17444,19313,18690,19313,18690,19313,19313,18690,19313,18690,19313,227395,null,623,"m3/d",623]
["GW outflow from pumping - Muni - Murrayville 1 (m3) ",{"$f":"B$129*$P61*(T61*(365/B$129))","v":8223.0887382576584},{"$f":"C$129*$P61*(U61*(365/C$129))","v":9613.4337886834164},9427.6576358964212,11694.940943704665,16098.2428866599,19685.621744055075,21452.453659812945,18683.662606386068,15001.885028124792,11779.750864434878,9606.2341592328485,10063.027944751298,161329.99999999994,null,{"$f":"442*'Form Control Selectors'!L37","v":442},"m3/d",441.99999999999983,null,5.0970611406791412E-2,5.9588630686688251E-2,5.8437101815511198E-2,7.2490801113894915E-2,9.9784558895803024E-2,0.12202083768707046,0.13297250145548223,0.11581021884575757,9.2988811926639769E-2,7.3016493302143923E-2,5.9544003962268943E-2,6.2375428901948173E-2]
[null,null,null,null,null,null,null,null,null,null,null,null,null,null,null,null,"m3/d",0]
[]
["TOTAL",{"$f":"SUM(B58:B63)","v":1782880.0887382578},{"$f":"SUM(C58:C63)","v":1612529.4337886835},1784084.6576358965,1729104.9409437047,1790755.2428866599,1737095.6217440551,1796109.4536598129,1793340.662606386,1732411.8850281248,1786436.750864435,1727016.2341592328,1784720.0279447513,21056485]
[]
["SURPLUS/ DEFICIT (m3)",{"$f":"B54-B64","v":5494.4112617422361},{"$f":"C54-C64","v":2776.5662113165017},4289.8423641035333,1580.0590562953148,-2380.7428866599221,-6410.6217440550681,-7734.9536598129198,-4966.1626063860022,-1726.8850281247869,1937.7491355650127,3668.7658407671843,3654.4720552486833,182.5]
[]
["Equivalent GWL Change Across Aquifer (m) ",{"$f":"(B66/($L$16*1000000))/$L$15","v":7.4784418970222352E-2},{"$f":"(C66/($L$16*1000000))/$L$15","v":3.7791836277616737E-2},5.838903449167733E-2,2.1506180159184905E-2,-3.2404285921599593E-2,-8.7254957724990714E-2,-0.10528043636603947,-6.7594427744467153E-2,-2.3504628122019696E-2,2.6374699000476558E-2,4.9935563369636372E-2,4.9741010688018013E-2,2.4840070777187966E-3]
["Cumulative GWL Change Across Aquifer (m) ",{"$f":"B68","v":7.4784418970222352E-2},{"$f":"C68+B69","v":0.1125762552478391},{"$f":"D68+C69","v":0.17096528973951641},0.19247146989870131,0.16006718397710173,7.281222625211102E-2,-3.2468210113928447E-2,-0.1000626378583956,-0.1235672659804153,-9.7192566979938749E-2,-4.7257003610302377E-2,2.4840070777156359E-3]
[]
["INFLOWS TO AQUIFER (DRY YEAR - 1951)",null,null,null,null,null,null,null,null,null,null,null,null,null,null,null,null,null,null,"Monthly Distributions"]
["INFLOW SOURCE / TYPE","JAN","FEB","MAR","APR","MAY","JUN","JUL","AUG","SEP","OCT","NOV","DEC","ANNUAL",null,"Flow per day to distribute",null,"Check",null,"JAN","FEB","MAR","APR","MAY","JUN","JUL","AUG","SEP","OCT","NOV","DEC"]
["GW inflow from surrounding aquitards (m3)",{"$f":"B$129*$P73","v":1719074},1552712,1719074,1663620,1719074,1663620,1719074,1719074,1663620,1719074,1663620,1719074,{"$f":"SUM(B73:M73)","v":20240710},null,55454,"m3/d",{"$f":"N73/365","v":55454}]
["GW inflow from South of Murrayville B aquifer (m3)",2092.5,1890,2092.5,2025,2092.5,2025,2092.5,2092.5,2025,2092.5,2025,2092.5,{"$f":"SUM(B74:M74)","v":24637.5},null,67.5,"m3/d",{"$f":"N74/365","v":67.5}]
["GW inflow from Langley Upland Intertill aquifer (m3)",67208,60704,67208,65040,67208,65040,67208,67208,65040,67208,65040,67208,791320,null,2168,"m3/d",{"$f":"N75/365","v":2168}]
[]
[]
[]
[]
["TOTAL",{"$f":"SUM(B73:B79)","v":1788374.5},{"$f":"SUM(C73:C79)","v":1615306},1788374.5,1730685,1788374.5,1730685,1788374.5,1788374.5,1730685,1788374.5,1730685,1788374.5,21056667.5]
[]
["OUTFLOWS FROM AQUIFER (DRY YEAR - 1951)",null,null,null,null,null,null,null,null,null,null,null,null,null,null,null,null,null,null,"Monthly Distributions"]
["OUTFLOW SOURCE / TYPE","JAN","FEB","MAR","APR","MAY","JUN","JUL","AUG","SEP","OCT","NOV","DEC","ANNUAL",null,"Flow per day to distribute",null,"Check",null,"JAN","FEB","MAR","APR","MAY","JUN","JUL","AUG","SEP","OCT","NOV","DEC"]
["GW outflow to surrounding aquitards (m3)",{"$f":"B$129*$P84","v":1754972},1585136,1754972,1698360,1754972,1698360,1754972,1754972,1698360,1754972,1698360,1754972,{"$f":"SUM(B84:M84)","v":20663380},null,56612,"m3/d",{"$f":"N84/365","v":56612}]
["GW outflow to South of Murrayville B aquifer (m3)",372,336,372,360,372,360,372,372,360,372,360,372,4380,null,12,"m3/d",{"$f":"N85/365","v":12}]
["GW outflow to Langley Upland Intertill aquifer (m3)",19313,17444,19313,18690,19313,18690,19313,19313,18690,19313,18690,19313,227395,null,623,"m3/d",623]
["GW outflow from pumping - Muni - Murrayville 1 (m3) ",{"$f":"B$129*$P87*(T87*(365/B$129))","v":8223.0887382576584},{"$f":"C$129*$P87*(U87*(365/C$129))","v":9613.4337886834164},{"$f":"D$129*$P87*(V87*(365/D$129))","v":9427.6576358964212},{"$f":"E$129*$P87*(W87*(365/E$129))","v":11694.940943704665},{"$f":"F$129*$P87*(X87*(365/F$129))","v":16098.2428866599},{"$f":"G$129*$P87*(Y87*(365/G$129))","v":19685.621744055075},{"$f":"H$129*$P87*(Z87*(365/H$129))","v":21452.453659812945},{"$f":"I$129*$P87*(AA87*(365/I$129))","v":18683.662606386068},{"$f":"J$129*$P87*(AB87*(365/J$129))","v":15001.885028124792},{"$f":"K$129*$P87*(AC87*(365/K$129))","v":11779.750864434878},{"$f":"L$129*$P87*(AD87*(365/L$129))","v":9606.2341592328485},{"$f":"M$129*$P87*(AE87*(365/M$129))","v":10063.027944751298},161329.99999999994,null,{"$f":"442*'Form Control Selectors'!K43","v":442},"m3/d",441.99999999999983,null,5.0970611406791412E-2,5.9588630686688251E-2,5.8437101815511198E-2,7.2490801113894915E-2,9.9784558895803024E-2,0.12202083768707046,0.13297250145548223,0.11581021884575757,9.2988811926639769E-2,7.3016493302143923E-2,5.9544003962268943E-2,6.2375428901948173E-2]
[null,null,null,null,null,null,null,null,null,null,null,null,null,null,null,null,"m3/d",0]
[]
["TOTAL",{"$f":"SUM(B84:B89)","v":1782880.0887382578},{"$f":"SUM(C84:C89)","v":1612529.4337886835},1784084.6576358965,1729104.9409437047,1790755.2428866599,1737095.6217440551,1796109.4536598129,1793340.662606386,1732411.8850281248,1786436.750864435,1727016.2341592328,1784720.0279447513,21056485]
[]
["SURPLUS/ DEFICIT (m3)",{"$f":"B80-B90","v":5494.4112617422361},{"$f":"C80-C90","v":2776.5662113165017},4289.8423641035333,1580.0590562953148,-2380.7428866599221,-6410.6217440550681,-7734.9536598129198,-4966.1626063860022,-1726.8850281247869,1937.7491355650127,3668.7658407671843,3654.4720552486833,182.5]
[]
["Equivalent GWL Change Across Aquifer (m) ",{"$f":"(B92/($L$16*1000000))/$L$15","v":7.4784418970222352E-2},{"$f":"(C92/($L$16*1000000))/$L$15","v":3.7791836277616737E-2},5.838903449167733E-2,2.1506180159184905E-2,-3.2404285921599593E-2,-8.7254957724990714E-2,-0.10528043636603947,-6.7594427744467153E-2,-2.3504628122019696E-2,2.6374699000476558E-2,4.9935563369636372E-2,4.9741010688018013E-2,2.4840070777187966E-3]
["Cumulative GWL Change Across Aquifer (m) ",{"$f":"B94","v":7.4784418970222352E-2},{"$f":"C94+B95","v":0.1125762552478391},{"$f":"D94+C95","v":0.17096528973951641},{"$f":"E94+D95","v":0.19247146989870131},{"$f":"F94+E95","v":0.16006718397710173},{"$f":"G94+F95","v":7.281222625211102E-2},{"$f":"H94+G95","v":-3.2468210113928447E-2},{"$f":"I94+H95","v":-0.1000626378583956},{"$f":"J94+I95","v":-0.1235672659804153},{"$f":"K94+J95","v":-9.7192566979938749E-2},{"$f":"L94+K95","v":-4.7257003610302377E-2},{"$f":"M94+L95","v":2.4840070777156359E-3}]
[]
["INFLOWS TO AQUIFER (WET YEAR - 1971)",null,null,null,null,null,null,null,null,null,null,null,null,null,null,null,null,null,null,"Monthly Distributions"]
["INFLOW SOURCE / TYPE","JAN","FEB","MAR","APR","MAY","JUN","JUL","AUG","SEP","OCT","NOV","DEC","ANNUAL",null,"Flow per day to distribute",null,"Check",null,"JAN","FEB","MAR","APR","MAY","JUN","JUL","AUG","SEP","OCT","NOV","DEC"]
["GW inflow from surrounding aquitards (m3)",{"$f":"B$129*$P99","v":1719074},1552712,1719074,1663620,1719074,1663620,1719074,1719074,1663620,1719074,1663620,1719074,{"$f":"SUM(B99:M99)","v":20240710},null,55454,"m3/d",{"$f":"N99/365","v":55454}]
["GW inflow from South of Murrayville B aquifer (m3)",2092.5,1890,2092.5,2025,2092.5,2025,2092.5,2092.5,2025,2092.5,2025,2092.5,{"$f":"SUM(B100:M100)","v":24637.5},null,67.5,"m3/d",{"$f":"N100/365","v":67.5}]
["GW inflow from Langley Upland Intertill aquifer (m3)",67208,60704,67208,65040,67208,65040,67208,67208,65040,67208,65040,67208,791320,null,2168,"m3/d",{"$f":"N101/365","v":2168}]
[]
[]
[]
[]
["TOTAL",{"$f":"SUM(B99:B105)","v":1788374.5},{"$f":"SUM(C99:C105)","v":1615306},1788374.5,1730685,1788374.5,1730685,1788374.5,1788374.5,1730685,1788374.5,1730685,1788374.5,21056667.5]
[]
["OUTFLOWS FROM AQUIFER (WET YEAR - 1971)",null,null,null,null,null,null,null,null,null,null,null,null,null,null,null,null,null,null,"Monthly Distributions"]
["OUTFLOW SOURCE / TYPE","JAN","FEB","MAR","APR","MAY","JUN","JUL","AUG","SEP","OCT","NOV","DEC","ANNUAL",null,"Flow per day to distribute",null,"Check",null,"JAN","FEB","MAR","APR","MAY","JUN","JUL","AUG","SEP","OCT","NOV","DEC"]
["GW outflow to surrounding aquitards (m3)",{"$f":"B$129*$P110","v":1754972},1585136,1754972,1698360,1754972,1698360,1754972,1754972,1698360,1754972,1698360,1754972,{"$f":"SUM(B110:M110)","v":20663380},null,56612,"m3/d",{"$f":"N110/365","v":56612}]
["GW outflow to South of Murrayville B aquifer (m3)",372,336,372,360,372,360,372,372,360,372,360,372,4380,null,12,"m3/d",{"$f":"N111/365","v":12}]
["GW outflow to Langley Upland Intertill aquifer (m3)",19313,17444,19313,18690,19313,18690,19313,19313,18690,19313,18690,19313,227395,null,623,"m3/d",623]
["GW outflow from pumping - Muni - Murrayville 1 (m3) ",{"$f":"B$129*$P113*(T113*(365/B$129))","v":8223.0887382576584},{"$f":"C$129*$P113*(U113*(365/C$129))","v":9613.4337886834164},{"$f":"D$129*$P113*(V113*(365/D$129))","v":9427.6576358964212},{"$f":"E$129*$P113*(W113*(365/E$129))","v":11694.940943704665},{"$f":"F$129*$P113*(X113*(365/F$129))","v":16098.2428866599},{"$f":"G$129*$P113*(Y113*(365/G$129))","v":19685.621744055075},{"$f":"H$129*$P113*(Z113*(365/H$129))","v":21452.453659812945},{"$f":"I$129*$P113*(AA113*(365/I$129))","v":18683.662606386068},{"$f":"J$129*$P113*(AB113*(365/J$129))","v":15001.885028124792},{"$f":"K$129*$P113*(AC113*(365/K$129))","v":11779.750864434878},{"$f":"L$129*$P113*(AD113*(365/L$129))","v":9606.2341592328485},{"$f":"M$129*$P113*(AE113*(365/M$129))","v":10063.027944751298},161329.99999999994,null,{"$f":"442*'Form Control Selectors'!L37","v":442},"m3/d",441.99999999999983,null,5.0970611406791412E-2,5.9588630686688251E-2,5.8437101815511198E-2,7.2490801113894915E-2,9.9784558895803024E-2,0.12202083768707046,0.13297250145548223,0.11581021884575757,9.2988811926639769E-2,7.3016493302143923E-2,5.9544003962268943E-2,6.2375428901948173E-2]
[null,null,null,null,null,null,null,null,null,null,null,null,null,null,null,null,"m3/d",0]
[]
["TOTAL",{"$f":"SUM(B110:B115)","v":1782880.0887382578},{"$f":"SUM(C110:C115)","v":1612529.4337886835},1784084.6576358965,1729104.9409437047,1790755.2428866599,1737095.6217440551,1796109.4536598129,1793340.662606386,1732411.8850281248,1786436.750864435,1727016.2341592328,1784720.0279447513,21056485]
[]
["SURPLUS/ DEFICIT (m3)",{"$f":"B106-B116","v":5494.4112617422361},{"$f":"C106-C116","v":2776.5662113165017},4289.8423641035333,1580.0590562953148,-2380.7428866599221,-6410.6217440550681,-7734.9536598129198,-4966.1626063860022,-1726.8850281247869,1937.7491355650127,3668.7658407671843,3654.4720552486833,182.5]
[]
["Equivalent GWL Change Across Aquifer (m) ",{"$f":"(B118/($L$16*1000000))/$L$15","v":7.4784418970222352E-2},{"$f":"(C118/($L$16*1000000))/$L$15","v":3.7791836277616737E-2},5.838903449167733E-2,2.1506180159184905E-2,-3.2404285921599593E-2,-8.7254957724990714E-2,-0.10528043636603947,-6.7594427744467153E-2,-2.3504628122019696E-2,2.6374699000476558E-2,4.9935563369636372E-2,4.9741010688018013E-2,2.4840070777187966E-3]
["Cumulative GWL Change Across Aquifer (m) ",{"$f":"B120","v":7.4784418970222352E-2},{"$f":"C120+B121","v":0.1125762552478391},{"$f":"D120+C121","v":0.17096528973951641},{"$f":"E120+D121","v":0.19247146989870131},{"$f":"F120+E121","v":0.16006718397710173},{"$f":"G120+F121","v":7.281222625211102E-2},{"$f":"H120+G121","v":-3.2468210113928447E-2},{"$f":"I120+H121","v":-0.1000626378583956},{"$f":"J120+I121","v":-0.1235672659804153},{"$f":"K120+J121","v":-9.7192566979938749E-2},{"$f":"L120+K121","v":-4.7257003610302377E-2},{"$f":"M120+L121","v":2.4840070777156359E-3}]
[]
[]
[]
[]
[]
[]
[]
["Days in Month",31,28,31,30,31,30,31,31,30,31,30,31]

{"sheet":"Salmon River - Analysis","index":10,"n_rows":129,"n_cols":31,"rows_kept":129,"cut":false,"hidden":false,"merged":[[14,11,14,12],[15,11,15,12],[16,11,16,12],[10,11,10,12]]}
[]
[]
[]
[]
[]
[]
["AQUIFER - Salmon River Aquifer"]
["TYPE - 4c, Confined glaciomarine aquifer"]
["CLASSIFICATION - TBD"]
["RANKING - TBD"]
["AQUIFER SIZE - 43.92 km2",null,null,null,null,null,"ALLOCATED WATER USE",null,null,null,null,null,null,"Input Units","User-Defined - Provided for accounting and reporting purposes and does not affect the moedl results directly"]
[]
["LOCATION ",null,null,null,null,null,"AQUIFER PARAMETERS AND SELECTION"]
[]
[null,null,null,null,null,null,"Storativity",null,null,null,null,1E-3,null,"(-)","Recommended value = 0.001"]
[null,null,null,null,null,null,"Aquifer Size - in Plan View",null,null,null,null,43.92,null,"km2","Recommended value = 43.92"]
[]
[]
[null,null,null,null,null,null,"Private Water Users Distribution Method",null,null,null,null,null,null,null,"     NOT USED CURRENTLY"]
[]
[]
[]
[]
[]
[]
[]
[]
[]
[]
[]
[]
[]
[]
[]
[]
[]
[]
[]
[]
["*Golder interpretation of Township of Langley deep confined aquifers shown (Golder 2005, 2014)"]
[]
[]
[]
[]
["INFLOWS TO AQUIFER (AVERAGE YEAR - 1945-2012)",null,null,null,null,null,null,null,null,null,null,null,null,null,null,null,null,null,null,"Monthly Distributions"]
["INFLOW SOURCE / TYPE","JAN","FEB","MAR","APR","MAY","JUN","JUL","AUG","SEP","OCT","NOV","DEC","ANNUAL",null,"Flow per day to distribute",null,"Check",null,"JAN","FEB","MAR","APR","MAY","JUN","JUL","AUG","SEP","OCT","NOV","DEC"]
["GW inflow from surrounding aquitards (m3)",{"$f":"B$129*$P47","v":1123967},1015196,1123967,1087710,1123967,1087710,1123967,1123967,1087710,1123967,1087710,1123967,{"$f":"SUM(B47:M47)","v":13233805},null,36257,"m3/d",{"$f":"N47/365","v":36257}]
[]
[]
[]
[]
[]
[]
["TOTAL",{"$f":"SUM(B47:B53)","v":1123967},{"$f":"SUM(C47:C53)","v":1015196},1123967,1087710,1123967,1087710,1123967,1123967,1087710,1123967,1087710,1123967,13233805]
[]
["OUTFLOWS FROM AQUIFER (AVERAGE YEAR, 1945-2012)",null,null,null,null,null,null,null,null,null,null,null,null,null,null,null,null,null,null,"Monthly Distributions"]
["OUTFLOW SOURCE / TYPE","JAN","FEB","MAR","APR","MAY","JUN","JUL","AUG","SEP","OCT","NOV","DEC","ANNUAL",null,"Flow per day to distribute",null,"Check",null,"JAN","FEB","MAR","APR","MAY","JUN","JUL","AUG","SEP","OCT","NOV","DEC"]
["GW outflow to surrounding aquitards (m3)",{"$f":"B$129*$P58","v":1123967},1015196,1123967,1087710,1123967,1087710,1123967,1123967,1087710,1123967,1087710,1123967,{"$f":"SUM(B58:M58)","v":13233805},null,36257,"m3/d",{"$f":"N58/365","v":36257}]
[]
[]
[]
[]
[]
["TOTAL",{"$f":"SUM(B58:B63)","v":1123967},1015196,1123967,1087710,1123967,1087710,1123967,1123967,1087710,1123967,1087710,1123967,13233805]
[]
["SURPLUS/ DEFICIT (m3)",{"$f":"B54-B64","v":0},0,0,0,0,0,0,0,0,0,0,0,0]
[]
["Equivalent GWL Change Across Aquifer (m) ",{"$f":"(B66/($L$16*1000000))/$L$15","v":0},{"$f":"(C66/($L$16*1000000))/$L$15","v":0},0,0,0,0,0,0,0,0,0,0,0]
["Cumulative GWL Change Across Aquifer (m) ",{"$f":"B68","v":0},{"$f":"C68+B69","v":0},{"$f":"D68+C69","v":0},0,0,0,0,0,0,0,0,0]
[]
["INFLOWS TO AQUIFER (DRY YEAR - 1951)",null,null,null,null,null,null,null,null,null,null,null,null,null,null,null,null,null,null,"Monthly Distributions"]
["INFLOW SOURCE / TYPE","JAN","FEB","MAR","APR","MAY","JUN","JUL","AUG","SEP","OCT","NOV","DEC","ANNUAL",null,"Flow per day to distribute",null,"Check",null,"JAN","FEB","MAR","APR","MAY","JUN","JUL","AUG","SEP","OCT","NOV","DEC"]
["GW inflow from surrounding aquitards (m3)",{"$f":"B$129*$P73","v":1123967},1015196,1123967,1087710,1123967,1087710,1123967,1123967,1087710,1123967,1087710,1123967,{"$f":"SUM(B73:M73)","v":13233805},null,36257,"m3/d",{"$f":"N73/365","v":36257}]
[]
[]
[]
[]
[]
[]
["TOTAL",{"$f":"SUM(B73:B79)","v":1123967},{"$f":"SUM(C73:C79)","v":1015196},1123967,1087710,1123967,1087710,1123967,1123967,1087710,1123967,1087710,1123967,13233805]
[]
["OUTFLOWS FROM AQUIFER (DRY YEAR - 1951)",null,null,null,null,null,null,null,null,null,null,null,null,null,null,null,null,null,null,"Monthly Distributions"]
["OUTFLOW SOURCE / TYPE","JAN","FEB","MAR","APR","MAY","JUN","JUL","AUG","SEP","OCT","NOV","DEC","ANNUAL",null,"Flow per day to distribute",null,"Check",null,"JAN","FEB","MAR","APR","MAY","JUN","JUL","AUG","SEP","OCT","NOV","DEC"]
["GW outflow to surrounding aquitards (m3)",{"$f":"B$129*$P84","v":1123967},1015196,1123967,1087710,1123967,1087710,1123967,1123967,1087710,1123967,1087710,1123967,{"$f":"SUM(B84:M84)","v":13233805},null,36257,"m3/d",{"$f":"N84/365","v":36257}]
["GW outflow from pumping - Private minor users (m3)"]
[]
[]
[]
[]
["TOTAL",{"$f":"SUM(B84:B89)","v":1123967},1015196,1123967,1087710,1123967,1087710,1123967,1123967,1087710,1123967,1087710,1123967,13233805]
[]
["SURPLUS/ DEFICIT (m3)",{"$f":"B80-B90","v":0},0,0,0,0,0,0,0,0,0,0,0,0]
[]
["Equivalent GWL Change Across Aquifer (m) ",{"$f":"(B92/($L$16*1000000))/$L$15","v":0},{"$f":"(C92/($L$16*1000000))/$L$15","v":0},0,0,0,0,0,0,0,0,0,0,0]
["Cumulative GWL Change Across Aquifer (m) ",{"$f":"B94","v":0},{"$f":"C94+B95","v":0},{"$f":"D94+C95","v":0},{"$f":"E94+D95","v":0},{"$f":"F94+E95","v":0},{"$f":"G94+F95","v":0},{"$f":"H94+G95","v":0},{"$f":"I94+H95","v":0},{"$f":"J94+I95","v":0},{"$f":"K94+J95","v":0},{"$f":"L94+K95","v":0},{"$f":"M94+L95","v":0}]
[]
["INFLOWS TO AQUIFER (WET YEAR - 1971)",null,null,null,null,null,null,null,null,null,null,null,null,null,null,null,null,null,null,"Monthly Distributions"]
["INFLOW SOURCE / TYPE","JAN","FEB","MAR","APR","MAY","JUN","JUL","AUG","SEP","OCT","NOV","DEC","ANNUAL",null,"Flow per day to distribute",null,"Check",null,"JAN","FEB","MAR","APR","MAY","JUN","JUL","AUG","SEP","OCT","NOV","DEC"]
["GW inflow from surrounding aquitards (m3)",{"$f":"B$129*$P99","v":1123967},1015196,1123967,1087710,1123967,1087710,1123967,1123967,1087710,1123967,1087710,1123967,{"$f":"SUM(B99:M99)","v":13233805},null,36257,"m3/d",{"$f":"N99/365","v":36257}]
[]
[]
[]
[]
[]
[]
["TOTAL",{"$f":"SUM(B99:B105)","v":1123967},{"$f":"SUM(C99:C105)","v":1015196},1123967,1087710,1123967,1087710,1123967,1123967,1087710,1123967,1087710,1123967,13233805]
[]
["OUTFLOWS FROM AQUIFER (WET YEAR - 1971)",null,null,null,null,null,null,null,null,null,null,null,null,null,null,null,null,null,null,"Monthly Distributions"]
["OUTFLOW SOURCE / TYPE","JAN","FEB","MAR","APR","MAY","JUN","JUL","AUG","SEP","OCT","NOV","DEC","ANNUAL",null,"Flow per day to distribute",null,"Check",null,"JAN","FEB","MAR","APR","MAY","JUN","JUL","AUG","SEP","OCT","NOV","DEC"]
["GW outflow to surrounding aquitards (m3)",{"$f":"B$129*$P110","v":1123967},1015196,1123967,1087710,1123967,1087710,1123967,1123967,1087710,1123967,1087710,1123967,{"$f":"SUM(B110:M110)","v":13233805},null,36257,"m3/d",{"$f":"N110/365","v":36257}]
["GW outflow from pumping - Private minor users (m3)"]
[]
[]
[]
[]
["TOTAL",{"$f":"SUM(B110:B115)","v":1123967},1015196,1123967,1087710,1123967,1087710,1123967,1123967,1087710,1123967,1087710,1123967,13233805]
[]
["SURPLUS/ DEFICIT (m3)",{"$f":"B106-B116","v":0},0,0,0,0,0,0,0,0,0,0,0,0]
[]
["Equivalent GWL Change Across Aquifer (m) ",{"$f":"(B118/($L$16*1000000))/$L$15","v":0},{"$f":"(C118/($L$16*1000000))/$L$15","v":0},0,0,0,0,0,0,0,0,0,0,0]
["Cumulative GWL Change Across Aquifer (m) ",{"$f":"B120","v":0},{"$f":"C120+B121","v":0},{"$f":"D120+C121","v":0},{"$f":"E120+D121","v":0},{"$f":"F120+E121","v":0},{"$f":"G120+F121","v":0},{"$f":"H120+G121","v":0},{"$f":"I120+H121","v":0},{"$f":"J120+I121","v":0},{"$f":"K120+J121","v":0},{"$f":"L120+K121","v":0},{"$f":"M120+L121","v":0}]
[]
[]
[]
[]
[]
[]
[]
["Days in Month",31,28,31,30,31,30,31,31,30,31,30,31]

{"sheet":"Nicomekl Serpentine - Analysis","index":11,"n_rows":129,"n_cols":31,"rows_kept":129,"cut":false,"hidden":false,"merged":[[14,11,14,12],[15,11,15,12],[16,11,16,12],[10,11,10,12]]}
[]
[]
[]
[]
[]
[]
["AQUIFER - Nicomekl Serpentine Aquifer"]
["TYPE - 4c, Confined glaciomarine aquifer"]
["CLASSIFICATION - TBD"]
["RANKING - TBD"]
["AQUIFER SIZE - 79.38 m2 (partial - only includes aquifer within Township of Langley)",null,null,null,null,null,"ALLOCATED WATER USE",null,null,null,null,null,null,"Input Units","User-Defined - Provided for accounting and reporting purposes and does not affect the moedl results directly"]
[]
["LOCATION ",null,null,null,null,null,"AQUIFER PARAMETERS AND SELECTION"]
[]
[null,null,null,null,null,null,"Storativity",null,null,null,null,1E-3,null,"(-)","Recommended value = 0.001"]
[null,null,null,null,null,null,"Aquifer Size - in Plan View (partial)",null,null,null,null,79.38,null,"km2","Recommended value = 79.38"]
[]
[]
[null,null,null,null,null,null,"Private Water Users Distribution Method"]
[]
[]
[]
[]
[]
[]
[]
[]
[]
[]
[]
[]
[]
[]
[]
[]
[]
[]
[]
[]
["*Golder interpretation of Township of Langley deep confined aquifers shown (Golder 2005, 2014)"]
[]
[]
[]
[]
["INFLOWS TO AQUIFER (AVERAGE YEAR - 1945-2012)",null,null,null,null,null,null,null,null,null,null,null,null,null,null,null,null,null,null,"Monthly Distributions"]
["INFLOW SOURCE / TYPE","JAN","FEB","MAR","APR","MAY","JUN","JUL","AUG","SEP","OCT","NOV","DEC","ANNUAL",null,"Flow per day to distribute",null,"Check",null,"JAN","FEB","MAR","APR","MAY","JUN","JUL","AUG","SEP","OCT","NOV","DEC"]
["GW inflow from surrounding aquitards (m3)",{"$f":"B$129*$P47","v":3045874},2751112,3045874,2947620,3045874,2947620,3045874,3045874,2947620,3045874,2947620,3045874,{"$f":"SUM(B47:M47)","v":35862710},null,98254,"m3/d",{"$f":"N47/365","v":98254}]
["GW inflow from boundary (m3)",381393,344484,381393,369090,381393,369090,381393,381393,369090,381393,369090,381393,{"$f":"SUM(B48:M48)","v":4490595},null,12303,"m3/d",{"$f":"N48/365","v":12303}]
[]
[]
[]
[]
[]
["TOTAL",{"$f":"SUM(B47:B53)","v":3427267},{"$f":"SUM(C47:C53)","v":3095596},3427267,3316710,3427267,3316710,3427267,3427267,3316710,3427267,3316710,3427267,40353305]
[]
["OUTFLOWS FROM AQUIFER (AVERAGE YEAR, 1945-2012)",null,null,null,null,null,null,null,null,null,null,null,null,null,null,null,null,null,null,"Monthly Distributions"]
["OUTFLOW SOURCE / TYPE","JAN","FEB","MAR","APR","MAY","JUN","JUL","AUG","SEP","OCT","NOV","DEC","ANNUAL",null,"Flow per day to distribute",null,"Check",null,"JAN","FEB","MAR","APR","MAY","JUN","JUL","AUG","SEP","OCT","NOV","DEC"]
["GW outflow to surrounding aquitards (m3)",{"$f":"B$129*$P58","v":2700379},2439052,2700379,2613270,2700379,2613270,2700379,2700379,2613270,2700379,2613270,2700379,{"$f":"SUM(B58:M58)","v":31794785},null,87109,"m3/d",{"$f":"N58/365","v":87109}]
["GW outflow to boundary (m3)",711388,642544,711388,688440,711388,688440,711388,711388,688440,711388,688440,711388,{"$f":"SUM(B59:M59)","v":8376020},null,22948,"m3/d",{"$f":"N59/365","v":22948}]
["GW outflow from pumping  - ICI - Trin. W. College (m3)",{"$f":"B$129*$P60*(T60*(365/B$129))","v":13154.951812210829},{"$f":"C$129*$P60*(U60*(365/C$129))","v":13190.601409895324},14070.976777796321,14656.772569965533,15062.774793305844,17222.744739579357,20089.149029117867,17951.89450779949,15943.585637590199,14300.352277900891,13610.059105362008,13246.137339476325,182499.99999999997,null,500,"m3/d",499.99999999999994,null,{"$f":"VLOOKUP('Form Control Selectors'!$N$23,'Water Budget Distributions'!$CH$16:$CT$22,2,FALSE)","v":7.2081927738141538E-2},{"$f":"VLOOKUP('Form Control Selectors'!$N$23,'Water Budget Distributions'!$CH$16:$CT$22,3,FALSE)","v":7.2277267999426423E-2},{"$f":"VLOOKUP('Form Control Selectors'!$N$23,'Water Budget Distributions'!$CH$16:$CT$22,4,FALSE)","v":7.7101242618062032E-2},{"$f":"VLOOKUP('Form Control Selectors'!$N$23,'Water Budget Distributions'!$CH$16:$CT$22,5,FALSE)","v":8.0311082575153611E-2},{"$f":"VLOOKUP('Form Control Selectors'!$N$23,'Water Budget Distributions'!$CH$16:$CT$22,6,FALSE)","v":8.2535752292086817E-2},{"$f":"VLOOKUP('Form Control Selectors'!$N$23,'Water Budget Distributions'!$CH$16:$CT$22,7,FALSE)","v":9.4371204052489638E-2},{"$f":"VLOOKUP('Form Control Selectors'!$N$23,'Water Budget Distributions'!$CH$16:$CT$22,8,FALSE)","v":0.11007752892667325},{"$f":"VLOOKUP('Form Control Selectors'!$N$23,'Water Budget Distributions'!$CH$16:$CT$22,9,FALSE)","v":9.8366545248216392E-2},{"$f":"VLOOKUP('Form Control Selectors'!$N$23,'Water Budget Distributions'!$CH$16:$CT$22,10,FALSE)","v":8.7362113082686016E-2},{"$f":"VLOOKUP('Form Control Selectors'!$N$23,'Water Budget Distributions'!$CH$16:$CT$22,11,FALSE)","v":7.8358094673429537E-2},{"$f":"VLOOKUP('Form Control Selectors'!$N$23,'Water Budget Distributions'!$CH$16:$CT$22,12,FALSE)","v":7.4575666330750731E-2},{"$f":"VLOOKUP('Form Control Selectors'!$N$23,'Water Budget Distributions'!$CH$16:$CT$22,13,FALSE)","v":7.2581574462883977E-2}]
[]
[]
[]
["TOTAL",{"$f":"SUM(B58:B63)","v":3424921.951812211},{"$f":"SUM(C58:C63)","v":3094786.6014098953},3425837.9767777962,3316366.7725699656,3426829.7747933059,3318932.7447395795,3431856.149029118,3429718.8945077993,3317653.5856375904,3426067.352277901,3315320.0591053618,3425013.1373394765,40353305]
[]
["SURPLUS/ DEFICIT (m3)",{"$f":"B54-B64","v":2345.0481877890415},{"$f":"C54-C64","v":809.39859010465443},1429.0232222038321,343.22743003442883,437.22520669410005,-2222.7447395795025,-4589.1490291180089,-2451.8945077992976,-943.58563759038225,1199.6477220989764,1389.9408946381882,2253.862660523504,0]
[]
["Equivalent GWL Change Across Aquifer (m) ",{"$f":"(B66/($L$16*1000000))/$L$15","v":2.9542053260129018E-2},{"$f":"(C66/($L$16*1000000))/$L$15","v":1.0196505292323689E-2},1.8002308165833106E-2,4.3238527341197888E-3,5.5080020999508693E-3,-2.8001319470641252E-2,-5.7812409033988522E-2,-3.0888063842268804E-2,-1.1886944288112652E-2,1.5112720107066973E-2,1.7509963399322096E-2,2.8393331576259812E-2,0]
["Cumulative GWL Change Across Aquifer (m) ",{"$f":"B68","v":2.9542053260129018E-2},{"$f":"C68+B69","v":3.9738558552452709E-2},{"$f":"D68+C69","v":5.7740866718285815E-2},6.2064719452405603E-2,6.7572721552356468E-2,3.9571402081715217E-2,-1.8241006952273306E-2,-4.912907079454211E-2,-6.1016015082654765E-2,-4.5903294975587788E-2,-2.8393331576265692E-2,-5.8807125835613761E-15]
[]
["INFLOWS TO AQUIFER (DRY YEAR - 1951)",null,null,null,null,null,null,null,null,null,null,null,null,null,null,null,null,null,null,"Monthly Distributions"]
["INFLOW SOURCE / TYPE","JAN","FEB","MAR","APR","MAY","JUN","JUL","AUG","SEP","OCT","NOV","DEC","ANNUAL",null,"Flow per day to distribute",null,"Check",null,"JAN","FEB","MAR","APR","MAY","JUN","JUL","AUG","SEP","OCT","NOV","DEC"]
["GW inflow from surrounding aquitards (m3)",{"$f":"B$129*$P73","v":3045874},2751112,3045874,2947620,3045874,2947620,3045874,3045874,2947620,3045874,2947620,3045874,{"$f":"SUM(B73:M73)","v":35862710},null,98254,"m3/d",{"$f":"N73/365","v":98254}]
["GW inflow from boundary (m3)",381393,344484,381393,369090,381393,369090,381393,381393,369090,381393,369090,381393,{"$f":"SUM(B74:M74)","v":4490595},null,12303,"m3/d",{"$f":"N74/365","v":12303}]
[]
[]
[]
[]
[]
["TOTAL",{"$f":"SUM(B73:B79)","v":3427267},{"$f":"SUM(C73:C79)","v":3095596},3427267,3316710,3427267,3316710,3427267,3427267,3316710,3427267,3316710,3427267,40353305]
[]
["OUTFLOWS FROM AQUIFER (DRY YEAR - 1951)",null,null,null,null,null,null,null,null,null,null,null,null,null,null,null,null,null,null,"Monthly Distributions"]
["OUTFLOW SOURCE / TYPE","JAN","FEB","MAR","APR","MAY","JUN","JUL","AUG","SEP","OCT","NOV","DEC","ANNUAL",null,"Flow per day to distribute",null,"Check",null,"JAN","FEB","MAR","APR","MAY","JUN","JUL","AUG","SEP","OCT","NOV","DEC"]
["GW outflow to surrounding aquitards (m3)",{"$f":"B$129*$P84","v":2700379},2439052,2700379,2613270,2700379,2613270,2700379,2700379,2613270,2700379,2613270,2700379,{"$f":"SUM(B84:M84)","v":31794785},null,87109,"m3/d",{"$f":"N84/365","v":87109}]
["GW outflow to boundary (m3)",711388,642544,711388,688440,711388,688440,711388,711388,688440,711388,688440,711388,8376020,null,22948,"m3/d",{"$f":"N85/365","v":22948}]
["GW outflow from pumping  - ICI - Trin. W. College (m3)",{"$f":"B$129*$P86*(T86*(365/B$129))","v":13154.951812210829},{"$f":"C$129*$P86*(U86*(365/C$129))","v":13190.601409895324},14070.976777796321,14656.772569965533,15062.774793305844,17222.744739579357,20089.149029117867,17951.89450779949,15943.585637590199,14300.352277900891,13610.059105362008,13246.137339476325,182499.99999999997,null,500,"m3/d",499.99999999999994,null,{"$f":"VLOOKUP('Form Control Selectors'!$N$23,'Water Budget Distributions'!$CH$16:$CT$22,2,FALSE)","v":7.2081927738141538E-2},{"$f":"VLOOKUP('Form Control Selectors'!$N$23,'Water Budget Distributions'!$CH$16:$CT$22,3,FALSE)","v":7.2277267999426423E-2},{"$f":"VLOOKUP('Form Control Selectors'!$N$23,'Water Budget Distributions'!$CH$16:$CT$22,4,FALSE)","v":7.7101242618062032E-2},{"$f":"VLOOKUP('Form Control Selectors'!$N$23,'Water Budget Distributions'!$CH$16:$CT$22,5,FALSE)","v":8.0311082575153611E-2},{"$f":"VLOOKUP('Form Control Selectors'!$N$23,'Water Budget Distributions'!$CH$16:$CT$22,6,FALSE)","v":8.2535752292086817E-2},{"$f":"VLOOKUP('Form Control Selectors'!$N$23,'Water Budget Distributions'!$CH$16:$CT$22,7,FALSE)","v":9.4371204052489638E-2},{"$f":"VLOOKUP('Form Control Selectors'!$N$23,'Water Budget Distributions'!$CH$16:$CT$22,8,FALSE)","v":0.11007752892667325},{"$f":"VLOOKUP('Form Control Selectors'!$N$23,'Water Budget Distributions'!$CH$16:$CT$22,9,FALSE)","v":9.8366545248216392E-2},{"$f":"VLOOKUP('Form Control Selectors'!$N$23,'Water Budget Distributions'!$CH$16:$CT$22,10,FALSE)","v":8.7362113082686016E-2},{"$f":"VLOOKUP('Form Control Selectors'!$N$23,'Water Budget Distributions'!$CH$16:$CT$22,11,FALSE)","v":7.8358094673429537E-2},{"$f":"VLOOKUP('Form Control Selectors'!$N$23,'Water Budget Distributions'!$CH$16:$CT$22,12,FALSE)","v":7.4575666330750731E-2},{"$f":"VLOOKUP('Form Control Selectors'!$N$23,'Water Budget Distributions'!$CH$16:$CT$22,13,FALSE)","v":7.2581574462883977E-2}]
["GW outflow from pumping - Private minor users (m3)"]
[]
[]
["TOTAL",{"$f":"SUM(B84:B89)","v":3424921.951812211},{"$f":"SUM(C84:C89)","v":3094786.6014098953},3425837.9767777962,3316366.7725699656,3426829.7747933059,3318932.7447395795,3431856.149029118,3429718.8945077993,3317653.5856375904,3426067.352277901,3315320.0591053618,3425013.1373394765,40353305]
[]
["SURPLUS/ DEFICIT (m3)",{"$f":"B80-B90","v":2345.0481877890415},{"$f":"C80-C90","v":809.39859010465443},1429.0232222038321,343.22743003442883,437.22520669410005,-2222.7447395795025,-4589.1490291180089,-2451.8945077992976,-943.58563759038225,1199.6477220989764,1389.9408946381882,2253.862660523504,0]
[]
["Equivalent GWL Change Across Aquifer (m) ",{"$f":"(B92/($L$16*1000000))/$L$15","v":2.9542053260129018E-2},{"$f":"(C92/($L$16*1000000))/$L$15","v":1.0196505292323689E-2},1.8002308165833106E-2,4.3238527341197888E-3,5.5080020999508693E-3,-2.8001319470641252E-2,-5.7812409033988522E-2,-3.0888063842268804E-2,-1.1886944288112652E-2,1.5112720107066973E-2,1.7509963399322096E-2,2.8393331576259812E-2,0]
["Cumulative GWL Change Across Aquifer (m) ",{"$f":"B94","v":2.9542053260129018E-2},{"$f":"C94+B95","v":3.9738558552452709E-2},{"$f":"D94+C95","v":5.7740866718285815E-2},{"$f":"E94+D95","v":6.2064719452405603E-2},{"$f":"F94+E95","v":6.7572721552356468E-2},{"$f":"G94+F95","v":3.9571402081715217E-2},{"$f":"H94+G95","v":-1.8241006952273306E-2},{"$f":"I94+H95","v":-4.912907079454211E-2},{"$f":"J94+I95","v":-6.1016015082654765E-2},{"$f":"K94+J95","v":-4.5903294975587788E-2},{"$f":"L94+K95","v":-2.8393331576265692E-2},{"$f":"M94+L95","v":-5.8807125835613761E-15}]
[]
["INFLOWS TO AQUIFER (WET YEAR - 1971)",null,null,null,null,null,null,null,null,null,null,null,null,null,null,null,null,null,null,"Monthly Distributions"]
["INFLOW SOURCE / TYPE","JAN","FEB","MAR","APR","MAY","JUN","JUL","AUG","SEP","OCT","NOV","DEC","ANNUAL",null,"Flow per day to distribute",null,"Check",null,"JAN","FEB","MAR","APR","MAY","JUN","JUL","AUG","SEP","OCT","NOV","DEC"]
["GW inflow from surrounding aquitards (m3)",{"$f":"B$129*$P99","v":3045874},2751112,3045874,2947620,3045874,2947620,3045874,3045874,2947620,3045874,2947620,3045874,{"$f":"SUM(B99:M99)","v":35862710},null,98254,"m3/d",{"$f":"N99/365","v":98254}]
["GW inflow from boundary (m3)",381393,344484,381393,369090,381393,369090,381393,381393,369090,381393,369090,381393,{"$f":"SUM(B100:M100)","v":4490595},null,12303,"m3/d",{"$f":"N100/365","v":12303}]
[]
[]
[]
[]
[]
["TOTAL",{"$f":"SUM(B99:B105)","v":3427267},{"$f":"SUM(C99:C105)","v":3095596},3427267,3316710,3427267,3316710,3427267,3427267,3316710,3427267,3316710,3427267,40353305]
[]
["OUTFLOWS FROM AQUIFER (WET YEAR - 1971)",null,null,null,null,null,null,null,null,null,null,null,null,null,null,null,null,null,null,"Monthly Distributions"]
["OUTFLOW SOURCE / TYPE","JAN","FEB","MAR","APR","MAY","JUN","JUL","AUG","SEP","OCT","NOV","DEC","ANNUAL",null,"Flow per day to distribute",null,"Check",null,"JAN","FEB","MAR","APR","MAY","JUN","JUL","AUG","SEP","OCT","NOV","DEC"]
["GW outflow to surrounding aquitards (m3)",{"$f":"B$129*$P110","v":2700379},2439052,2700379,2613270,2700379,2613270,2700379,2700379,2613270,2700379,2613270,2700379,{"$f":"SUM(B110:M110)","v":31794785},null,87109,"m3/d",{"$f":"N110/365","v":87109}]
["GW outflow to boundary (m3)",711388,642544,711388,688440,711388,688440,711388,711388,688440,711388,688440,711388,8376020,null,22948,"m3/d",{"$f":"N111/365","v":22948}]
["GW outflow from pumping  - ICI - Trin. W. College (m3)",{"$f":"B$129*$P112*(T112*(365/B$129))","v":13154.951812210829},{"$f":"C$129*$P112*(U112*(365/C$129))","v":13190.601409895324},14070.976777796321,14656.772569965533,15062.774793305844,17222.744739579357,20089.149029117867,17951.89450779949,15943.585637590199,14300.352277900891,13610.059105362008,13246.137339476325,182499.99999999997,null,500,"m3/d",499.99999999999994,null,{"$f":"VLOOKUP('Form Control Selectors'!$N$23,'Water Budget Distributions'!$CH$16:$CT$22,2,FALSE)","v":7.2081927738141538E-2},{"$f":"VLOOKUP('Form Control Selectors'!$N$23,'Water Budget Distributions'!$CH$16:$CT$22,3,FALSE)","v":7.2277267999426423E-2},{"$f":"VLOOKUP('Form Control Selectors'!$N$23,'Water Budget Distributions'!$CH$16:$CT$22,4,FALSE)","v":7.7101242618062032E-2},{"$f":"VLOOKUP('Form Control Selectors'!$N$23,'Water Budget Distributions'!$CH$16:$CT$22,5,FALSE)","v":8.0311082575153611E-2},{"$f":"VLOOKUP('Form Control Selectors'!$N$23,'Water Budget Distributions'!$CH$16:$CT$22,6,FALSE)","v":8.2535752292086817E-2},{"$f":"VLOOKUP('Form Control Selectors'!$N$23,'Water Budget Distributions'!$CH$16:$CT$22,7,FALSE)","v":9.4371204052489638E-2},{"$f":"VLOOKUP('Form Control Selectors'!$N$23,'Water Budget Distributions'!$CH$16:$CT$22,8,FALSE)","v":0.11007752892667325},{"$f":"VLOOKUP('Form Control Selectors'!$N$23,'Water Budget Distributions'!$CH$16:$CT$22,9,FALSE)","v":9.8366545248216392E-2},{"$f":"VLOOKUP('Form Control Selectors'!$N$23,'Water Budget Distributions'!$CH$16:$CT$22,10,FALSE)","v":8.7362113082686016E-2},{"$f":"VLOOKUP('Form Control Selectors'!$N$23,'Water Budget Distributions'!$CH$16:$CT$22,11,FALSE)","v":7.8358094673429537E-2},{"$f":"VLOOKUP('Form Control Selectors'!$N$23,'Water Budget Distributions'!$CH$16:$CT$22,12,FALSE)","v":7.4575666330750731E-2},{"$f":"VLOOKUP('Form Control Selectors'!$N$23,'Water Budget Distributions'!$CH$16:$CT$22,13,FALSE)","v":7.2581574462883977E-2}]
["GW outflow from pumping - Private minor users (m3)"]
[]
[]
["TOTAL",{"$f":"SUM(B110:B115)","v":3424921.951812211},{"$f":"SUM(C110:C115)","v":3094786.6014098953},3425837.9767777962,3316366.7725699656,3426829.7747933059,3318932.7447395795,3431856.149029118,3429718.8945077993,3317653.5856375904,3426067.352277901,3315320.0591053618,3425013.1373394765,40353305]
[]
["SURPLUS/ DEFICIT (m3)",{"$f":"B106-B116","v":2345.0481877890415},{"$f":"C106-C116","v":809.39859010465443},1429.0232222038321,343.22743003442883,437.22520669410005,-2222.7447395795025,-4589.1490291180089,-2451.8945077992976,-943.58563759038225,1199.6477220989764,1389.9408946381882,2253.862660523504,0]
[]
["Equivalent GWL Change Across Aquifer (m) ",{"$f":"(B118/($L$16*1000000))/$L$15","v":2.9542053260129018E-2},{"$f":"(C118/($L$16*1000000))/$L$15","v":1.0196505292323689E-2},1.8002308165833106E-2,4.3238527341197888E-3,5.5080020999508693E-3,-2.8001319470641252E-2,-5.7812409033988522E-2,-3.0888063842268804E-2,-1.1886944288112652E-2,1.5112720107066973E-2,1.7509963399322096E-2,2.8393331576259812E-2,0]
["Cumulative GWL Change Across Aquifer (m) ",{"$f":"B120","v":2.9542053260129018E-2},{"$f":"C120+B121","v":3.9738558552452709E-2},{"$f":"D120+C121","v":5.7740866718285815E-2},{"$f":"E120+D121","v":6.2064719452405603E-2},{"$f":"F120+E121","v":6.7572721552356468E-2},{"$f":"G120+F121","v":3.9571402081715217E-2},{"$f":"H120+G121","v":-1.8241006952273306E-2},{"$f":"I120+H121","v":-4.912907079454211E-2},{"$f":"J120+I121","v":-6.1016015082654765E-2},{"$f":"K120+J121","v":-4.5903294975587788E-2},{"$f":"L120+K121","v":-2.8393331576265692E-2},{"$f":"M120+L121","v":-5.8807125835613761E-15}]
[]
[]
[]
[]
[]
[]
[]
["Days in Month",31,28,31,30,31,30,31,31,30,31,30,31]

{"sheet":"Assumption and Limitations","index":12,"n_rows":0,"n_cols":0,"rows_kept":0,"cut":false,"hidden":false,"merged":[]}

{"sheet":"References","index":13,"n_rows":9,"n_cols":1,"rows_kept":9,"cut":false,"hidden":false,"merged":[]}
[]
[]
[]
[]
[]
[]
["Golder Associates Ltd., 2005.  Final Report: Comprehensive Groundwater Modelling Assignment.  Prepared for the Township of Langley, 94p.    "]
["Golder Associates Ltd., 2014.  Assessment of Long Term Groundwater Availability for Domestic and Public Use and for Aquatic Habitats.  Prepared for the Township of Langley, 90p."]
["Golder Associates Ltd., 2016.  Monthly Groundwater Budget for the Hopington Aquifer - Salmon River Area, BC.  Prepared for the British Columbia Ministry of the Environment, 50p."]

{"sheet":"Form Control Selectors","index":14,"n_rows":94,"n_cols":14,"rows_kept":94,"cut":false,"hidden":true,"merged":[]}
[]
[]
[]
[]
[]
[]
[]
[]
[]
[]
["Spreadsheet","Analysis Dashboard","Analysis Dashboard","Analysis Dashboard","Analysis Dashboard","Analysis Dashboard",null,"Hopington AB Analysis Page","Fort Langley Analysis Page","Beaver River Analysis Page","W. of Aldergrove Analysis Page","S of Murrayville AC Analysis Page","Salmon River Analysis Page","Nikomekl-Serpentine Analysis Pg"]
["Form Control Description","Aquifer Selection Form","Meteorological Scenario","Future Demand at Build Out (2041)","Climate Change Impacts","Implementation of BMPs",null,"Private Water User Distribution","Private Water User Distribution","Private Water User Distribution","Private Water User Distribution","Private Water User Distribution","Private Water User Distribution","Private Water User Distribution"]
[]
[null,"Hopington AB Aquifer","Average Year",null,null,null,null,"Constant Linear","Constant Linear","Constant Linear","Constant Linear","Constant Linear","Constant Linear","Constant Linear"]
[null,"Fort Langley Aquifer","Dry Year",null,null,null,null,"Approximate PET","Approximate PET","Approximate PET","Approximate PET","Approximate PET","Approximate PET","Approximate PET"]
[null,"Beaver River Aquifer","Wet Year",null,null,null,null,"Approximate Municipal Use","Approximate Municipal Use","Approximate Municipal Use","Approximate Municipal Use","Approximate Municipal Use","Approximate Municipal Use","Approximate Municipal Use"]
[null,"West of Aldergrove Aquifer",null,null,null,null,null,"User-Specified Distribution #1","User-Specified Distribution #1","User-Specified Distribution #1","User-Specified Distribution #1","User-Specified Distribution #1","User-Specified Distribution #1","User-Specified Distribution #1"]
[null,"S. of Murrayville AC Aquifer",null,null,null,null,null,"User-Specified Distribution #2","User-Specified Distribution #2","User-Specified Distribution #2","User-Specified Distribution #2","User-Specified Distribution #2","User-Specified Distribution #2","User-Specified Distribution #2"]
[null,"Salmon River Aquifer",null,null,null,null,null,"User-Specified Distribution #3","User-Specified Distribution #3","User-Specified Distribution #3","User-Specified Distribution #3","User-Specified Distribution #3","User-Specified Distribution #3","User-Specified Distribution #3"]
[null,"Nicomekl Serpentine Aquifer",null,null,null,null,null,"User-Specified Distribution #4","User-Specified Distribution #4","User-Specified Distribution #4","User-Specified Distribution #4","User-Specified Distribution #4","User-Specified Distribution #4","User-Specified Distribution #4"]
[]
[null,"Selected Value","Selected Value","Selected Value","Selected Value","Selected Value",null,"Selected Value","Selected Value","Selected Value","Selected Value","Selected Value","Selected Value","Selected Value"]
[null,1,1,false,false,false,null,3,3,3,3,3,3,3]
["SELECTOR FOR DATA PRESENTATION"]
["For…","Nested IF statements for data presentation selection",null,"AQUIFER AREAS","Sy / STORATIVITY","ALLOCATED WATER","ALLO UNIT","Baseflow / Surplus Partition","Baseflow / Surplus Partition","Baseflow / Surplus Partition"]
["HOPINGTON AB AQUIFER",{"$f":"IF($B$23<>1,\"\",IF($C$23=1,1,IF($C$23=2,2,IF($C$23=3,3,\"\"))))","v":1},null,{"$f":"MAX('Hopington AB - Analysis'!L16:M16)","v":23.85},{"$f":"MAX('Hopington AB - Analysis'!L15:M15)","v":0.1},{"$f":"MAX('Hopington AB - Analysis'!L11:M11)","v":10000},{"$f":"'Hopington AB - Analysis'!N11","v":"Input Units"}]
["FORT LANGLEY AQUIFER",{"$f":"IF($B$23<>2,\"\",IF($C$23=1,4,IF($C$23=2,5,IF($C$23=3,6,\"\"))))","v":""},null,{"$f":"MAX('Fort Langley - Analysis'!L16:M16)","v":5.19},{"$f":"MAX('Fort Langley - Analysis'!L15:M15)","v":0.14000000000000001},{"$f":"MAX('Fort Langley - Analysis'!L11:M11)","v":0},{"$f":"'Fort Langley - Analysis'!N11","v":"Input Units"},"Selected Value","Selected Value","Selected Value"]
["BEAVER RIVER AQUIFER",{"$f":"IF($B$23<>3,\"\",IF($C$23=1,7,IF($C$23=2,8,IF($C$23=3,9,\"\"))))","v":""},null,{"$f":"MAX('Beaver River - Analysis'!$L$16:$M$16)","v":23.84},{"$f":"MAX('Beaver River - Analysis'!$L$15:$M$15)","v":1.5E-3},{"$f":"MAX('Beaver River - Analysis'!$L$11:$M$11)","v":0},{"$f":"'Beaver River - Analysis'!$N$11","v":"Input Units"},15,25,5]
["WEST OF ALDERGROVE AQUIFER",{"$f":"IF($B$23<>4,\"\",IF($C$23=1,10,IF($C$23=2,11,IF($C$23=3,12,\"\"))))","v":""},null,{"$f":"MAX('West of Aldergrove - Analysis'!L16:M16)","v":73},{"$f":"MAX('West of Aldergrove - Analysis'!L15:M15)","v":1.9E-3},{"$f":"MAX('West of Aldergrove - Analysis'!L11:M11)","v":0},{"$f":"'West of Aldergrove - Analysis'!N11","v":"Input Units"},{"$f":"H28/100","v":0.15},{"$f":"I28/100","v":0.25},{"$f":"J28/100","v":0.05}]
["SOUTH OF MURRAYVILLE AC AQUIFER",{"$f":"IF($B$23<>5,\"\",IF($C$23=1,13,IF($C$23=2,14,IF($C$23=3,15,\"\"))))","v":""},null,{"$f":"MAX('S of Murrayville AC - Analysis'!L16:M16)","v":73.47},{"$f":"MAX('S of Murrayville AC - Analysis'!L15:M15)","v":1E-3},{"$f":"MAX('S of Murrayville AC - Analysis'!L11:M11)","v":0},{"$f":"'S of Murrayville AC - Analysis'!N11","v":"Units"}]
["SALMON RIVER AQUIFER",{"$f":"IF($B$23<>6,\"\",IF($C$23=1,16,IF($C$23=2,17,IF($C$23=3,18,\"\"))))","v":""},null,{"$f":"MAX('Salmon River - Analysis'!L16:M16)","v":43.92},{"$f":"MAX('Salmon River - Analysis'!L15:M15)","v":1E-3},{"$f":"MAX('Salmon River - Analysis'!L11:M11)","v":0},{"$f":"'Salmon River - Analysis'!N11","v":"Input Units"},"Demand Modifier","Demand Modifier",null,"Demand Modifier","Demand Modifier"]
["NICOMEKL SERPENTINE AQUIFER",{"$f":"IF($B$23<>7,\"\",IF($C$23=1,19,IF($C$23=2,20,IF($C$23=3,21,\"\"))))","v":""},null,{"$f":"MAX('Nicomekl Serpentine - Analysis'!L16:M16)","v":79.38},{"$f":"MAX('Nicomekl Serpentine - Analysis'!L15:M15)","v":1E-3},{"$f":"MAX('Nicomekl Serpentine - Analysis'!L11:M11)","v":0},{"$f":"'Nicomekl Serpentine - Analysis'!N11","v":"Input Units"},null,"Ft Langley #2",null,"Murrayville #2 ","Murrayville #1"]
[null,null,null,null,null,null,null,null,{"$f":"IF($D$23=FALSE,1,1.7)","v":1},null,{"$f":"IF($D$23=FALSE,1,1.7)","v":1},{"$f":"IF($D$23=FALSE,1,1.7)","v":1}]
["Selector",{"$f":"MAX(B26:B32)","v":1},null,null,null,null,null,null,"Climate Change Ag/Dom Mod",null,"Climate Change Ag/Dom Mod","Climate Change Ag/Dom Mod"]
[null,null,null,null,null,null,null,null,{"$f":"IF($E$23=TRUE,(IF($D$23=FALSE,(0.12+(0.2*0.62))*0.09,(0.09+(0.2*0.7))*0.09)),0)","v":0},null,{"$f":"IF($E$23=TRUE,(IF($D$23=FALSE,(0.13+(0.2*0.6))*0.09,(0.1+(0.2*0.68))*0.09)),0)","v":0},{"$f":"IF($E$23=TRUE,(IF($D$23=FALSE,(0.13+(0.2*0.6))*0.09,(0.1+(0.2*0.68))*0.09)),0)","v":0}]
[null,null,null,null,null,null,null,null,"Cumulative Modifier",null,"Cumulative Modifier","Cumulative Modifier"]
["SELECTORS FOR GROUNDWATER BUDGET REPORT",null,null,null,null,null,null,null,{"$f":"I33+I35","v":1},null,{"$f":"K33+K35","v":1},{"$f":"L33+L35","v":1}]
[null,null,null,null,null,null,null,"Private Minor Users (2041 Demand)","Private Minor Users (2041 Demand)",null,"Tall Timbers"]
["Aquifer Name",{"$f":"INDEX(A26:A32,B23)","v":"HOPINGTON AB AQUIFER"},null,"AVERAGE YEAR",null,null,null,{"$f":"IF(D23=FALSE,1,1.5)","v":1},{"$f":"IF(D23=FALSE,1,1.5)","v":1},null,{"$f":"IF($D$23=FALSE,1,1.7)","v":1}]
["Meteorological Scenario",{"$f":"INDEX(D39:D41,C23)","v":"AVERAGE YEAR"},null,"DRY YEAR (1951)",null,null,null,"Ag/Dom Use Modifier (Climate Change)","Ag/Dom Use Modifier (Climate Change)",null,"Climate Change Ag/Dom Mod"]
["Modifying Scenarios",{"$f":"IF(D23=TRUE,\"FUTURE DEMAND AT BUILDOUT (2041)\",\"CURRENT DEMAND (2012)\")","v":"CURRENT DEMAND (2012)"},null,"WET YEAR (1971)",null,null,"ASSUMED",{"$f":"IF(E23=FALSE,0,0.045)","v":0},{"$f":"IF(E23=FALSE,0,0.045)","v":0},null,{"$f":"IF($E$23=TRUE,(IF($D$23=FALSE,(0.16+(0.2*0.69))*0.09,(0+(0.2*0.85))*0.09)),0)","v":0}]
[null,{"$f":"IF(E23=TRUE,\"CLIMATE CHANGE IMPACTS\",\"NO CLIMATE CHANGE IMPACTS\")","v":"NO CLIMATE CHANGE IMPACTS"},null,null,null,null,null,"Net Private Minor Users Modifier","Net Private Minor Users Modifier",null,"Cumulative Modifier"]
[null,{"$f":"IF(F23=TRUE,\"IMPLEMENTATION OF STORMWATER BMPs AT BUILDOUT (2041)\",\"CURRENT STORMWATER MANAGEMENT CONDITIONS\")","v":"CURRENT STORMWATER MANAGEMENT CONDITIONS"},null,null,null,null,null,{"$f":"H39+H41","v":1},{"$f":"I39+I41","v":1},null,{"$f":"K39+K41","v":1}]
["Aquifer Areas",{"$f":"INDEX(D26:D32,B23)","v":23.85},null,null,null,null,null,null,null,null,"Acadia #1"]
["Sy/Sto",{"$f":"INDEX(E26:E32,B23)","v":0.1},null,null,null,null,null,null,null,null,{"$f":"IF($D$23=FALSE,1,1.7)","v":1}]
["Allocated Water",{"$f":"INDEX(F26:F32,B23)","v":10000},null,null,null,null,null,null,null,null,"Climate Change Ag/Dom Mod"]
["Allocated Units",{"$f":"INDEX(G26:G32,B23)","v":"Input Units"},null,null,null,null,null,null,null,null,{"$f":"IF($E$23=TRUE,(IF($D$23=FALSE,(0.01+(0.2*0.84))*0.09,(0.01+(0.2*0.84))*0.09)),0)","v":0}]
[null,null,null,null,null,null,null,null,null,null,"Cumulative Modifier"]
["MUNICIPAL WATER DEMAND",null,null,null,null,null,null,null,null,null,{"$f":"K45+K47","v":1}]
[null,"AVERAGE","DRY","WET","SELECTOR"]
["HOPINGTON AB AQUIFER",0,0,0,{"$f":"INDEX(B51:D57,B23,C23)","v":0}]
["FORT LANGLEY AQUIFER",{"$f":"'Fort Langley - Analysis'!N59","v":2810137.8101349999},{"$f":"'Fort Langley - Analysis'!N85","v":2810137.8101349999},{"$f":"'Fort Langley - Analysis'!N111","v":2810137.8101349999}]
["BEAVER RIVER AQUIFER",0,0,0]
["WEST OF ALDERGROVE AQUIFER",{"$f":"SUM('West of Aldergrove - Analysis'!N64:N66)","v":486544.99999999994},{"$f":"SUM('West of Aldergrove - Analysis'!N95:N97)","v":486544.99999999994},{"$f":"SUM('West of Aldergrove - Analysis'!N126:N128)","v":486544.99999999994}]
["SOUTH OF MURRAYVILLE AC AQUIFER",{"$f":"'S of Murrayville AC - Analysis'!N61","v":161329.99999999994},{"$f":"'S of Murrayville AC - Analysis'!N87","v":161329.99999999994},{"$f":"'S of Murrayville AC - Analysis'!N113","v":161329.99999999994}]
["SALMON RIVER AQUIFER",0,0,0]
["NICOMEKL SERPENTINE AQUIFER",0,0,0]
[]
["PRIVATE WATER DEMAND"]
[null,"AVERAGE","DRY","WET","SELECTOR"]
["HOPINGTON AB AQUIFER",{"$f":"SUM('Hopington AB - Analysis'!N61)","v":1719480.2194784998},{"$f":"SUM('Hopington AB - Analysis'!N87)","v":1719480.2194784998},{"$f":"'Hopington AB - Analysis'!N113","v":1719480.2194784998},{"$f":"INDEX(B61:D67,B23,C23)","v":1719480.2194784998}]
["FORT LANGLEY AQUIFER",{"$f":"SUM('Fort Langley - Analysis'!N60)","v":144175.14417499999},{"$f":"SUM('Fort Langley - Analysis'!N86)","v":144175.14417499999},{"$f":"SUM('Fort Langley - Analysis'!N112)","v":144175.14417499999}]
["BEAVER RIVER AQUIFER",{"$f":"SUM('Beaver River - Analysis'!$N$62)","v":1156320},{"$f":"SUM('Beaver River - Analysis'!$N$88)","v":1156320},{"$f":"SUM('Beaver River - Analysis'!$N$114)","v":1156320}]
["WEST OF ALDERGROVE AQUIFER",{"$f":"SUM('West of Aldergrove - Analysis'!N67)","v":990244.99999999977},{"$f":"SUM('West of Aldergrove - Analysis'!N98)","v":990244.99999999977},{"$f":"SUM('West of Aldergrove - Analysis'!N129)","v":990244.99999999977}]
["SOUTH OF MURRAYVILLE AC AQUIFER",0,0,0]
["SALMON RIVER AQUIFER",0,0,0]
["NICOMEKL SERPENTINE AQUIFER",{"$f":"SUM('Nicomekl Serpentine - Analysis'!N60)","v":182499.99999999997},{"$f":"SUM('Nicomekl Serpentine - Analysis'!N86)","v":182499.99999999997},{"$f":"SUM('Nicomekl Serpentine - Analysis'!N112)","v":182499.99999999997}]
[]
[]
["BASE CASE MONTHLY GW CHANGES"]
[null,null,"JAN","FEB","MAR","APR","MAY","JUN","JUL","AUG","SEP","OCT","NOV","DEC"]
["HOPINGTON AB AQUIFER",null,0.46229004999291234,0.58495605454030419,0.55813018941282022,0.21345913019185614,-0.11773094247997662,-0.44595948734839042,-0.79075908454096078,-1.1200256942319442,-1.3560945587052475,-1.1594147672639878,-0.54192796449953973,-8.9167088114356918E-3]
["FORT LANGLEY AQUIFER",null,0.38977233017705815,0.37115865428291128,0.42884004121945546,0.16691917774150067,-2.316714444881679E-2,-0.26982494758553888,-0.49730847770419678,-0.68837852532868371,-0.84565281815077631,-0.64638958850920225,-0.25816024283020972,5.7231286620628152E-2]
["BEAVER RIVER AQUIFER",null,0.39644366101320405,0.52050149661195977,0.76801479990703869,0.81695594113765202,0.89249710861790899,0.49539480779493328,-0.29734091185324618,-0.691613622554764,-0.83858227448533251,-0.61815867502023814,-0.38240509245360926,5.6694716249446886E-3]
["WEST OF ALDERGROVE AQUIFER",null,0.2155458352872032,0.31880708422927684,0.45923256279095154,0.48943751748452879,0.4814886445804627,0.28467814259118651,-8.0197812902466192E-2,-0.33628039402339888,-0.4592066888957137,-0.36007337912637571,-0.20764343242975725,-2.753407813632841E-3]
["SOUTH OF MURRAYVILLE AC AQUIFER",null,7.4784418970222352E-2,0.1125762552478391,0.17096528973951641,0.19247146989870131,0.16006718397710173,7.281222625211102E-2,-3.2468210113928447E-2,-0.1000626378583956,-0.1235672659804153,-9.7192566979938749E-2,-4.7257003610302377E-2,2.4840070777156359E-3]
["SALMON RIVER AQUIFER",null,0,0,0,0,0,0,0,0,0,0,0,0]
["NICOMEKL SERPENTINE AQUIFER",null,2.9542053260129018E-2,3.9738558552452709E-2,5.7740866718285815E-2,6.2064719452405603E-2,6.7572721552356468E-2,3.9571402081715217E-2,-1.8241006952273306E-2,-4.912907079454211E-2,-6.1016015082654765E-2,-4.5903294975587788E-2,-2.8393331576265692E-2,-5.8807125835613761E-15]
[]
["SELECTION FOR PLOT",0,{"$f":"INDEX(C72:C78,$B$23)","v":0.46229004999291234},{"$f":"INDEX(D72:D78,$B$23)","v":0.58495605454030419},0.55813018941282022,0.21345913019185614,-0.11773094247997662,-0.44595948734839042,-0.79075908454096078,-1.1200256942319442,-1.3560945587052475,-1.1594147672639878,-0.54192796449953973,-8.9167088114356918E-3]
[]
[]
["GROUNDWATER OUTFLOW TO SALMON RIVER",null,"TOTAL ANNUAL - BASE CASE","LOWEST MONTH - BASE CASE","TOTAL ANN - SCENARIO","LOWEST MONTH - SCENARIO"]
[]
["HOPINGTON AB AQUIFER",null,8705840.3212310113,573309.87844862684,{"$f":"'Analysis Dashboard'!N46","v":8772935.7304741256},{"$f":"MIN('Analysis Dashboard'!B46:M46)","v":620903.59019317187}]
["FORT LANGLEY AQUIFER",null,589931.16833566991,43187.579211852935,{"$f":"'Analysis Dashboard'!N44","v":1719480.2194784998},{"$f":"MIN('Analysis Dashboard'!B44:M44)","v":126947.3781765}]
["BEAVER RIVER AQUIFER",null," - "," - "," - "," - "]
["WEST OF ALDERGROVE AQUIFER",null," - "," - "," - "," - "]
["SOUTH OF MURRAYVILLE AC AQUIFER",null," - "," - "," - "," - "]
["SALMON RIVER AQUIFER",null," - "," - "," - "," - "]
["NICOMEKL SERPENTINE AQUIFER",null," - "," - "," - "," - "]
[]
[null,"SELECTION",{"$f":"INDEX(C85:C91,$B$23)","v":8705840.3212310113},{"$f":"INDEX(D85:D91,$B$23)","v":573309.87844862684},8772935.7304741256,620903.59019317187]
[null,"PERCENTAGE DIFFERENCES",null,null,{"$f":"(100*(E93/C93))-100","v":0.77069423246240376},{"$f":"(100*(F93/D93))-100","v":8.3015684071820601}]

{"sheet":"Water Budget Distributions","index":15,"n_rows":22,"n_cols":99,"rows_kept":22,"cut":false,"hidden":true,"merged":[]}
[]
[]
[]
[]
[]
[]
[]
[]
[]
[]
[]
[]
[]
[null,"Hopington AB Aquifer - Private Water User Distributions",null,null,null,null,null,null,null,null,null,null,null,null,null,"Fort Langley Aquifer - Private Water User Distributions",null,null,null,null,null,null,null,null,null,null,null,null,null,"Beaver River Aquifer - Private Water User Distributions",null,null,null,null,null,null,null,null,null,null,null,null,null,"West of Aldergrove Aquifer - Private Water User Distributions",null,null,null,null,null,null,null,null,null,null,null,null,null,"South of Murrayville AC Aquifer - Private Water User Distributions",null,null,null,null,null,null,null,null,null,null,null,null,null,"Salmon River Aquifer - Private Water User Distributions",null,null,null,null,null,null,null,null,null,null,null,null,null,"Nikomekl-Seprnetine Aquifer - Private Water User Distributions"]
[null,null,"JAN","FEB","MAR","APR","MAY","JUN","JUL","AUG","SEP","OCT","NOV","DEC","COMMENTS",null,"JAN","FEB","MAR","APR","MAY","JUN","JUL","AUG","SEP","OCT","NOV","DEC",null,null,"JAN","FEB","MAR","APR","MAY","JUN","JUL","AUG","SEP","OCT","NOV","DEC",null,null,"JAN","FEB","MAR","APR","MAY","JUN","JUL","AUG","SEP","OCT","NOV","DEC",null,null,"JAN","FEB","MAR","APR","MAY","JUN","JUL","AUG","SEP","OCT","NOV","DEC",null,null,"JAN","FEB","MAR","APR","MAY","JUN","JUL","AUG","SEP","OCT","NOV","DEC",null,null,"JAN","FEB","MAR","APR","MAY","JUN","JUL","AUG","SEP","OCT","NOV","DEC"]
[null,1,{"$f":"1/12","v":8.3333333333333329E-2},{"$f":"1/12","v":8.3333333333333329E-2},8.3333333333333329E-2,8.3333333333333329E-2,8.3333333333333329E-2,8.3333333333333329E-2,8.3333333333333329E-2,8.3333333333333329E-2,8.3333333333333329E-2,8.3333333333333329E-2,8.3333333333333329E-2,8.3333333333333329E-2,"Constant linear",1,{"$f":"1/12","v":8.3333333333333329E-2},{"$f":"1/12","v":8.3333333333333329E-2},8.3333333333333329E-2,8.3333333333333329E-2,8.3333333333333329E-2,8.3333333333333329E-2,8.3333333333333329E-2,8.3333333333333329E-2,8.3333333333333329E-2,8.3333333333333329E-2,8.3333333333333329E-2,8.3333333333333329E-2,"Constant Linear",1,{"$f":"1/12","v":8.3333333333333329E-2},{"$f":"1/12","v":8.3333333333333329E-2},8.3333333333333329E-2,8.3333333333333329E-2,8.3333333333333329E-2,8.3333333333333329E-2,8.3333333333333329E-2,8.3333333333333329E-2,8.3333333333333329E-2,8.3333333333333329E-2,8.3333333333333329E-2,8.3333333333333329E-2,"Constant Linear",1,{"$f":"1/12","v":8.3333333333333329E-2},{"$f":"1/12","v":8.3333333333333329E-2},8.3333333333333329E-2,8.3333333333333329E-2,8.3333333333333329E-2,8.3333333333333329E-2,8.3333333333333329E-2,8.3333333333333329E-2,8.3333333333333329E-2,8.3333333333333329E-2,8.3333333333333329E-2,8.3333333333333329E-2,"Constant Linear",1,{"$f":"1/12","v":8.3333333333333329E-2},{"$f":"1/12","v":8.3333333333333329E-2},8.3333333333333329E-2,8.3333333333333329E-2,8.3333333333333329E-2,8.3333333333333329E-2,8.3333333333333329E-2,8.3333333333333329E-2,8.3333333333333329E-2,8.3333333333333329E-2,8.3333333333333329E-2,8.3333333333333329E-2,"Constant Linear",1,{"$f":"1/12","v":8.3333333333333329E-2},{"$f":"1/12","v":8.3333333333333329E-2},8.3333333333333329E-2,8.3333333333333329E-2,8.3333333333333329E-2,8.3333333333333329E-2,8.3333333333333329E-2,8.3333333333333329E-2,8.3333333333333329E-2,8.3333333333333329E-2,8.3333333333333329E-2,8.3333333333333329E-2,"Constant Linear",1,{"$f":"1/12","v":8.3333333333333329E-2},{"$f":"1/12","v":8.3333333333333329E-2},8.3333333333333329E-2,8.3333333333333329E-2,8.3333333333333329E-2,8.3333333333333329E-2,8.3333333333333329E-2,8.3333333333333329E-2,8.3333333333333329E-2,8.3333333333333329E-2,8.3333333333333329E-2,8.3333333333333329E-2,"Constant Linear"]
[null,2,2.1903863230800968E-2,3.4785195579140595E-2,6.0803832042224296E-2,9.3423782770024458E-2,0.13008611272687143,0.14036036129585591,0.16916681372909939,0.14937003111939862,0.10284316428603842,5.3014130060877199E-2,2.6012121980545613E-2,1.8230591179123047E-2,"Approximate PET",2,2.1903863230800968E-2,3.4785195579140595E-2,6.0803832042224296E-2,9.3423782770024458E-2,0.13008611272687143,0.14036036129585591,0.16916681372909939,0.14937003111939862,0.10284316428603842,5.3014130060877199E-2,2.6012121980545613E-2,1.8230591179123047E-2,"Approximate PET",2,2.1903863230800968E-2,3.4785195579140595E-2,6.0803832042224296E-2,9.3423782770024458E-2,0.13008611272687143,0.14036036129585591,0.16916681372909939,0.14937003111939862,0.10284316428603842,5.3014130060877199E-2,2.6012121980545613E-2,1.8230591179123047E-2,"Approximate PET",2,2.1903863230800968E-2,3.4785195579140595E-2,6.0803832042224296E-2,9.3423782770024458E-2,0.13008611272687143,0.14036036129585591,0.16916681372909939,0.14937003111939862,0.10284316428603842,5.3014130060877199E-2,2.6012121980545613E-2,1.8230591179123047E-2,"Approximate PET",2,2.1903863230800968E-2,3.4785195579140595E-2,6.0803832042224296E-2,9.3423782770024458E-2,0.13008611272687143,0.14036036129585591,0.16916681372909939,0.14937003111939862,0.10284316428603842,5.3014130060877199E-2,2.6012121980545613E-2,1.8230591179123047E-2,"Approximate PET",2,2.1903863230800968E-2,3.4785195579140595E-2,6.0803832042224296E-2,9.3423782770024458E-2,0.13008611272687143,0.14036036129585591,0.16916681372909939,0.14937003111939862,0.10284316428603842,5.3014130060877199E-2,2.6012121980545613E-2,1.8230591179123047E-2,"Approximate PET",2,2.1903863230800968E-2,3.4785195579140595E-2,6.0803832042224296E-2,9.3423782770024458E-2,0.13008611272687143,0.14036036129585591,0.16916681372909939,0.14937003111939862,0.10284316428603842,5.3014130060877199E-2,2.6012121980545613E-2,1.8230591179123047E-2,"Approximate PET"]
[null,3,7.6448000000000002E-2,7.4661000000000005E-2,7.3829000000000006E-2,7.8698000000000004E-2,9.1536999999999993E-2,9.4908999999999993E-2,9.7153000000000003E-2,8.7910000000000002E-2,8.9154999999999998E-2,7.9184000000000004E-2,7.7745999999999996E-2,7.8770999999999994E-2,"Fort Langley #2 Distribution",3,7.6448000000000002E-2,7.4661000000000005E-2,7.3829000000000006E-2,7.8698000000000004E-2,9.1536999999999993E-2,9.4908999999999993E-2,9.7153000000000003E-2,8.7910000000000002E-2,8.9154999999999998E-2,7.9184000000000004E-2,7.7745999999999996E-2,7.8770999999999994E-2,"Fort Langley #2 Distribution",3,7.2081927738141538E-2,7.2277267999426423E-2,7.7101242618062032E-2,8.0311082575153611E-2,8.2535752292086817E-2,9.4371204052489638E-2,0.11007752892667325,9.8366545248216392E-2,8.7362113082686016E-2,7.8358094673429537E-2,7.4575666330750731E-2,7.2581574462883977E-2,"Distribution of all Aldergrove Wells",3,7.2081927738141538E-2,7.2277267999426423E-2,7.7101242618062032E-2,8.0311082575153611E-2,8.2535752292086817E-2,9.4371204052489638E-2,0.11007752892667325,9.8366545248216392E-2,8.7362113082686016E-2,7.8358094673429537E-2,7.4575666330750731E-2,7.2581574462883977E-2,"Distribution of all Aldergrove Wells",3,7.2081927738141538E-2,7.2277267999426423E-2,7.7101242618062032E-2,8.0311082575153611E-2,8.2535752292086817E-2,9.4371204052489638E-2,0.11007752892667325,9.8366545248216392E-2,8.7362113082686016E-2,7.8358094673429537E-2,7.4575666330750731E-2,7.2581574462883977E-2,"Distribution of all Aldergrove Wells",3,7.2081927738141538E-2,7.2277267999426423E-2,7.7101242618062032E-2,8.0311082575153611E-2,8.2535752292086817E-2,9.4371204052489638E-2,0.11007752892667325,9.8366545248216392E-2,8.7362113082686016E-2,7.8358094673429537E-2,7.4575666330750731E-2,7.2581574462883977E-2,"Distribution of all Aldergrove Wells",3,7.2081927738141538E-2,7.2277267999426423E-2,7.7101242618062032E-2,8.0311082575153611E-2,8.2535752292086817E-2,9.4371204052489638E-2,0.11007752892667325,9.8366545248216392E-2,8.7362113082686016E-2,7.8358094673429537E-2,7.4575666330750731E-2,7.2581574462883977E-2,"Distribution of all Aldergrove Wells"]
[null,4,{"$f":"'User Specified Distributions'!B20","v":0.01},{"$f":"'User Specified Distributions'!C20","v":0.02},{"$f":"'User Specified Distributions'!D20","v":0.05},{"$f":"'User Specified Distributions'!E20","v":0.1},{"$f":"'User Specified Distributions'!F20","v":0.1},{"$f":"'User Specified Distributions'!G20","v":0.125},{"$f":"'User Specified Distributions'!H20","v":0.125},{"$f":"'User Specified Distributions'!I20","v":0.125},{"$f":"'User Specified Distributions'!J20","v":0.125},{"$f":"'User Specified Distributions'!K20","v":0.1},{"$f":"'User Specified Distributions'!L20","v":0.1},{"$f":"'User Specified Distributions'!M20","v":0.02},"User-Specified Distribution #1",4,{"$f":"'User Specified Distributions'!B20","v":0.01},{"$f":"'User Specified Distributions'!C20","v":0.02},{"$f":"'User Specified Distributions'!D20","v":0.05},{"$f":"'User Specified Distributions'!E20","v":0.1},{"$f":"'User Specified Distributions'!F20","v":0.1},{"$f":"'User Specified Distributions'!G20","v":0.125},{"$f":"'User Specified Distributions'!H20","v":0.125},{"$f":"'User Specified Distributions'!I20","v":0.125},{"$f":"'User Specified Distributions'!J20","v":0.125},{"$f":"'User Specified Distributions'!K20","v":0.1},{"$f":"'User Specified Distributions'!L20","v":0.1},{"$f":"'User Specified Distributions'!M20","v":0.02},"User-Specified Distribution #1",4,{"$f":"'User Specified Distributions'!B20","v":0.01},{"$f":"'User Specified Distributions'!C20","v":0.02},{"$f":"'User Specified Distributions'!D20","v":0.05},{"$f":"'User Specified Distributions'!E20","v":0.1},{"$f":"'User Specified Distributions'!F20","v":0.1},{"$f":"'User Specified Distributions'!G20","v":0.125},{"$f":"'User Specified Distributions'!H20","v":0.125},{"$f":"'User Specified Distributions'!I20","v":0.125},{"$f":"'User Specified Distributions'!J20","v":0.125},{"$f":"'User Specified Distributions'!K20","v":0.1},{"$f":"'User Specified Distributions'!L20","v":0.1},{"$f":"'User Specified Distributions'!M20","v":0.02},"User-Specified Distribution #1",4,{"$f":"'User Specified Distributions'!B20","v":0.01},{"$f":"'User Specified Distributions'!C20","v":0.02},{"$f":"'User Specified Distributions'!D20","v":0.05},{"$f":"'User Specified Distributions'!E20","v":0.1},{"$f":"'User Specified Distributions'!F20","v":0.1},{"$f":"'User Specified Distributions'!G20","v":0.125},{"$f":"'User Specified Distributions'!H20","v":0.125},{"$f":"'User Specified Distributions'!I20","v":0.125},{"$f":"'User Specified Distributions'!J20","v":0.125},{"$f":"'User Specified Distributions'!K20","v":0.1},{"$f":"'User Specified Distributions'!L20","v":0.1},{"$f":"'User Specified Distributions'!M20","v":0.02},"User-Specified Distribution #1",4,{"$f":"'User Specified Distributions'!B20","v":0.01},{"$f":"'User Specified Distributions'!C20","v":0.02},{"$f":"'User Specified Distributions'!D20","v":0.05},{"$f":"'User Specified Distributions'!E20","v":0.1},{"$f":"'User Specified Distributions'!F20","v":0.1},{"$f":"'User Specified Distributions'!G20","v":0.125},{"$f":"'User Specified Distributions'!H20","v":0.125},{"$f":"'User Specified Distributions'!I20","v":0.125},{"$f":"'User Specified Distributions'!J20","v":0.125},{"$f":"'User Specified Distributions'!K20","v":0.1},{"$f":"'User Specified Distributions'!L20","v":0.1},{"$f":"'User Specified Distributions'!M20","v":0.02},"User-Specified Distribution #1",4,{"$f":"'User Specified Distributions'!B20","v":0.01},{"$f":"'User Specified Distributions'!C20","v":0.02},{"$f":"'User Specified Distributions'!D20","v":0.05},{"$f":"'User Specified Distributions'!E20","v":0.1},{"$f":"'User Specified Distributions'!F20","v":0.1},{"$f":"'User Specified Distributions'!G20","v":0.125},{"$f":"'User Specified Distributions'!H20","v":0.125},{"$f":"'User Specified Distributions'!I20","v":0.125},{"$f":"'User Specified Distributions'!J20","v":0.125},{"$f":"'User Specified Distributions'!K20","v":0.1},{"$f":"'User Specified Distributions'!L20","v":0.1},{"$f":"'User Specified Distributions'!M20","v":0.02},"User-Specified Distribution #1",4,{"$f":"'User Specified Distributions'!B20","v":0.01},{"$f":"'User Specified Distributions'!C20","v":0.02},{"$f":"'User Specified Distributions'!D20","v":0.05},{"$f":"'User Specified Distributions'!E20","v":0.1},{"$f":"'User Specified Distributions'!F20","v":0.1},{"$f":"'User Specified Distributions'!G20","v":0.125},{"$f":"'User Specified Distributions'!H20","v":0.125},{"$f":"'User Specified Distributions'!I20","v":0.125},{"$f":"'User Specified Distributions'!J20","v":0.125},{"$f":"'User Specified Distributions'!K20","v":0.1},{"$f":"'User Specified Distributions'!L20","v":0.1},{"$f":"'User Specified Distributions'!M20","v":0.02},"User-Specified Distribution #1"]
[null,5,{"$f":"'User Specified Distributions'!B21","v":0.05},{"$f":"'User Specified Distributions'!C21","v":0.05},{"$f":"'User Specified Distributions'!D21","v":0.1},{"$f":"'User Specified Distributions'!E21","v":0.1},{"$f":"'User Specified Distributions'!F21","v":0.1},{"$f":"'User Specified Distributions'!G21","v":0.1},{"$f":"'User Specified Distributions'!H21","v":0.15},{"$f":"'User Specified Distributions'!I21","v":0.15},{"$f":"'User Specified Distributions'!J21","v":0.1},{"$f":"'User Specified Distributions'!K21","v":0.05},{"$f":"'User Specified Distributions'!L21","v":2.5000000000000001E-2},{"$f":"'User Specified Distributions'!M21","v":2.5000000000000001E-2},"User-Specified Distribution #2",5,{"$f":"'User Specified Distributions'!B21","v":0.05},{"$f":"'User Specified Distributions'!C21","v":0.05},{"$f":"'User Specified Distributions'!D21","v":0.1},{"$f":"'User Specified Distributions'!E21","v":0.1},{"$f":"'User Specified Distributions'!F21","v":0.1},{"$f":"'User Specified Distributions'!G21","v":0.1},{"$f":"'User Specified Distributions'!H21","v":0.15},{"$f":"'User Specified Distributions'!I21","v":0.15},{"$f":"'User Specified Distributions'!J21","v":0.1},{"$f":"'User Specified Distributions'!K21","v":0.05},{"$f":"'User Specified Distributions'!L21","v":2.5000000000000001E-2},{"$f":"'User Specified Distributions'!M21","v":2.5000000000000001E-2},"User-Specified Distribution #2",5,{"$f":"'User Specified Distributions'!B21","v":0.05},{"$f":"'User Specified Distributions'!C21","v":0.05},{"$f":"'User Specified Distributions'!D21","v":0.1},{"$f":"'User Specified Distributions'!E21","v":0.1},{"$f":"'User Specified Distributions'!F21","v":0.1},{"$f":"'User Specified Distributions'!G21","v":0.1},{"$f":"'User Specified Distributions'!H21","v":0.15},{"$f":"'User Specified Distributions'!I21","v":0.15},{"$f":"'User Specified Distributions'!J21","v":0.1},{"$f":"'User Specified Distributions'!K21","v":0.05},{"$f":"'User Specified Distributions'!L21","v":2.5000000000000001E-2},{"$f":"'User Specified Distributions'!M21","v":2.5000000000000001E-2},"User-Specified Distribution #2",5,{"$f":"'User Specified Distributions'!B21","v":0.05},{"$f":"'User Specified Distributions'!C21","v":0.05},{"$f":"'User Specified Distributions'!D21","v":0.1},{"$f":"'User Specified Distributions'!E21","v":0.1},{"$f":"'User Specified Distributions'!F21","v":0.1},{"$f":"'User Specified Distributions'!G21","v":0.1},{"$f":"'User Specified Distributions'!H21","v":0.15},{"$f":"'User Specified Distributions'!I21","v":0.15},{"$f":"'User Specified Distributions'!J21","v":0.1},{"$f":"'User Specified Distributions'!K21","v":0.05},{"$f":"'User Specified Distributions'!L21","v":2.5000000000000001E-2},{"$f":"'User Specified Distributions'!M21","v":2.5000000000000001E-2},"User-Specified Distribution #2",5,{"$f":"'User Specified Distributions'!B21","v":0.05},{"$f":"'User Specified Distributions'!C21","v":0.05},{"$f":"'User Specified Distributions'!D21","v":0.1},{"$f":"'User Specified Distributions'!E21","v":0.1},{"$f":"'User Specified Distributions'!F21","v":0.1},{"$f":"'User Specified Distributions'!G21","v":0.1},{"$f":"'User Specified Distributions'!H21","v":0.15},{"$f":"'User Specified Distributions'!I21","v":0.15},{"$f":"'User Specified Distributions'!J21","v":0.1},{"$f":"'User Specified Distributions'!K21","v":0.05},{"$f":"'User Specified Distributions'!L21","v":2.5000000000000001E-2},{"$f":"'User Specified Distributions'!M21","v":2.5000000000000001E-2},"User-Specified Distribution #2",5,{"$f":"'User Specified Distributions'!B21","v":0.05},{"$f":"'User Specified Distributions'!C21","v":0.05},{"$f":"'User Specified Distributions'!D21","v":0.1},{"$f":"'User Specified Distributions'!E21","v":0.1},{"$f":"'User Specified Distributions'!F21","v":0.1},{"$f":"'User Specified Distributions'!G21","v":0.1},{"$f":"'User Specified Distributions'!H21","v":0.15},{"$f":"'User Specified Distributions'!I21","v":0.15},{"$f":"'User Specified Distributions'!J21","v":0.1},{"$f":"'User Specified Distributions'!K21","v":0.05},{"$f":"'User Specified Distributions'!L21","v":2.5000000000000001E-2},{"$f":"'User Specified Distributions'!M21","v":2.5000000000000001E-2},"User-Specified Distribution #2",5,{"$f":"'User Specified Distributions'!B21","v":0.05},{"$f":"'User Specified Distributions'!C21","v":0.05},{"$f":"'User Specified Distributions'!D21","v":0.1},{"$f":"'User Specified Distributions'!E21","v":0.1},{"$f":"'User Specified Distributions'!F21","v":0.1},{"$f":"'User Specified Distributions'!G21","v":0.1},{"$f":"'User Specified Distributions'!H21","v":0.15},{"$f":"'User Specified Distributions'!I21","v":0.15},{"$f":"'User Specified Distributions'!J21","v":0.1},{"$f":"'User Specified Distributions'!K21","v":0.05},{"$f":"'User Specified Distributions'!L21","v":2.5000000000000001E-2},{"$f":"'User Specified Distributions'!M21","v":2.5000000000000001E-2},"User-Specified Distribution #2"]
[null,6,{"$f":"'User Specified Distributions'!B22","v":0.02},{"$f":"'User Specified Distributions'!C22","v":0.04},{"$f":"'User Specified Distributions'!D22","v":0.06},{"$f":"'User Specified Distributions'!E22","v":0.08},{"$f":"'User Specified Distributions'!F22","v":0.1},{"$f":"'User Specified Distributions'!G22","v":0.15},{"$f":"'User Specified Distributions'!H22","v":0.2},{"$f":"'User Specified Distributions'!I22","v":0.15},{"$f":"'User Specified Distributions'!J22","v":0.1},{"$f":"'User Specified Distributions'!K22","v":0.06},{"$f":"'User Specified Distributions'!L22","v":0.03},{"$f":"'User Specified Distributions'!M22","v":0.01},"User-Specified Distribution #3",6,{"$f":"'User Specified Distributions'!B22","v":0.02},{"$f":"'User Specified Distributions'!C22","v":0.04},{"$f":"'User Specified Distributions'!D22","v":0.06},{"$f":"'User Specified Distributions'!E22","v":0.08},{"$f":"'User Specified Distributions'!F22","v":0.1},{"$f":"'User Specified Distributions'!G22","v":0.15},{"$f":"'User Specified Distributions'!H22","v":0.2},{"$f":"'User Specified Distributions'!I22","v":0.15},{"$f":"'User Specified Distributions'!J22","v":0.1},{"$f":"'User Specified Distributions'!K22","v":0.06},{"$f":"'User Specified Distributions'!L22","v":0.03},{"$f":"'User Specified Distributions'!M22","v":0.01},"User-Specified Distribution #3",6,{"$f":"'User Specified Distributions'!B22","v":0.02},{"$f":"'User Specified Distributions'!C22","v":0.04},{"$f":"'User Specified Distributions'!D22","v":0.06},{"$f":"'User Specified Distributions'!E22","v":0.08},{"$f":"'User Specified Distributions'!F22","v":0.1},{"$f":"'User Specified Distributions'!G22","v":0.15},{"$f":"'User Specified Distributions'!H22","v":0.2},{"$f":"'User Specified Distributions'!I22","v":0.15},{"$f":"'User Specified Distributions'!J22","v":0.1},{"$f":"'User Specified Distributions'!K22","v":0.06},{"$f":"'User Specified Distributions'!L22","v":0.03},{"$f":"'User Specified Distributions'!M22","v":0.01},"User-Specified Distribution #3",6,{"$f":"'User Specified Distributions'!B22","v":0.02},{"$f":"'User Specified Distributions'!C22","v":0.04},{"$f":"'User Specified Distributions'!D22","v":0.06},{"$f":"'User Specified Distributions'!E22","v":0.08},{"$f":"'User Specified Distributions'!F22","v":0.1},{"$f":"'User Specified Distributions'!G22","v":0.15},{"$f":"'User Specified Distributions'!H22","v":0.2},{"$f":"'User Specified Distributions'!I22","v":0.15},{"$f":"'User Specified Distributions'!J22","v":0.1},{"$f":"'User Specified Distributions'!K22","v":0.06},{"$f":"'User Specified Distributions'!L22","v":0.03},{"$f":"'User Specified Distributions'!M22","v":0.01},"User-Specified Distribution #3",6,{"$f":"'User Specified Distributions'!B22","v":0.02},{"$f":"'User Specified Distributions'!C22","v":0.04},{"$f":"'User Specified Distributions'!D22","v":0.06},{"$f":"'User Specified Distributions'!E22","v":0.08},{"$f":"'User Specified Distributions'!F22","v":0.1},{"$f":"'User Specified Distributions'!G22","v":0.15},{"$f":"'User Specified Distributions'!H22","v":0.2},{"$f":"'User Specified Distributions'!I22","v":0.15},{"$f":"'User Specified Distributions'!J22","v":0.1},{"$f":"'User Specified Distributions'!K22","v":0.06},{"$f":"'User Specified Distributions'!L22","v":0.03},{"$f":"'User Specified Distributions'!M22","v":0.01},"User-Specified Distribution #3",6,{"$f":"'User Specified Distributions'!B22","v":0.02},{"$f":"'User Specified Distributions'!C22","v":0.04},{"$f":"'User Specified Distributions'!D22","v":0.06},{"$f":"'User Specified Distributions'!E22","v":0.08},{"$f":"'User Specified Distributions'!F22","v":0.1},{"$f":"'User Specified Distributions'!G22","v":0.15},{"$f":"'User Specified Distributions'!H22","v":0.2},{"$f":"'User Specified Distributions'!I22","v":0.15},{"$f":"'User Specified Distributions'!J22","v":0.1},{"$f":"'User Specified Distributions'!K22","v":0.06},{"$f":"'User Specified Distributions'!L22","v":0.03},{"$f":"'User Specified Distributions'!M22","v":0.01},"User-Specified Distribution #3",6,{"$f":"'User Specified Distributions'!B22","v":0.02},{"$f":"'User Specified Distributions'!C22","v":0.04},{"$f":"'User Specified Distributions'!D22","v":0.06},{"$f":"'User Specified Distributions'!E22","v":0.08},{"$f":"'User Specified Distributions'!F22","v":0.1},{"$f":"'User Specified Distributions'!G22","v":0.15},{"$f":"'User Specified Distributions'!H22","v":0.2},{"$f":"'User Specified Distributions'!I22","v":0.15},{"$f":"'User Specified Distributions'!J22","v":0.1},{"$f":"'User Specified Distributions'!K22","v":0.06},{"$f":"'User Specified Distributions'!L22","v":0.03},{"$f":"'User Specified Distributions'!M22","v":0.01},"User-Specified Distribution #3"]
[null,7,{"$f":"'User Specified Distributions'!B23","v":0.05},{"$f":"'User Specified Distributions'!C23","v":0.06},{"$f":"'User Specified Distributions'!D23","v":7.0000000000000007E-2},{"$f":"'User Specified Distributions'!E23","v":0.08},{"$f":"'User Specified Distributions'!F23","v":0.09},{"$f":"'User Specified Distributions'!G23","v":0.1},{"$f":"'User Specified Distributions'!H23","v":0.12},{"$f":"'User Specified Distributions'!I23","v":0.13},{"$f":"'User Specified Distributions'!J23","v":0.11},{"$f":"'User Specified Distributions'!K23","v":0.08},{"$f":"'User Specified Distributions'!L23","v":7.0000000000000007E-2},{"$f":"'User Specified Distributions'!M23","v":0.04},"User-Specified Distribution #4",7,{"$f":"'User Specified Distributions'!B23","v":0.05},{"$f":"'User Specified Distributions'!C23","v":0.06},{"$f":"'User Specified Distributions'!D23","v":7.0000000000000007E-2},{"$f":"'User Specified Distributions'!E23","v":0.08},{"$f":"'User Specified Distributions'!F23","v":0.09},{"$f":"'User Specified Distributions'!G23","v":0.1},{"$f":"'User Specified Distributions'!H23","v":0.12},{"$f":"'User Specified Distributions'!I23","v":0.13},{"$f":"'User Specified Distributions'!J23","v":0.11},{"$f":"'User Specified Distributions'!K23","v":0.08},{"$f":"'User Specified Distributions'!L23","v":7.0000000000000007E-2},{"$f":"'User Specified Distributions'!M23","v":0.04},"User-Specified Distribution #4",7,{"$f":"'User Specified Distributions'!B23","v":0.05},{"$f":"'User Specified Distributions'!C23","v":0.06},{"$f":"'User Specified Distributions'!D23","v":7.0000000000000007E-2},{"$f":"'User Specified Distributions'!E23","v":0.08},{"$f":"'User Specified Distributions'!F23","v":0.09},{"$f":"'User Specified Distributions'!G23","v":0.1},{"$f":"'User Specified Distributions'!H23","v":0.12},{"$f":"'User Specified Distributions'!I23","v":0.13},{"$f":"'User Specified Distributions'!J23","v":0.11},{"$f":"'User Specified Distributions'!K23","v":0.08},{"$f":"'User Specified Distributions'!L23","v":7.0000000000000007E-2},{"$f":"'User Specified Distributions'!M23","v":0.04},"User-Specified Distribution #4",7,{"$f":"'User Specified Distributions'!B23","v":0.05},{"$f":"'User Specified Distributions'!C23","v":0.06},{"$f":"'User Specified Distributions'!D23","v":7.0000000000000007E-2},{"$f":"'User Specified Distributions'!E23","v":0.08},{"$f":"'User Specified Distributions'!F23","v":0.09},{"$f":"'User Specified Distributions'!G23","v":0.1},{"$f":"'User Specified Distributions'!H23","v":0.12},{"$f":"'User Specified Distributions'!I23","v":0.13},{"$f":"'User Specified Distributions'!J23","v":0.11},{"$f":"'User Specified Distributions'!K23","v":0.08},{"$f":"'User Specified Distributions'!L23","v":7.0000000000000007E-2},{"$f":"'User Specified Distributions'!M23","v":0.04},"User-Specified Distribution #4",7,{"$f":"'User Specified Distributions'!B23","v":0.05},{"$f":"'User Specified Distributions'!C23","v":0.06},{"$f":"'User Specified Distributions'!D23","v":7.0000000000000007E-2},{"$f":"'User Specified Distributions'!E23","v":0.08},{"$f":"'User Specified Distributions'!F23","v":0.09},{"$f":"'User Specified Distributions'!G23","v":0.1},{"$f":"'User Specified Distributions'!H23","v":0.12},{"$f":"'User Specified Distributions'!I23","v":0.13},{"$f":"'User Specified Distributions'!J23","v":0.11},{"$f":"'User Specified Distributions'!K23","v":0.08},{"$f":"'User Specified Distributions'!L23","v":7.0000000000000007E-2},{"$f":"'User Specified Distributions'!M23","v":0.04},"User-Specified Distribution #4",7,{"$f":"'User Specified Distributions'!B23","v":0.05},{"$f":"'User Specified Distributions'!C23","v":0.06},{"$f":"'User Specified Distributions'!D23","v":7.0000000000000007E-2},{"$f":"'User Specified Distributions'!E23","v":0.08},{"$f":"'User Specified Distributions'!F23","v":0.09},{"$f":"'User Specified Distributions'!G23","v":0.1},{"$f":"'User Specified Distributions'!H23","v":0.12},{"$f":"'User Specified Distributions'!I23","v":0.13},{"$f":"'User Specified Distributions'!J23","v":0.11},{"$f":"'User Specified Distributions'!K23","v":0.08},{"$f":"'User Specified Distributions'!L23","v":7.0000000000000007E-2},{"$f":"'User Specified Distributions'!M23","v":0.04},"User-Specified Distribution #4",7,{"$f":"'User Specified Distributions'!B23","v":0.05},{"$f":"'User Specified Distributions'!C23","v":0.06},{"$f":"'User Specified Distributions'!D23","v":7.0000000000000007E-2},{"$f":"'User Specified Distributions'!E23","v":0.08},{"$f":"'User Specified Distributions'!F23","v":0.09},{"$f":"'User Specified Distributions'!G23","v":0.1},{"$f":"'User Specified Distributions'!H23","v":0.12},{"$f":"'User Specified Distributions'!I23","v":0.13},{"$f":"'User Specified Distributions'!J23","v":0.11},{"$f":"'User Specified Distributions'!K23","v":0.08},{"$f":"'User Specified Distributions'!L23","v":7.0000000000000007E-2},{"$f":"'User Specified Distributions'!M23","v":0.04},"User-Specified Distribution #4"]

{"sheet":"Inflow Data","index":16,"n_rows":192,"n_cols":30,"rows_kept":192,"cut":false,"hidden":true,"merged":[]}
[]
[]
[]
[]
[]
[]
[]
[]
[]
[null,null,null,null,null,null,null,null,null,null,null,null,null,null,null,null,"RESULT"]
["ROW 1 INFLOW",null,null,null,null,null,null,null,null,null,null,null,null,null,null,"col number",1,2,3,4,5,6,7,8,9,10,11,12,13,14]
["INFLOW SOURCE / TYPE","JAN","FEB","MAR","APR","MAY","JUN","JUL","AUG","SEP","OCT","NOV","DEC","ANNUAL",null,null,"INFLOW SOURCE / TYPE","JAN","FEB","MAR","APR","MAY","JUN","JUL","AUG","SEP","OCT","NOV","DEC","ANNUAL"]
[{"$f":"'Hopington AB - Analysis'!A47","v":"GW inflow from surrounding aquitards (m3)"},{"$f":"'Hopington AB - Analysis'!B47","v":403062},{"$f":"'Hopington AB - Analysis'!C47","v":364056},{"$f":"'Hopington AB - Analysis'!D47","v":403062},{"$f":"'Hopington AB - Analysis'!E47","v":390060},{"$f":"'Hopington AB - Analysis'!F47","v":403062},{"$f":"'Hopington AB - Analysis'!G47","v":390060},{"$f":"'Hopington AB - Analysis'!H47","v":403062},{"$f":"'Hopington AB - Analysis'!I47","v":403062},{"$f":"'Hopington AB - Analysis'!J47","v":390060},{"$f":"'Hopington AB - Analysis'!K47","v":403062},{"$f":"'Hopington AB - Analysis'!L47","v":390060},{"$f":"'Hopington AB - Analysis'!M47","v":403062},{"$f":"'Hopington AB - Analysis'!N47","v":4745730},null,null,{"$f":"INDEX($A13:$N33,'Form Control Selectors'!$B$34,Q$11)","v":"GW inflow from surrounding aquitards (m3)"},{"$f":"INDEX($A13:$N33,'Form Control Selectors'!$B$34,R$11)","v":403062},{"$f":"INDEX($A13:$N33,'Form Control Selectors'!$B$34,S$11)","v":364056},{"$f":"INDEX($A13:$N33,'Form Control Selectors'!$B$34,T$11)","v":403062},{"$f":"INDEX($A13:$N33,'Form Control Selectors'!$B$34,U$11)","v":390060},{"$f":"INDEX($A13:$N33,'Form Control Selectors'!$B$34,V$11)","v":403062},{"$f":"INDEX($A13:$N33,'Form Control Selectors'!$B$34,W$11)","v":390060},{"$f":"INDEX($A13:$N33,'Form Control Selectors'!$B$34,X$11)","v":403062},{"$f":"INDEX($A13:$N33,'Form Control Selectors'!$B$34,Y$11)","v":403062},{"$f":"INDEX($A13:$N33,'Form Control Selectors'!$B$34,Z$11)","v":390060},{"$f":"INDEX($A13:$N33,'Form Control Selectors'!$B$34,AA$11)","v":403062},{"$f":"INDEX($A13:$N33,'Form Control Selectors'!$B$34,AB$11)","v":390060},{"$f":"INDEX($A13:$N33,'Form Control Selectors'!$B$34,AC$11)","v":403062},{"$f":"INDEX($A13:$N33,'Form Control Selectors'!$B$34,AD$11)","v":4745730}]
[{"$f":"'Hopington AB - Analysis'!A73","v":"GW inflow from surrounding aquitards (m3)"},{"$f":"'Hopington AB - Analysis'!B73","v":403062},{"$f":"'Hopington AB - Analysis'!C73","v":364056},{"$f":"'Hopington AB - Analysis'!D73","v":403062},{"$f":"'Hopington AB - Analysis'!E73","v":390060},{"$f":"'Hopington AB - Analysis'!F73","v":403062},{"$f":"'Hopington AB - Analysis'!G73","v":390060},{"$f":"'Hopington AB - Analysis'!H73","v":403062},{"$f":"'Hopington AB - Analysis'!I73","v":403062},{"$f":"'Hopington AB - Analysis'!J73","v":390060},{"$f":"'Hopington AB - Analysis'!K73","v":403062},{"$f":"'Hopington AB - Analysis'!L73","v":390060},{"$f":"'Hopington AB - Analysis'!M73","v":403062},{"$f":"'Hopington AB - Analysis'!N73","v":4745730},null,null,{"$f":"INDEX($A$44:$N$64,'Form Control Selectors'!$B$34,Q$11)","v":"GW inflow from Aldergrove CD (m3)"},{"$f":"INDEX($A$44:$N$64,'Form Control Selectors'!$B$34,R$11)","v":60357},{"$f":"INDEX($A$44:$N$64,'Form Control Selectors'!$B$34,S$11)","v":54516},{"$f":"INDEX($A$44:$N$64,'Form Control Selectors'!$B$34,T$11)","v":60357},{"$f":"INDEX($A$44:$N$64,'Form Control Selectors'!$B$34,U$11)","v":58410},{"$f":"INDEX($A$44:$N$64,'Form Control Selectors'!$B$34,V$11)","v":60357},{"$f":"INDEX($A$44:$N$64,'Form Control Selectors'!$B$34,W$11)","v":58410},{"$f":"INDEX($A$44:$N$64,'Form Control Selectors'!$B$34,X$11)","v":60357},{"$f":"INDEX($A$44:$N$64,'Form Control Selectors'!$B$34,Y$11)","v":60357},{"$f":"INDEX($A$44:$N$64,'Form Control Selectors'!$B$34,Z$11)","v":58410},{"$f":"INDEX($A$44:$N$64,'Form Control Selectors'!$B$34,AA$11)","v":60357},{"$f":"INDEX($A$44:$N$64,'Form Control Selectors'!$B$34,AB$11)","v":58410},{"$f":"INDEX($A$44:$N$64,'Form Control Selectors'!$B$34,AC$11)","v":60357},{"$f":"INDEX($A$44:$N$64,'Form Control Selectors'!$B$34,AD$11)","v":710655}]
[{"$f":"'Hopington AB - Analysis'!A99","v":"GW inflow from surrounding aquitards (m3)"},{"$f":"'Hopington AB - Analysis'!B99","v":403062},{"$f":"'Hopington AB - Analysis'!C99","v":364056},{"$f":"'Hopington AB - Analysis'!D99","v":403062},{"$f":"'Hopington AB - Analysis'!E99","v":390060},{"$f":"'Hopington AB - Analysis'!F99","v":403062},{"$f":"'Hopington AB - Analysis'!G99","v":390060},{"$f":"'Hopington AB - Analysis'!H99","v":403062},{"$f":"'Hopington AB - Analysis'!I99","v":403062},{"$f":"'Hopington AB - Analysis'!J99","v":390060},{"$f":"'Hopington AB - Analysis'!K99","v":403062},{"$f":"'Hopington AB - Analysis'!L99","v":390060},{"$f":"'Hopington AB - Analysis'!M99","v":403062},{"$f":"'Hopington AB - Analysis'!N99","v":4745730},null,null,{"$f":"INDEX($A$75:$N$95,'Form Control Selectors'!$B$34,Q$11)","v":"GW inflow from Beaver River  (m3)"},{"$f":"INDEX($A$75:$N$95,'Form Control Selectors'!$B$34,R$11)","v":112561},{"$f":"INDEX($A$75:$N$95,'Form Control Selectors'!$B$34,S$11)","v":101668},{"$f":"INDEX($A$75:$N$95,'Form Control Selectors'!$B$34,T$11)","v":112561},{"$f":"INDEX($A$75:$N$95,'Form Control Selectors'!$B$34,U$11)","v":108930},{"$f":"INDEX($A$75:$N$95,'Form Control Selectors'!$B$34,V$11)","v":112561},{"$f":"INDEX($A$75:$N$95,'Form Control Selectors'!$B$34,W$11)","v":108930},{"$f":"INDEX($A$75:$N$95,'Form Control Selectors'!$B$34,X$11)","v":112561},{"$f":"INDEX($A$75:$N$95,'Form Control Selectors'!$B$34,Y$11)","v":112561},{"$f":"INDEX($A$75:$N$95,'Form Control Selectors'!$B$34,Z$11)","v":108930},{"$f":"INDEX($A$75:$N$95,'Form Control Selectors'!$B$34,AA$11)","v":112561},{"$f":"INDEX($A$75:$N$95,'Form Control Selectors'!$B$34,AB$11)","v":108930},{"$f":"INDEX($A$75:$N$95,'Form Control Selectors'!$B$34,AC$11)","v":112561},{"$f":"INDEX($A$75:$N$95,'Form Control Selectors'!$B$34,AD$11)","v":1325315}]
[{"$f":"'Fort Langley - Analysis'!A47","v":"GW inflow from surrounding aquitards (m3)"},{"$f":"'Fort Langley - Analysis'!B47","v":400210},{"$f":"'Fort Langley - Analysis'!C47","v":361480},{"$f":"'Fort Langley - Analysis'!D47","v":400210},{"$f":"'Fort Langley - Analysis'!E47","v":387300},{"$f":"'Fort Langley - Analysis'!F47","v":400210},{"$f":"'Fort Langley - Analysis'!G47","v":387300},{"$f":"'Fort Langley - Analysis'!H47","v":400210},{"$f":"'Fort Langley - Analysis'!I47","v":400210},{"$f":"'Fort Langley - Analysis'!J47","v":387300},{"$f":"'Fort Langley - Analysis'!K47","v":400210},{"$f":"'Fort Langley - Analysis'!L47","v":387300},{"$f":"'Fort Langley - Analysis'!M47","v":400210},{"$f":"'Fort Langley - Analysis'!N47","v":4712150},null,null,{"$f":"INDEX($A$106:$N$126,'Form Control Selectors'!$B$34,Q$11)","v":"SW inflow to aquifer (m3) - Nicomekl R. / Bertrand Ck."},{"$f":"INDEX($A$106:$N$126,'Form Control Selectors'!$B$34,R$11)","v":23792.5},{"$f":"INDEX($A$106:$N$126,'Form Control Selectors'!$B$34,S$11)","v":21490},{"$f":"INDEX($A$106:$N$126,'Form Control Selectors'!$B$34,T$11)","v":23792.5},{"$f":"INDEX($A$106:$N$126,'Form Control Selectors'!$B$34,U$11)","v":23025},{"$f":"INDEX($A$106:$N$126,'Form Control Selectors'!$B$34,V$11)","v":23792.5},{"$f":"INDEX($A$106:$N$126,'Form Control Selectors'!$B$34,W$11)","v":23025},{"$f":"INDEX($A$106:$N$126,'Form Control Selectors'!$B$34,X$11)","v":23792.5},{"$f":"INDEX($A$106:$N$126,'Form Control Selectors'!$B$34,Y$11)","v":23792.5},{"$f":"INDEX($A$106:$N$126,'Form Control Selectors'!$B$34,Z$11)","v":23025},{"$f":"INDEX($A$106:$N$126,'Form Control Selectors'!$B$34,AA$11)","v":23792.5},{"$f":"INDEX($A$106:$N$126,'Form Control Selectors'!$B$34,AB$11)","v":23025},{"$f":"INDEX($A$106:$N$126,'Form Control Selectors'!$B$34,AC$11)","v":23792.5},{"$f":"INDEX($A$106:$N$126,'Form Control Selectors'!$B$34,AD$11)","v":280137.5}]
[{"$f":"'Fort Langley - Analysis'!A73","v":"GW inflow from surrounding aquitards (m3)"},{"$f":"'Fort Langley - Analysis'!B73","v":400210},{"$f":"'Fort Langley - Analysis'!C73","v":361480},{"$f":"'Fort Langley - Analysis'!D73","v":400210},{"$f":"'Fort Langley - Analysis'!E73","v":387300},{"$f":"'Fort Langley - Analysis'!F73","v":400210},{"$f":"'Fort Langley - Analysis'!G73","v":387300},{"$f":"'Fort Langley - Analysis'!H73","v":400210},{"$f":"'Fort Langley - Analysis'!I73","v":400210},{"$f":"'Fort Langley - Analysis'!J73","v":387300},{"$f":"'Fort Langley - Analysis'!K73","v":400210},{"$f":"'Fort Langley - Analysis'!L73","v":387300},{"$f":"'Fort Langley - Analysis'!M73","v":400210},{"$f":"'Fort Langley - Analysis'!N73","v":4712150},null,null,{"$f":"INDEX($A$137:$N$157,'Form Control Selectors'!$B$34,Q$11)","v":"Recharge (m3)"},{"$f":"INDEX($A$137:$N$157,'Form Control Selectors'!$B$34,R$11)","v":1945622.6077544768},{"$f":"INDEX($A$137:$N$157,'Form Control Selectors'!$B$34,S$11)","v":1176467.0748115426},{"$f":"INDEX($A$137:$N$157,'Form Control Selectors'!$B$34,T$11)","v":791397.8116823663},{"$f":"INDEX($A$137:$N$157,'Form Control Selectors'!$B$34,U$11)","v":100816.20033359071},{"$f":"INDEX($A$137:$N$157,'Form Control Selectors'!$B$34,V$11)","v":18199.649548243142},{"$f":"INDEX($A$137:$N$157,'Form Control Selectors'!$B$34,W$11)","v":14881.256683102321},{"$f":"INDEX($A$137:$N$157,'Form Control Selectors'!$B$34,X$11)","v":9732.3473648422696},{"$f":"INDEX($A$137:$N$157,'Form Control Selectors'!$B$34,Y$11)","v":15571.755783747631},{"$f":"INDEX($A$137:$N$157,'Form Control Selectors'!$B$34,Z$11)","v":181745.53942983842},{"$f":"INDEX($A$137:$N$157,'Form Control Selectors'!$B$34,AA$11)","v":1055937.8792601577},{"$f":"INDEX($A$137:$N$157,'Form Control Selectors'!$B$34,AB$11)","v":2041588.6556530478},{"$f":"INDEX($A$137:$N$157,'Form Control Selectors'!$B$34,AC$11)","v":2104094.2216950441},{"$f":"INDEX($A$137:$N$157,'Form Control Selectors'!$B$34,AD$11)","v":9456055}]
[{"$f":"'Fort Langley - Analysis'!A99","v":"GW inflow from surrounding aquitards (m3)"},{"$f":"'Fort Langley - Analysis'!B99","v":400210},{"$f":"'Fort Langley - Analysis'!C99","v":361480},{"$f":"'Fort Langley - Analysis'!D99","v":400210},{"$f":"'Fort Langley - Analysis'!E99","v":387300},{"$f":"'Fort Langley - Analysis'!F99","v":400210},{"$f":"'Fort Langley - Analysis'!G99","v":387300},{"$f":"'Fort Langley - Analysis'!H99","v":400210},{"$f":"'Fort Langley - Analysis'!I99","v":400210},{"$f":"'Fort Langley - Analysis'!J99","v":387300},{"$f":"'Fort Langley - Analysis'!K99","v":400210},{"$f":"'Fort Langley - Analysis'!L99","v":387300},{"$f":"'Fort Langley - Analysis'!M99","v":400210},{"$f":"'Fort Langley - Analysis'!N99","v":4712150},null,null,{"$f":"INDEX($A$168:$N$188,'Form Control Selectors'!$B$34,Q$11)","v":"SW inflow from Salmon River system (m3)"},{"$f":"INDEX($A$168:$N$188,'Form Control Selectors'!$B$34,R$11)","v":27807},{"$f":"INDEX($A$168:$N$188,'Form Control Selectors'!$B$34,S$11)","v":25116},{"$f":"INDEX($A$168:$N$188,'Form Control Selectors'!$B$34,T$11)","v":27807},{"$f":"INDEX($A$168:$N$188,'Form Control Selectors'!$B$34,U$11)","v":26910},{"$f":"INDEX($A$168:$N$188,'Form Control Selectors'!$B$34,V$11)","v":27807},{"$f":"INDEX($A$168:$N$188,'Form Control Selectors'!$B$34,W$11)","v":26910},{"$f":"INDEX($A$168:$N$188,'Form Control Selectors'!$B$34,X$11)","v":27807},{"$f":"INDEX($A$168:$N$188,'Form Control Selectors'!$B$34,Y$11)","v":27807},{"$f":"INDEX($A$168:$N$188,'Form Control Selectors'!$B$34,Z$11)","v":26910},{"$f":"INDEX($A$168:$N$188,'Form Control Selectors'!$B$34,AA$11)","v":27807},{"$f":"INDEX($A$168:$N$188,'Form Control Selectors'!$B$34,AB$11)","v":26910},{"$f":"INDEX($A$168:$N$188,'Form Control Selectors'!$B$34,AC$11)","v":27807},{"$f":"INDEX($A$168:$N$188,'Form Control Selectors'!$B$34,AD$11)","v":327405}]
[{"$f":"'Beaver River - Analysis'!A47","v":"SW inflow from Nathan Creek (m3)"},{"$f":"'Beaver River - Analysis'!B47","v":40380.6},{"$f":"'Beaver River - Analysis'!C47","v":36472.799999999996},{"$f":"'Beaver River - Analysis'!D47","v":40380.6},{"$f":"'Beaver River - Analysis'!E47","v":39078},{"$f":"'Beaver River - Analysis'!F47","v":40380.6},{"$f":"'Beaver River - Analysis'!G47","v":39078},{"$f":"'Beaver River - Analysis'!H47","v":40380.6},{"$f":"'Beaver River - Analysis'!I47","v":40380.6},{"$f":"'Beaver River - Analysis'!J47","v":39078},{"$f":"'Beaver River - Analysis'!K47","v":40380.6},{"$f":"'Beaver River - Analysis'!L47","v":39078},{"$f":"'Beaver River - Analysis'!M47","v":40380.6},{"$f":"'Beaver River - Analysis'!N47","v":475448.99999999994}]
[{"$f":"'Beaver River - Analysis'!A73","v":"SW inflow from Nathan Creek (m3)"},{"$f":"'Beaver River - Analysis'!B73","v":40380.6},{"$f":"'Beaver River - Analysis'!C73","v":36472.799999999996},{"$f":"'Beaver River - Analysis'!D73","v":40380.6},{"$f":"'Beaver River - Analysis'!E73","v":39078},{"$f":"'Beaver River - Analysis'!F73","v":40380.6},{"$f":"'Beaver River - Analysis'!G73","v":39078},{"$f":"'Beaver River - Analysis'!H73","v":40380.6},{"$f":"'Beaver River - Analysis'!I73","v":40380.6},{"$f":"'Beaver River - Analysis'!J73","v":39078},{"$f":"'Beaver River - Analysis'!K73","v":40380.6},{"$f":"'Beaver River - Analysis'!L73","v":39078},{"$f":"'Beaver River - Analysis'!M73","v":40380.6},{"$f":"'Beaver River - Analysis'!N73","v":475448.99999999994}]
[{"$f":"'Beaver River - Analysis'!A99","v":"SW inflow from Nathan Creek (m3)"},{"$f":"'Beaver River - Analysis'!B99","v":40380.6},{"$f":"'Beaver River - Analysis'!C99","v":36472.799999999996},{"$f":"'Beaver River - Analysis'!D99","v":40380.6},{"$f":"'Beaver River - Analysis'!E99","v":39078},{"$f":"'Beaver River - Analysis'!F99","v":40380.6},{"$f":"'Beaver River - Analysis'!G99","v":39078},{"$f":"'Beaver River - Analysis'!H99","v":40380.6},{"$f":"'Beaver River - Analysis'!I99","v":40380.6},{"$f":"'Beaver River - Analysis'!J99","v":39078},{"$f":"'Beaver River - Analysis'!K99","v":40380.6},{"$f":"'Beaver River - Analysis'!L99","v":39078},{"$f":"'Beaver River - Analysis'!M99","v":40380.6},{"$f":"'Beaver River - Analysis'!N99","v":475448.99999999994}]
[{"$f":"'West of Aldergrove - Analysis'!A47","v":"GW inflow from surrounding aquitards (m3)"},{"$f":"'West of Aldergrove - Analysis'!B47","v":2411707},{"$f":"'West of Aldergrove - Analysis'!C47","v":2178316},{"$f":"'West of Aldergrove - Analysis'!D47","v":2411707},{"$f":"'West of Aldergrove - Analysis'!E47","v":2333910},{"$f":"'West of Aldergrove - Analysis'!F47","v":2411707},{"$f":"'West of Aldergrove - Analysis'!G47","v":2333910},{"$f":"'West of Aldergrove - Analysis'!H47","v":2411707},{"$f":"'West of Aldergrove - Analysis'!I47","v":2411707},{"$f":"'West of Aldergrove - Analysis'!J47","v":2333910},{"$f":"'West of Aldergrove - Analysis'!K47","v":2411707},{"$f":"'West of Aldergrove - Analysis'!L47","v":2333910},{"$f":"'West of Aldergrove - Analysis'!M47","v":2411707},{"$f":"'West of Aldergrove - Analysis'!N47","v":28395905}]
[{"$f":"'West of Aldergrove - Analysis'!A78","v":"GW inflow from surrounding aquitards (m3)"},{"$f":"'West of Aldergrove - Analysis'!B78","v":2411707},{"$f":"'West of Aldergrove - Analysis'!C78","v":2178316},{"$f":"'West of Aldergrove - Analysis'!D78","v":2411707},{"$f":"'West of Aldergrove - Analysis'!E78","v":2333910},{"$f":"'West of Aldergrove - Analysis'!F78","v":2411707},{"$f":"'West of Aldergrove - Analysis'!G78","v":2333910},{"$f":"'West of Aldergrove - Analysis'!H78","v":2411707},{"$f":"'West of Aldergrove - Analysis'!I78","v":2411707},{"$f":"'West of Aldergrove - Analysis'!J78","v":2333910},{"$f":"'West of Aldergrove - Analysis'!K78","v":2411707},{"$f":"'West of Aldergrove - Analysis'!L78","v":2333910},{"$f":"'West of Aldergrove - Analysis'!M78","v":2411707},{"$f":"'West of Aldergrove - Analysis'!N78","v":28395905}]
[{"$f":"'West of Aldergrove - Analysis'!A109","v":"GW inflow from surrounding aquitards (m3)"},{"$f":"'West of Aldergrove - Analysis'!B109","v":2411707},{"$f":"'West of Aldergrove - Analysis'!C109","v":2178316},{"$f":"'West of Aldergrove - Analysis'!D109","v":2411707},{"$f":"'West of Aldergrove - Analysis'!E109","v":2333910},{"$f":"'West of Aldergrove - Analysis'!F109","v":2411707},{"$f":"'West of Aldergrove - Analysis'!G109","v":2333910},{"$f":"'West of Aldergrove - Analysis'!H109","v":2411707},{"$f":"'West of Aldergrove - Analysis'!I109","v":2411707},{"$f":"'West of Aldergrove - Analysis'!J109","v":2333910},{"$f":"'West of Aldergrove - Analysis'!K109","v":2411707},{"$f":"'West of Aldergrove - Analysis'!L109","v":2333910},{"$f":"'West of Aldergrove - Analysis'!M109","v":2411707},{"$f":"'West of Aldergrove - Analysis'!N109","v":28395905}]
[{"$f":"'S of Murrayville AC - Analysis'!A47","v":"GW inflow from surrounding aquitards (m3)"},{"$f":"'S of Murrayville AC - Analysis'!B47","v":1719074},{"$f":"'S of Murrayville AC - Analysis'!C47","v":1552712},{"$f":"'S of Murrayville AC - Analysis'!D47","v":1719074},{"$f":"'S of Murrayville AC - Analysis'!E47","v":1663620},{"$f":"'S of Murrayville AC - Analysis'!F47","v":1719074},{"$f":"'S of Murrayville AC - Analysis'!G47","v":1663620},{"$f":"'S of Murrayville AC - Analysis'!H47","v":1719074},{"$f":"'S of Murrayville AC - Analysis'!I47","v":1719074},{"$f":"'S of Murrayville AC - Analysis'!J47","v":1663620},{"$f":"'S of Murrayville AC - Analysis'!K47","v":1719074},{"$f":"'S of Murrayville AC - Analysis'!L47","v":1663620},{"$f":"'S of Murrayville AC - Analysis'!M47","v":1719074},{"$f":"'S of Murrayville AC - Analysis'!N47","v":20240710}]
[{"$f":"'S of Murrayville AC - Analysis'!A73","v":"GW inflow from surrounding aquitards (m3)"},{"$f":"'S of Murrayville AC - Analysis'!B73","v":1719074},{"$f":"'S of Murrayville AC - Analysis'!C73","v":1552712},{"$f":"'S of Murrayville AC - Analysis'!D73","v":1719074},{"$f":"'S of Murrayville AC - Analysis'!E73","v":1663620},{"$f":"'S of Murrayville AC - Analysis'!F73","v":1719074},{"$f":"'S of Murrayville AC - Analysis'!G73","v":1663620},{"$f":"'S of Murrayville AC - Analysis'!H73","v":1719074},{"$f":"'S of Murrayville AC - Analysis'!I73","v":1719074},{"$f":"'S of Murrayville AC - Analysis'!J73","v":1663620},{"$f":"'S of Murrayville AC - Analysis'!K73","v":1719074},{"$f":"'S of Murrayville AC - Analysis'!L73","v":1663620},{"$f":"'S of Murrayville AC - Analysis'!M73","v":1719074},{"$f":"'S of Murrayville AC - Analysis'!N73","v":20240710}]
[{"$f":"'S of Murrayville AC - Analysis'!A99","v":"GW inflow from surrounding aquitards (m3)"},{"$f":"'S of Murrayville AC - Analysis'!B99","v":1719074},{"$f":"'S of Murrayville AC - Analysis'!C99","v":1552712},{"$f":"'S of Murrayville AC - Analysis'!D99","v":1719074},{"$f":"'S of Murrayville AC - Analysis'!E99","v":1663620},{"$f":"'S of Murrayville AC - Analysis'!F99","v":1719074},{"$f":"'S of Murrayville AC - Analysis'!G99","v":1663620},{"$f":"'S of Murrayville AC - Analysis'!H99","v":1719074},{"$f":"'S of Murrayville AC - Analysis'!I99","v":1719074},{"$f":"'S of Murrayville AC - Analysis'!J99","v":1663620},{"$f":"'S of Murrayville AC - Analysis'!K99","v":1719074},{"$f":"'S of Murrayville AC - Analysis'!L99","v":1663620},{"$f":"'S of Murrayville AC - Analysis'!M99","v":1719074},{"$f":"'S of Murrayville AC - Analysis'!N99","v":20240710}]
[{"$f":"'Salmon River - Analysis'!A47","v":"GW inflow from surrounding aquitards (m3)"},{"$f":"'Salmon River - Analysis'!B47","v":1123967},{"$f":"'Salmon River - Analysis'!C47","v":1015196},{"$f":"'Salmon River - Analysis'!D47","v":1123967},{"$f":"'Salmon River - Analysis'!E47","v":1087710},{"$f":"'Salmon River - Analysis'!F47","v":1123967},{"$f":"'Salmon River - Analysis'!G47","v":1087710},{"$f":"'Salmon River - Analysis'!H47","v":1123967},{"$f":"'Salmon River - Analysis'!I47","v":1123967},{"$f":"'Salmon River - Analysis'!J47","v":1087710},{"$f":"'Salmon River - Analysis'!K47","v":1123967},{"$f":"'Salmon River - Analysis'!L47","v":1087710},{"$f":"'Salmon River - Analysis'!M47","v":1123967},{"$f":"'Salmon River - Analysis'!N47","v":13233805}]
[{"$f":"'Salmon River - Analysis'!A73","v":"GW inflow from surrounding aquitards (m3)"},{"$f":"'Salmon River - Analysis'!B73","v":1123967},{"$f":"'Salmon River - Analysis'!C73","v":1015196},{"$f":"'Salmon River - Analysis'!D73","v":1123967},{"$f":"'Salmon River - Analysis'!E73","v":1087710},{"$f":"'Salmon River - Analysis'!F73","v":1123967},{"$f":"'Salmon River - Analysis'!G73","v":1087710},{"$f":"'Salmon River - Analysis'!H73","v":1123967},{"$f":"'Salmon River - Analysis'!I73","v":1123967},{"$f":"'Salmon River - Analysis'!J73","v":1087710},{"$f":"'Salmon River - Analysis'!K73","v":1123967},{"$f":"'Salmon River - Analysis'!L73","v":1087710},{"$f":"'Salmon River - Analysis'!M73","v":1123967},{"$f":"'Salmon River - Analysis'!N73","v":13233805}]
[{"$f":"'Salmon River - Analysis'!A99","v":"GW inflow from surrounding aquitards (m3)"},{"$f":"'Salmon River - Analysis'!B99","v":1123967},{"$f":"'Salmon River - Analysis'!C99","v":1015196},{"$f":"'Salmon River - Analysis'!D99","v":1123967},{"$f":"'Salmon River - Analysis'!E99","v":1087710},{"$f":"'Salmon River - Analysis'!F99","v":1123967},{"$f":"'Salmon River - Analysis'!G99","v":1087710},{"$f":"'Salmon River - Analysis'!H99","v":1123967},{"$f":"'Salmon River - Analysis'!I99","v":1123967},{"$f":"'Salmon River - Analysis'!J99","v":1087710},{"$f":"'Salmon River - Analysis'!K99","v":1123967},{"$f":"'Salmon River - Analysis'!L99","v":1087710},{"$f":"'Salmon River - Analysis'!M99","v":1123967},{"$f":"'Salmon River - Analysis'!N99","v":13233805}]
[{"$f":"'Nicomekl Serpentine - Analysis'!A47","v":"GW inflow from surrounding aquitards (m3)"},{"$f":"'Nicomekl Serpentine - Analysis'!B47","v":3045874},{"$f":"'Nicomekl Serpentine - Analysis'!C47","v":2751112},{"$f":"'Nicomekl Serpentine - Analysis'!D47","v":3045874},{"$f":"'Nicomekl Serpentine - Analysis'!E47","v":2947620},{"$f":"'Nicomekl Serpentine - Analysis'!F47","v":3045874},{"$f":"'Nicomekl Serpentine - Analysis'!G47","v":2947620},{"$f":"'Nicomekl Serpentine - Analysis'!H47","v":3045874},{"$f":"'Nicomekl Serpentine - Analysis'!I47","v":3045874},{"$f":"'Nicomekl Serpentine - Analysis'!J47","v":2947620},{"$f":"'Nicomekl Serpentine - Analysis'!K47","v":3045874},{"$f":"'Nicomekl Serpentine - Analysis'!L47","v":2947620},{"$f":"'Nicomekl Serpentine - Analysis'!M47","v":3045874},{"$f":"'Nicomekl Serpentine - Analysis'!N47","v":35862710}]
[{"$f":"'Nicomekl Serpentine - Analysis'!A73","v":"GW inflow from surrounding aquitards (m3)"},{"$f":"'Nicomekl Serpentine - Analysis'!B73","v":3045874},{"$f":"'Nicomekl Serpentine - Analysis'!C73","v":2751112},{"$f":"'Nicomekl Serpentine - Analysis'!D73","v":3045874},{"$f":"'Nicomekl Serpentine - Analysis'!E73","v":2947620},{"$f":"'Nicomekl Serpentine - Analysis'!F73","v":3045874},{"$f":"'Nicomekl Serpentine - Analysis'!G73","v":2947620},{"$f":"'Nicomekl Serpentine - Analysis'!H73","v":3045874},{"$f":"'Nicomekl Serpentine - Analysis'!I73","v":3045874},{"$f":"'Nicomekl Serpentine - Analysis'!J73","v":2947620},{"$f":"'Nicomekl Serpentine - Analysis'!K73","v":3045874},{"$f":"'Nicomekl Serpentine - Analysis'!L73","v":2947620},{"$f":"'Nicomekl Serpentine - Analysis'!M73","v":3045874},{"$f":"'Nicomekl Serpentine - Analysis'!N73","v":35862710}]
[{"$f":"'Nicomekl Serpentine - Analysis'!A99","v":"GW inflow from surrounding aquitards (m3)"},{"$f":"'Nicomekl Serpentine - Analysis'!B99","v":3045874},{"$f":"'Nicomekl Serpentine - Analysis'!C99","v":2751112},{"$f":"'Nicomekl Serpentine - Analysis'!D99","v":3045874},{"$f":"'Nicomekl Serpentine - Analysis'!E99","v":2947620},{"$f":"'Nicomekl Serpentine - Analysis'!F99","v":3045874},{"$f":"'Nicomekl Serpentine - Analysis'!G99","v":2947620},{"$f":"'Nicomekl Serpentine - Analysis'!H99","v":3045874},{"$f":"'Nicomekl Serpentine - Analysis'!I99","v":3045874},{"$f":"'Nicomekl Serpentine - Analysis'!J99","v":2947620},{"$f":"'Nicomekl Serpentine - Analysis'!K99","v":3045874},{"$f":"'Nicomekl Serpentine - Analysis'!L99","v":2947620},{"$f":"'Nicomekl Serpentine - Analysis'!M99","v":3045874},{"$f":"'Nicomekl Serpentine - Analysis'!N99","v":35862710}]
[]
[]
[]
[]
[]
[]
[]
[]
[]
["ROW 2 INFLOW"]
[{"$f":"'Hopington AB - Analysis'!A48","v":"GW inflow from Aldergrove CD (m3)"},{"$f":"'Hopington AB - Analysis'!B48","v":60357},{"$f":"'Hopington AB - Analysis'!C48","v":54516},{"$f":"'Hopington AB - Analysis'!D48","v":60357},{"$f":"'Hopington AB - Analysis'!E48","v":58410},{"$f":"'Hopington AB - Analysis'!F48","v":60357},{"$f":"'Hopington AB - Analysis'!G48","v":58410},{"$f":"'Hopington AB - Analysis'!H48","v":60357},{"$f":"'Hopington AB - Analysis'!I48","v":60357},{"$f":"'Hopington AB - Analysis'!J48","v":58410},{"$f":"'Hopington AB - Analysis'!K48","v":60357},{"$f":"'Hopington AB - Analysis'!L48","v":58410},{"$f":"'Hopington AB - Analysis'!M48","v":60357},{"$f":"'Hopington AB - Analysis'!N48","v":710655}]
[{"$f":"'Hopington AB - Analysis'!A74","v":"GW inflow from Aldergrove CD (m3)"},{"$f":"'Hopington AB - Analysis'!B74","v":60357},{"$f":"'Hopington AB - Analysis'!C74","v":54516},{"$f":"'Hopington AB - Analysis'!D74","v":60357},{"$f":"'Hopington AB - Analysis'!E74","v":58410},{"$f":"'Hopington AB - Analysis'!F74","v":60357},{"$f":"'Hopington AB - Analysis'!G74","v":58410},{"$f":"'Hopington AB - Analysis'!H74","v":60357},{"$f":"'Hopington AB - Analysis'!I74","v":60357},{"$f":"'Hopington AB - Analysis'!J74","v":58410},{"$f":"'Hopington AB - Analysis'!K74","v":60357},{"$f":"'Hopington AB - Analysis'!L74","v":58410},{"$f":"'Hopington AB - Analysis'!M74","v":60357},{"$f":"'Hopington AB - Analysis'!N74","v":710655}]
[{"$f":"'Hopington AB - Analysis'!A100","v":"GW inflow from Aldergrove CD (m3)"},{"$f":"'Hopington AB - Analysis'!B100","v":60357},{"$f":"'Hopington AB - Analysis'!C100","v":54516},{"$f":"'Hopington AB - Analysis'!D100","v":60357},{"$f":"'Hopington AB - Analysis'!E100","v":58410},{"$f":"'Hopington AB - Analysis'!F100","v":60357},{"$f":"'Hopington AB - Analysis'!G100","v":58410},{"$f":"'Hopington AB - Analysis'!H100","v":60357},{"$f":"'Hopington AB - Analysis'!I100","v":60357},{"$f":"'Hopington AB - Analysis'!J100","v":58410},{"$f":"'Hopington AB - Analysis'!K100","v":60357},{"$f":"'Hopington AB - Analysis'!L100","v":58410},{"$f":"'Hopington AB - Analysis'!M100","v":60357},{"$f":"'Hopington AB - Analysis'!N100","v":710655}]
[{"$f":"'Fort Langley - Analysis'!A48","v":"Recharge (m3)"},{"$f":"'Fort Langley - Analysis'!B48","v":447304.69811427186},{"$f":"'Fort Langley - Analysis'!C48","v":270473.44518026133},{"$f":"'Fort Langley - Analysis'!D48","v":181944.82210064237},{"$f":"'Fort Langley - Analysis'!E48","v":23177.958497969645},{"$f":"'Fort Langley - Analysis'!F48","v":4184.1561228351793},{"$f":"'Fort Langley - Analysis'!G48","v":3421.2472663845965},{"$f":"'Fort Langley - Analysis'!H48","v":2237.4969753247015},{"$f":"'Fort Langley - Analysis'!I48","v":3579.9951605195224},{"$f":"'Fort Langley - Analysis'!J48","v":41783.865650135507},{"$f":"'Fort Langley - Analysis'!K48","v":242763.40767597273},{"$f":"'Fort Langley - Analysis'!L48","v":469367.59145926265},{"$f":"'Fort Langley - Analysis'!M48","v":483737.81579642004},{"$f":"'Fort Langley - Analysis'!N48","v":2173976.5000000005}]
[{"$f":"'Fort Langley - Analysis'!A74","v":"Recharge (m3)"},{"$f":"'Fort Langley - Analysis'!B74","v":247210.68155787676},{"$f":"'Fort Langley - Analysis'!C74","v":151321.86924078327},{"$f":"'Fort Langley - Analysis'!D74","v":82919.510332822334},{"$f":"'Fort Langley - Analysis'!E74","v":0},{"$f":"'Fort Langley - Analysis'!F74","v":0},{"$f":"'Fort Langley - Analysis'!G74","v":0},{"$f":"'Fort Langley - Analysis'!H74","v":0},{"$f":"'Fort Langley - Analysis'!I74","v":0},{"$f":"'Fort Langley - Analysis'!J74","v":0},{"$f":"'Fort Langley - Analysis'!K74","v":0},{"$f":"'Fort Langley - Analysis'!L74","v":0},{"$f":"'Fort Langley - Analysis'!M74","v":485432.93886851752},{"$f":"'Fort Langley - Analysis'!N74","v":966884.99999999988}]
[{"$f":"'Fort Langley - Analysis'!A100","v":"Recharge (m3)"},{"$f":"'Fort Langley - Analysis'!B100","v":899612.12529025704},{"$f":"'Fort Langley - Analysis'!C100","v":338285.64806765335},{"$f":"'Fort Langley - Analysis'!D100","v":343527.67674423772},{"$f":"'Fort Langley - Analysis'!E100","v":0},{"$f":"'Fort Langley - Analysis'!F100","v":0},{"$f":"'Fort Langley - Analysis'!G100","v":0},{"$f":"'Fort Langley - Analysis'!H100","v":0},{"$f":"'Fort Langley - Analysis'!I100","v":0},{"$f":"'Fort Langley - Analysis'!J100","v":77410.626475162848},{"$f":"'Fort Langley - Analysis'!K100","v":416962.24700560799},{"$f":"'Fort Langley - Analysis'!L100","v":778549.12187184894},{"$f":"'Fort Langley - Analysis'!M100","v":775212.55454523163},{"$f":"'Fort Langley - Analysis'!N100","v":3629559.9999999995}]
[{"$f":"'Beaver River - Analysis'!A48","v":"GW inflow from surrounding aquitards (m3)"},{"$f":"'Beaver River - Analysis'!B48","v":1808261},{"$f":"'Beaver River - Analysis'!C48","v":1633268},{"$f":"'Beaver River - Analysis'!D48","v":1808261},{"$f":"'Beaver River - Analysis'!E48","v":1749930},{"$f":"'Beaver River - Analysis'!F48","v":1808261},{"$f":"'Beaver River - Analysis'!G48","v":1749930},{"$f":"'Beaver River - Analysis'!H48","v":1808261},{"$f":"'Beaver River - Analysis'!I48","v":1808261},{"$f":"'Beaver River - Analysis'!J48","v":1749930},{"$f":"'Beaver River - Analysis'!K48","v":1808261},{"$f":"'Beaver River - Analysis'!L48","v":1749930},{"$f":"'Beaver River - Analysis'!M48","v":1808261},{"$f":"'Beaver River - Analysis'!N48","v":21290815}]
[{"$f":"'Beaver River - Analysis'!A74","v":"GW inflow from surrounding aquitards (m3)"},{"$f":"'Beaver River - Analysis'!B74","v":1808261},{"$f":"'Beaver River - Analysis'!C74","v":1633268},{"$f":"'Beaver River - Analysis'!D74","v":1808261},{"$f":"'Beaver River - Analysis'!E74","v":1749930},{"$f":"'Beaver River - Analysis'!F74","v":1808261},{"$f":"'Beaver River - Analysis'!G74","v":1749930},{"$f":"'Beaver River - Analysis'!H74","v":1808261},{"$f":"'Beaver River - Analysis'!I74","v":1808261},{"$f":"'Beaver River - Analysis'!J74","v":1749930},{"$f":"'Beaver River - Analysis'!K74","v":1808261},{"$f":"'Beaver River - Analysis'!L74","v":1749930},{"$f":"'Beaver River - Analysis'!M74","v":1808261},{"$f":"'Beaver River - Analysis'!N74","v":21290815}]
[{"$f":"'Beaver River - Analysis'!A100","v":"GW inflow from surrounding aquitards (m3)"},{"$f":"'Beaver River - Analysis'!B100","v":1808261},{"$f":"'Beaver River - Analysis'!C100","v":1633268},{"$f":"'Beaver River - Analysis'!D100","v":1808261},{"$f":"'Beaver River - Analysis'!E100","v":1749930},{"$f":"'Beaver River - Analysis'!F100","v":1808261},{"$f":"'Beaver River - Analysis'!G100","v":1749930},{"$f":"'Beaver River - Analysis'!H100","v":1808261},{"$f":"'Beaver River - Analysis'!I100","v":1808261},{"$f":"'Beaver River - Analysis'!J100","v":1749930},{"$f":"'Beaver River - Analysis'!K100","v":1808261},{"$f":"'Beaver River - Analysis'!L100","v":1749930},{"$f":"'Beaver River - Analysis'!M100","v":1808261},{"$f":"'Beaver River - Analysis'!N100","v":21290815}]
[{"$f":"'West of Aldergrove - Analysis'!A48","v":"GW inflow from Abbotsford (m3)"},{"$f":"'West of Aldergrove - Analysis'!B48","v":21359},{"$f":"'West of Aldergrove - Analysis'!C48","v":19292},{"$f":"'West of Aldergrove - Analysis'!D48","v":21359},{"$f":"'West of Aldergrove - Analysis'!E48","v":20670},{"$f":"'West of Aldergrove - Analysis'!F48","v":21359},{"$f":"'West of Aldergrove - Analysis'!G48","v":20670},{"$f":"'West of Aldergrove - Analysis'!H48","v":21359},{"$f":"'West of Aldergrove - Analysis'!I48","v":21359},{"$f":"'West of Aldergrove - Analysis'!J48","v":20670},{"$f":"'West of Aldergrove - Analysis'!K48","v":21359},{"$f":"'West of Aldergrove - Analysis'!L48","v":20670},{"$f":"'West of Aldergrove - Analysis'!M48","v":21359},{"$f":"'West of Aldergrove - Analysis'!N48","v":251485}]
[{"$f":"'West of Aldergrove - Analysis'!A79","v":"GW inflow from Abbotsford (m3)"},{"$f":"'West of Aldergrove - Analysis'!B79","v":21359},{"$f":"'West of Aldergrove - Analysis'!C79","v":19292},{"$f":"'West of Aldergrove - Analysis'!D79","v":21359},{"$f":"'West of Aldergrove - Analysis'!E79","v":20670},{"$f":"'West of Aldergrove - Analysis'!F79","v":21359},{"$f":"'West of Aldergrove - Analysis'!G79","v":20670},{"$f":"'West of Aldergrove - Analysis'!H79","v":21359},{"$f":"'West of Aldergrove - Analysis'!I79","v":21359},{"$f":"'West of Aldergrove - Analysis'!J79","v":20670},{"$f":"'West of Aldergrove - Analysis'!K79","v":21359},{"$f":"'West of Aldergrove - Analysis'!L79","v":20670},{"$f":"'West of Aldergrove - Analysis'!M79","v":21359},{"$f":"'West of Aldergrove - Analysis'!N79","v":251485}]
[{"$f":"'West of Aldergrove - Analysis'!A110","v":"GW inflow from Abbotsford (m3)"},{"$f":"'West of Aldergrove - Analysis'!B110","v":21359},{"$f":"'West of Aldergrove - Analysis'!C110","v":19292},{"$f":"'West of Aldergrove - Analysis'!D110","v":21359},{"$f":"'West of Aldergrove - Analysis'!E110","v":20670},{"$f":"'West of Aldergrove - Analysis'!F110","v":21359},{"$f":"'West of Aldergrove - Analysis'!G110","v":20670},{"$f":"'West of Aldergrove - Analysis'!H110","v":21359},{"$f":"'West of Aldergrove - Analysis'!I110","v":21359},{"$f":"'West of Aldergrove - Analysis'!J110","v":20670},{"$f":"'West of Aldergrove - Analysis'!K110","v":21359},{"$f":"'West of Aldergrove - Analysis'!L110","v":20670},{"$f":"'West of Aldergrove - Analysis'!M110","v":21359},{"$f":"'West of Aldergrove - Analysis'!N110","v":251485}]
[{"$f":"'S of Murrayville AC - Analysis'!A48","v":"GW inflow from South of Murrayville B aquifer (m3)"},{"$f":"'S of Murrayville AC - Analysis'!B48","v":2092.5},{"$f":"'S of Murrayville AC - Analysis'!C48","v":1890},{"$f":"'S of Murrayville AC - Analysis'!D48","v":2092.5},{"$f":"'S of Murrayville AC - Analysis'!E48","v":2025},{"$f":"'S of Murrayville AC - Analysis'!F48","v":2092.5},{"$f":"'S of Murrayville AC - Analysis'!G48","v":2025},{"$f":"'S of Murrayville AC - Analysis'!H48","v":2092.5},{"$f":"'S of Murrayville AC - Analysis'!I48","v":2092.5},{"$f":"'S of Murrayville AC - Analysis'!J48","v":2025},{"$f":"'S of Murrayville AC - Analysis'!K48","v":2092.5},{"$f":"'S of Murrayville AC - Analysis'!L48","v":2025},{"$f":"'S of Murrayville AC - Analysis'!M48","v":2092.5},{"$f":"'S of Murrayville AC - Analysis'!N48","v":24637.5}]
[{"$f":"'S of Murrayville AC - Analysis'!A74","v":"GW inflow from South of Murrayville B aquifer (m3)"},{"$f":"'S of Murrayville AC - Analysis'!B74","v":2092.5},{"$f":"'S of Murrayville AC - Analysis'!C74","v":1890},{"$f":"'S of Murrayville AC - Analysis'!D74","v":2092.5},{"$f":"'S of Murrayville AC - Analysis'!E74","v":2025},{"$f":"'S of Murrayville AC - Analysis'!F74","v":2092.5},{"$f":"'S of Murrayville AC - Analysis'!G74","v":2025},{"$f":"'S of Murrayville AC - Analysis'!H74","v":2092.5},{"$f":"'S of Murrayville AC - Analysis'!I74","v":2092.5},{"$f":"'S of Murrayville AC - Analysis'!J74","v":2025},{"$f":"'S of Murrayville AC - Analysis'!K74","v":2092.5},{"$f":"'S of Murrayville AC - Analysis'!L74","v":2025},{"$f":"'S of Murrayville AC - Analysis'!M74","v":2092.5},{"$f":"'S of Murrayville AC - Analysis'!N74","v":24637.5}]
[{"$f":"'S of Murrayville AC - Analysis'!A100","v":"GW inflow from South of Murrayville B aquifer (m3)"},{"$f":"'S of Murrayville AC - Analysis'!B100","v":2092.5},{"$f":"'S of Murrayville AC - Analysis'!C100","v":1890},{"$f":"'S of Murrayville AC - Analysis'!D100","v":2092.5},{"$f":"'S of Murrayville AC - Analysis'!E100","v":2025},{"$f":"'S of Murrayville AC - Analysis'!F100","v":2092.5},{"$f":"'S of Murrayville AC - Analysis'!G100","v":2025},{"$f":"'S of Murrayville AC - Analysis'!H100","v":2092.5},{"$f":"'S of Murrayville AC - Analysis'!I100","v":2092.5},{"$f":"'S of Murrayville AC - Analysis'!J100","v":2025},{"$f":"'S of Murrayville AC - Analysis'!K100","v":2092.5},{"$f":"'S of Murrayville AC - Analysis'!L100","v":2025},{"$f":"'S of Murrayville AC - Analysis'!M100","v":2092.5},{"$f":"'S of Murrayville AC - Analysis'!N100","v":24637.5}]
["","","","","","","","","","","","","",""]
["","","","","","","","","","","","","",""]
["","","","","","","","","","","","","",""]
[{"$f":"'Nicomekl Serpentine - Analysis'!A48","v":"GW inflow from boundary (m3)"},{"$f":"'Nicomekl Serpentine - Analysis'!B48","v":381393},{"$f":"'Nicomekl Serpentine - Analysis'!C48","v":344484},{"$f":"'Nicomekl Serpentine - Analysis'!D48","v":381393},{"$f":"'Nicomekl Serpentine - Analysis'!E48","v":369090},{"$f":"'Nicomekl Serpentine - Analysis'!F48","v":381393},{"$f":"'Nicomekl Serpentine - Analysis'!G48","v":369090},{"$f":"'Nicomekl Serpentine - Analysis'!H48","v":381393},{"$f":"'Nicomekl Serpentine - Analysis'!I48","v":381393},{"$f":"'Nicomekl Serpentine - Analysis'!J48","v":369090},{"$f":"'Nicomekl Serpentine - Analysis'!K48","v":381393},{"$f":"'Nicomekl Serpentine - Analysis'!L48","v":369090},{"$f":"'Nicomekl Serpentine - Analysis'!M48","v":381393},{"$f":"'Nicomekl Serpentine - Analysis'!N48","v":4490595}]
[{"$f":"'Nicomekl Serpentine - Analysis'!A74","v":"GW inflow from boundary (m3)"},{"$f":"'Nicomekl Serpentine - Analysis'!B74","v":381393},{"$f":"'Nicomekl Serpentine - Analysis'!C74","v":344484},{"$f":"'Nicomekl Serpentine - Analysis'!D74","v":381393},{"$f":"'Nicomekl Serpentine - Analysis'!E74","v":369090},{"$f":"'Nicomekl Serpentine - Analysis'!F74","v":381393},{"$f":"'Nicomekl Serpentine - Analysis'!G74","v":369090},{"$f":"'Nicomekl Serpentine - Analysis'!H74","v":381393},{"$f":"'Nicomekl Serpentine - Analysis'!I74","v":381393},{"$f":"'Nicomekl Serpentine - Analysis'!J74","v":369090},{"$f":"'Nicomekl Serpentine - Analysis'!K74","v":381393},{"$f":"'Nicomekl Serpentine - Analysis'!L74","v":369090},{"$f":"'Nicomekl Serpentine - Analysis'!M74","v":381393},{"$f":"'Nicomekl Serpentine - Analysis'!N74","v":4490595}]
[{"$f":"'Nicomekl Serpentine - Analysis'!A100","v":"GW inflow from boundary (m3)"},{"$f":"'Nicomekl Serpentine - Analysis'!B100","v":381393},{"$f":"'Nicomekl Serpentine - Analysis'!C100","v":344484},{"$f":"'Nicomekl Serpentine - Analysis'!D100","v":381393},{"$f":"'Nicomekl Serpentine - Analysis'!E100","v":369090},{"$f":"'Nicomekl Serpentine - Analysis'!F100","v":381393},{"$f":"'Nicomekl Serpentine - Analysis'!G100","v":369090},{"$f":"'Nicomekl Serpentine - Analysis'!H100","v":381393},{"$f":"'Nicomekl Serpentine - Analysis'!I100","v":381393},{"$f":"'Nicomekl Serpentine - Analysis'!J100","v":369090},{"$f":"'Nicomekl Serpentine - Analysis'!K100","v":381393},{"$f":"'Nicomekl Serpentine - Analysis'!L100","v":369090},{"$f":"'Nicomekl Serpentine - Analysis'!M100","v":381393},{"$f":"'Nicomekl Serpentine - Analysis'!N100","v":4490595}]
[]
[]
[]
[]
[]
[]
[]
[]
[]
["ROW 3 INFLOW"]
[{"$f":"'Hopington AB - Analysis'!A49","v":"GW inflow from Beaver River  (m3)"},{"$f":"'Hopington AB - Analysis'!B49","v":112561},{"$f":"'Hopington AB - Analysis'!C49","v":101668},{"$f":"'Hopington AB - Analysis'!D49","v":112561},{"$f":"'Hopington AB - Analysis'!E49","v":108930},{"$f":"'Hopington AB - Analysis'!F49","v":112561},{"$f":"'Hopington AB - Analysis'!G49","v":108930},{"$f":"'Hopington AB - Analysis'!H49","v":112561},{"$f":"'Hopington AB - Analysis'!I49","v":112561},{"$f":"'Hopington AB - Analysis'!J49","v":108930},{"$f":"'Hopington AB - Analysis'!K49","v":112561},{"$f":"'Hopington AB - Analysis'!L49","v":108930},{"$f":"'Hopington AB - Analysis'!M49","v":112561},{"$f":"'Hopington AB - Analysis'!N49","v":1325315}]
[{"$f":"'Hopington AB - Analysis'!A75","v":"GW inflow from Beaver River  (m3)"},{"$f":"'Hopington AB - Analysis'!B75","v":112561},{"$f":"'Hopington AB - Analysis'!C75","v":101668},{"$f":"'Hopington AB - Analysis'!D75","v":112561},{"$f":"'Hopington AB - Analysis'!E75","v":108930},{"$f":"'Hopington AB - Analysis'!F75","v":112561},{"$f":"'Hopington AB - Analysis'!G75","v":108930},{"$f":"'Hopington AB - Analysis'!H75","v":112561},{"$f":"'Hopington AB - Analysis'!I75","v":112561},{"$f":"'Hopington AB - Analysis'!J75","v":108930},{"$f":"'Hopington AB - Analysis'!K75","v":112561},{"$f":"'Hopington AB - Analysis'!L75","v":108930},{"$f":"'Hopington AB - Analysis'!M75","v":112561},{"$f":"'Hopington AB - Analysis'!N75","v":1325315}]
[{"$f":"'Hopington AB - Analysis'!A101","v":"GW inflow from Beaver River  (m3)"},{"$f":"'Hopington AB - Analysis'!B101","v":112561},{"$f":"'Hopington AB - Analysis'!C101","v":101668},{"$f":"'Hopington AB - Analysis'!D101","v":112561},{"$f":"'Hopington AB - Analysis'!E101","v":108930},{"$f":"'Hopington AB - Analysis'!F101","v":112561},{"$f":"'Hopington AB - Analysis'!G101","v":108930},{"$f":"'Hopington AB - Analysis'!H101","v":112561},{"$f":"'Hopington AB - Analysis'!I101","v":112561},{"$f":"'Hopington AB - Analysis'!J101","v":108930},{"$f":"'Hopington AB - Analysis'!K101","v":112561},{"$f":"'Hopington AB - Analysis'!L101","v":108930},{"$f":"'Hopington AB - Analysis'!M101","v":112561},{"$f":"'Hopington AB - Analysis'!N101","v":1325315}]
[{"$f":"'Fort Langley - Analysis'!A49","v":"SW inflow from Fraser River (m3)"},{"$f":"'Fort Langley - Analysis'!B49","v":15004},{"$f":"'Fort Langley - Analysis'!C49","v":13552},{"$f":"'Fort Langley - Analysis'!D49","v":15004},{"$f":"'Fort Langley - Analysis'!E49","v":14520},{"$f":"'Fort Langley - Analysis'!F49","v":15004},{"$f":"'Fort Langley - Analysis'!G49","v":14520},{"$f":"'Fort Langley - Analysis'!H49","v":15004},{"$f":"'Fort Langley - Analysis'!I49","v":15004},{"$f":"'Fort Langley - Analysis'!J49","v":14520},{"$f":"'Fort Langley - Analysis'!K49","v":15004},{"$f":"'Fort Langley - Analysis'!L49","v":14520},{"$f":"'Fort Langley - Analysis'!M49","v":15004},{"$f":"'Fort Langley - Analysis'!N49","v":176660}]
[{"$f":"'Fort Langley - Analysis'!A75","v":"SW inflow from Fraser River (m3)"},{"$f":"'Fort Langley - Analysis'!B75","v":15004},{"$f":"'Fort Langley - Analysis'!C75","v":13552},{"$f":"'Fort Langley - Analysis'!D75","v":15004},{"$f":"'Fort Langley - Analysis'!E75","v":14520},{"$f":"'Fort Langley - Analysis'!F75","v":15004},{"$f":"'Fort Langley - Analysis'!G75","v":14520},{"$f":"'Fort Langley - Analysis'!H75","v":15004},{"$f":"'Fort Langley - Analysis'!I75","v":15004},{"$f":"'Fort Langley - Analysis'!J75","v":14520},{"$f":"'Fort Langley - Analysis'!K75","v":15004},{"$f":"'Fort Langley - Analysis'!L75","v":14520},{"$f":"'Fort Langley - Analysis'!M75","v":15004},{"$f":"'Fort Langley - Analysis'!N75","v":176660}]
[{"$f":"'Fort Langley - Analysis'!A101","v":"SW inflow from Fraser River (m3)"},{"$f":"'Fort Langley - Analysis'!B101","v":15004},{"$f":"'Fort Langley - Analysis'!C101","v":13552},{"$f":"'Fort Langley - Analysis'!D101","v":15004},{"$f":"'Fort Langley - Analysis'!E101","v":14520},{"$f":"'Fort Langley - Analysis'!F101","v":15004},{"$f":"'Fort Langley - Analysis'!G101","v":14520},{"$f":"'Fort Langley - Analysis'!H101","v":15004},{"$f":"'Fort Langley - Analysis'!I101","v":15004},{"$f":"'Fort Langley - Analysis'!J101","v":14520},{"$f":"'Fort Langley - Analysis'!K101","v":15004},{"$f":"'Fort Langley - Analysis'!L101","v":14520},{"$f":"'Fort Langley - Analysis'!M101","v":15004},{"$f":"'Fort Langley - Analysis'!N101","v":176660}]
[{"$f":"'Beaver River - Analysis'!A49","v":"GW inflow from Aldergrove CD (m3)"},{"$f":"'Beaver River - Analysis'!B49","v":270072},{"$f":"'Beaver River - Analysis'!C49","v":243936},{"$f":"'Beaver River - Analysis'!D49","v":270072},{"$f":"'Beaver River - Analysis'!E49","v":261360},{"$f":"'Beaver River - Analysis'!F49","v":270072},{"$f":"'Beaver River - Analysis'!G49","v":261360},{"$f":"'Beaver River - Analysis'!H49","v":270072},{"$f":"'Beaver River - Analysis'!I49","v":270072},{"$f":"'Beaver River - Analysis'!J49","v":261360},{"$f":"'Beaver River - Analysis'!K49","v":270072},{"$f":"'Beaver River - Analysis'!L49","v":261360},{"$f":"'Beaver River - Analysis'!M49","v":270072},{"$f":"'Beaver River - Analysis'!N49","v":3179880}]
[{"$f":"'Beaver River - Analysis'!A75","v":"GW inflow from Aldergrove CD (m3)"},{"$f":"'Beaver River - Analysis'!B75","v":270072},{"$f":"'Beaver River - Analysis'!C75","v":243936},{"$f":"'Beaver River - Analysis'!D75","v":270072},{"$f":"'Beaver River - Analysis'!E75","v":261360},{"$f":"'Beaver River - Analysis'!F75","v":270072},{"$f":"'Beaver River - Analysis'!G75","v":261360},{"$f":"'Beaver River - Analysis'!H75","v":270072},{"$f":"'Beaver River - Analysis'!I75","v":270072},{"$f":"'Beaver River - Analysis'!J75","v":261360},{"$f":"'Beaver River - Analysis'!K75","v":270072},{"$f":"'Beaver River - Analysis'!L75","v":261360},{"$f":"'Beaver River - Analysis'!M75","v":270072},{"$f":"'Beaver River - Analysis'!N75","v":3179880}]
[{"$f":"'Beaver River - Analysis'!A101","v":"GW inflow from Aldergrove CD (m3)"},{"$f":"'Beaver River - Analysis'!B101","v":270072},{"$f":"'Beaver River - Analysis'!C101","v":243936},{"$f":"'Beaver River - Analysis'!D101","v":270072},{"$f":"'Beaver River - Analysis'!E101","v":261360},{"$f":"'Beaver River - Analysis'!F101","v":270072},{"$f":"'Beaver River - Analysis'!G101","v":261360},{"$f":"'Beaver River - Analysis'!H101","v":270072},{"$f":"'Beaver River - Analysis'!I101","v":270072},{"$f":"'Beaver River - Analysis'!J101","v":261360},{"$f":"'Beaver River - Analysis'!K101","v":270072},{"$f":"'Beaver River - Analysis'!L101","v":261360},{"$f":"'Beaver River - Analysis'!M101","v":270072},{"$f":"'Beaver River - Analysis'!N101","v":3179880}]
[{"$f":"'West of Aldergrove - Analysis'!A49","v":"GW inflow from Brookswood (m3)"},{"$f":"'West of Aldergrove - Analysis'!B49","v":12896},{"$f":"'West of Aldergrove - Analysis'!C49","v":11648},{"$f":"'West of Aldergrove - Analysis'!D49","v":12896},{"$f":"'West of Aldergrove - Analysis'!E49","v":12480},{"$f":"'West of Aldergrove - Analysis'!F49","v":12896},{"$f":"'West of Aldergrove - Analysis'!G49","v":12480},{"$f":"'West of Aldergrove - Analysis'!H49","v":12896},{"$f":"'West of Aldergrove - Analysis'!I49","v":12896},{"$f":"'West of Aldergrove - Analysis'!J49","v":12480},{"$f":"'West of Aldergrove - Analysis'!K49","v":12896},{"$f":"'West of Aldergrove - Analysis'!L49","v":12480},{"$f":"'West of Aldergrove - Analysis'!M49","v":12896},{"$f":"'West of Aldergrove - Analysis'!N49","v":151840}]
[{"$f":"'West of Aldergrove - Analysis'!A80","v":"GW inflow from Brookswood (m3)"},{"$f":"'West of Aldergrove - Analysis'!B80","v":12896},{"$f":"'West of Aldergrove - Analysis'!C80","v":11648},{"$f":"'West of Aldergrove - Analysis'!D80","v":12896},{"$f":"'West of Aldergrove - Analysis'!E80","v":12480},{"$f":"'West of Aldergrove - Analysis'!F80","v":12896},{"$f":"'West of Aldergrove - Analysis'!G80","v":12480},{"$f":"'West of Aldergrove - Analysis'!H80","v":12896},{"$f":"'West of Aldergrove - Analysis'!I80","v":12896},{"$f":"'West of Aldergrove - Analysis'!J80","v":12480},{"$f":"'West of Aldergrove - Analysis'!K80","v":12896},{"$f":"'West of Aldergrove - Analysis'!L80","v":12480},{"$f":"'West of Aldergrove - Analysis'!M80","v":12896},{"$f":"'West of Aldergrove - Analysis'!N80","v":151840}]
[{"$f":"'West of Aldergrove - Analysis'!A111","v":"GW inflow from Brookswood (m3)"},{"$f":"'West of Aldergrove - Analysis'!B111","v":12896},{"$f":"'West of Aldergrove - Analysis'!C111","v":11648},{"$f":"'West of Aldergrove - Analysis'!D111","v":12896},{"$f":"'West of Aldergrove - Analysis'!E111","v":12480},{"$f":"'West of Aldergrove - Analysis'!F111","v":12896},{"$f":"'West of Aldergrove - Analysis'!G111","v":12480},{"$f":"'West of Aldergrove - Analysis'!H111","v":12896},{"$f":"'West of Aldergrove - Analysis'!I111","v":12896},{"$f":"'West of Aldergrove - Analysis'!J111","v":12480},{"$f":"'West of Aldergrove - Analysis'!K111","v":12896},{"$f":"'West of Aldergrove - Analysis'!L111","v":12480},{"$f":"'West of Aldergrove - Analysis'!M111","v":12896},{"$f":"'West of Aldergrove - Analysis'!N111","v":151840}]
[{"$f":"'S of Murrayville AC - Analysis'!A49","v":"GW inflow from Langley Upland Intertill aquifer (m3)"},{"$f":"'S of Murrayville AC - Analysis'!B49","v":67208},{"$f":"'S of Murrayville AC - Analysis'!C49","v":60704},{"$f":"'S of Murrayville AC - Analysis'!D49","v":67208},{"$f":"'S of Murrayville AC - Analysis'!E49","v":65040},{"$f":"'S of Murrayville AC - Analysis'!F49","v":67208},{"$f":"'S of Murrayville AC - Analysis'!G49","v":65040},{"$f":"'S of Murrayville AC - Analysis'!H49","v":67208},{"$f":"'S of Murrayville AC - Analysis'!I49","v":67208},{"$f":"'S of Murrayville AC - Analysis'!J49","v":65040},{"$f":"'S of Murrayville AC - Analysis'!K49","v":67208},{"$f":"'S of Murrayville AC - Analysis'!L49","v":65040},{"$f":"'S of Murrayville AC - Analysis'!M49","v":67208},{"$f":"'S of Murrayville AC - Analysis'!N49","v":791320}]
[{"$f":"'S of Murrayville AC - Analysis'!A75","v":"GW inflow from Langley Upland Intertill aquifer (m3)"},{"$f":"'S of Murrayville AC - Analysis'!B75","v":67208},{"$f":"'S of Murrayville AC - Analysis'!C75","v":60704},{"$f":"'S of Murrayville AC - Analysis'!D75","v":67208},{"$f":"'S of Murrayville AC - Analysis'!E75","v":65040},{"$f":"'S of Murrayville AC - Analysis'!F75","v":67208},{"$f":"'S of Murrayville AC - Analysis'!G75","v":65040},{"$f":"'S of Murrayville AC - Analysis'!H75","v":67208},{"$f":"'S of Murrayville AC - Analysis'!I75","v":67208},{"$f":"'S of Murrayville AC - Analysis'!J75","v":65040},{"$f":"'S of Murrayville AC - Analysis'!K75","v":67208},{"$f":"'S of Murrayville AC - Analysis'!L75","v":65040},{"$f":"'S of Murrayville AC - Analysis'!M75","v":67208},{"$f":"'S of Murrayville AC - Analysis'!N75","v":791320}]
[{"$f":"'S of Murrayville AC - Analysis'!A101","v":"GW inflow from Langley Upland Intertill aquifer (m3)"},{"$f":"'S of Murrayville AC - Analysis'!B101","v":67208},{"$f":"'S of Murrayville AC - Analysis'!C101","v":60704},{"$f":"'S of Murrayville AC - Analysis'!D101","v":67208},{"$f":"'S of Murrayville AC - Analysis'!E101","v":65040},{"$f":"'S of Murrayville AC - Analysis'!F101","v":67208},{"$f":"'S of Murrayville AC - Analysis'!G101","v":65040},{"$f":"'S of Murrayville AC - Analysis'!H101","v":67208},{"$f":"'S of Murrayville AC - Analysis'!I101","v":67208},{"$f":"'S of Murrayville AC - Analysis'!J101","v":65040},{"$f":"'S of Murrayville AC - Analysis'!K101","v":67208},{"$f":"'S of Murrayville AC - Analysis'!L101","v":65040},{"$f":"'S of Murrayville AC - Analysis'!M101","v":67208},{"$f":"'S of Murrayville AC - Analysis'!N101","v":791320}]
["","","","","","","","","","","","","",""]
["","","","","","","","","","","","","",""]
["","","","","","","","","","","","","",""]
["","","","","","","","","","","","","",""]
["","","","","","","","","","","","","",""]
["","","","","","","","","","","","","",""]
["","","","","","","","","","","","","",""]
["","","","","","","","","","","","","",""]
["","","","","","","","","","","","","",""]
["","","","","","","","","","","","","",""]
[]
[]
[]
[]
[]
["ROW 4 INFLOW"]
[{"$f":"'Hopington AB - Analysis'!A50","v":"SW inflow to aquifer (m3) - Nicomekl R. / Bertrand Ck."},{"$f":"'Hopington AB - Analysis'!B50","v":23792.5},{"$f":"'Hopington AB - Analysis'!C50","v":21490},{"$f":"'Hopington AB - Analysis'!D50","v":23792.5},{"$f":"'Hopington AB - Analysis'!E50","v":23025},{"$f":"'Hopington AB - Analysis'!F50","v":23792.5},{"$f":"'Hopington AB - Analysis'!G50","v":23025},{"$f":"'Hopington AB - Analysis'!H50","v":23792.5},{"$f":"'Hopington AB - Analysis'!I50","v":23792.5},{"$f":"'Hopington AB - Analysis'!J50","v":23025},{"$f":"'Hopington AB - Analysis'!K50","v":23792.5},{"$f":"'Hopington AB - Analysis'!L50","v":23025},{"$f":"'Hopington AB - Analysis'!M50","v":23792.5},{"$f":"'Hopington AB - Analysis'!N50","v":280137.5}]
[{"$f":"'Hopington AB - Analysis'!A76","v":"SW inflow to aquifer (m3) - Nicomekl R. / Bertrand Ck."},{"$f":"'Hopington AB - Analysis'!B76","v":23792.5},{"$f":"'Hopington AB - Analysis'!C76","v":21490},{"$f":"'Hopington AB - Analysis'!D76","v":23792.5},{"$f":"'Hopington AB - Analysis'!E76","v":23025},{"$f":"'Hopington AB - Analysis'!F76","v":23792.5},{"$f":"'Hopington AB - Analysis'!G76","v":23025},{"$f":"'Hopington AB - Analysis'!H76","v":23792.5},{"$f":"'Hopington AB - Analysis'!I76","v":23792.5},{"$f":"'Hopington AB - Analysis'!J76","v":23025},{"$f":"'Hopington AB - Analysis'!K76","v":23792.5},{"$f":"'Hopington AB - Analysis'!L76","v":23025},{"$f":"'Hopington AB - Analysis'!M76","v":23792.5},{"$f":"'Hopington AB - Analysis'!N76","v":280137.5}]
[{"$f":"'Hopington AB - Analysis'!A102","v":"SW inflow to aquifer (m3) - Nicomekl R. / Bertrand Ck."},{"$f":"'Hopington AB - Analysis'!B102","v":23792.5},{"$f":"'Hopington AB - Analysis'!C102","v":21490},{"$f":"'Hopington AB - Analysis'!D102","v":23792.5},{"$f":"'Hopington AB - Analysis'!E102","v":23025},{"$f":"'Hopington AB - Analysis'!F102","v":23792.5},{"$f":"'Hopington AB - Analysis'!G102","v":23025},{"$f":"'Hopington AB - Analysis'!H102","v":23792.5},{"$f":"'Hopington AB - Analysis'!I102","v":23792.5},{"$f":"'Hopington AB - Analysis'!J102","v":23025},{"$f":"'Hopington AB - Analysis'!K102","v":23792.5},{"$f":"'Hopington AB - Analysis'!L102","v":23025},{"$f":"'Hopington AB - Analysis'!M102","v":23792.5},{"$f":"'Hopington AB - Analysis'!N102","v":280137.5}]
["","","","","","","","","","","","","",""]
["","","","","","","","","","","","","",""]
["","","","","","","","","","","","","",""]
["","","","","","","","","","","","","",""]
["","","","","","","","","","","","","",""]
["","","","","","","","","","","","","",""]
[{"$f":"'West of Aldergrove - Analysis'!A50","v":"GW inflow from Hopington AB (m3)"},{"$f":"'West of Aldergrove - Analysis'!B50","v":10478},{"$f":"'West of Aldergrove - Analysis'!C50","v":9464},{"$f":"'West of Aldergrove - Analysis'!D50","v":10478},{"$f":"'West of Aldergrove - Analysis'!E50","v":10140},{"$f":"'West of Aldergrove - Analysis'!F50","v":10478},{"$f":"'West of Aldergrove - Analysis'!G50","v":10140},{"$f":"'West of Aldergrove - Analysis'!H50","v":10478},{"$f":"'West of Aldergrove - Analysis'!I50","v":10478},{"$f":"'West of Aldergrove - Analysis'!J50","v":10140},{"$f":"'West of Aldergrove - Analysis'!K50","v":10478},{"$f":"'West of Aldergrove - Analysis'!L50","v":10140},{"$f":"'West of Aldergrove - Analysis'!M50","v":10478},{"$f":"'West of Aldergrove - Analysis'!N50","v":123370}]
[{"$f":"'West of Aldergrove - Analysis'!A81","v":"GW inflow from Hopington AB (m3)"},{"$f":"'West of Aldergrove - Analysis'!B81","v":10478},{"$f":"'West of Aldergrove - Analysis'!C81","v":9464},{"$f":"'West of Aldergrove - Analysis'!D81","v":10478},{"$f":"'West of Aldergrove - Analysis'!E81","v":10140},{"$f":"'West of Aldergrove - Analysis'!F81","v":10478},{"$f":"'West of Aldergrove - Analysis'!G81","v":10140},{"$f":"'West of Aldergrove - Analysis'!H81","v":10478},{"$f":"'West of Aldergrove - Analysis'!I81","v":10478},{"$f":"'West of Aldergrove - Analysis'!J81","v":10140},{"$f":"'West of Aldergrove - Analysis'!K81","v":10478},{"$f":"'West of Aldergrove - Analysis'!L81","v":10140},{"$f":"'West of Aldergrove - Analysis'!M81","v":10478},{"$f":"'West of Aldergrove - Analysis'!N81","v":123370}]
[{"$f":"'West of Aldergrove - Analysis'!A112","v":"GW inflow from Hopington AB (m3)"},{"$f":"'West of Aldergrove - Analysis'!B112","v":10478},{"$f":"'West of Aldergrove - Analysis'!C112","v":9464},{"$f":"'West of Aldergrove - Analysis'!D112","v":10478},{"$f":"'West of Aldergrove - Analysis'!E112","v":10140},{"$f":"'West of Aldergrove - Analysis'!F112","v":10478},{"$f":"'West of Aldergrove - Analysis'!G112","v":10140},{"$f":"'West of Aldergrove - Analysis'!H112","v":10478},{"$f":"'West of Aldergrove - Analysis'!I112","v":10478},{"$f":"'West of Aldergrove - Analysis'!J112","v":10140},{"$f":"'West of Aldergrove - Analysis'!K112","v":10478},{"$f":"'West of Aldergrove - Analysis'!L112","v":10140},{"$f":"'West of Aldergrove - Analysis'!M112","v":10478},{"$f":"'West of Aldergrove - Analysis'!N112","v":123370}]
["","","","","","","","","","","","","",""]
["","","","","","","","","","","","","",""]
["","","","","","","","","","","","","",""]
["","","","","","","","","","","","","",""]
["","","","","","","","","","","","","",""]
["","","","","","","","","","","","","",""]
["","","","","","","","","","","","","",""]
["","","","","","","","","","","","","",""]
["","","","","","","","","","","","","",""]
["","","","","","","","","","","","","",""]
["","","","","","","","","","","","","",""]
["","","","","","","","","","","","","",""]
["","","","","","","","","","","","","",""]
["","","","","","","","","","","","","",""]
["","","","","","","","","","","","","",""]
[]
[]
[]
["ROW 5 INFLOW"]
[{"$f":"'Hopington AB - Analysis'!A51","v":"Recharge (m3)"},{"$f":"'Hopington AB - Analysis'!B51","v":1945622.6077544768},{"$f":"'Hopington AB - Analysis'!C51","v":1176467.0748115426},{"$f":"'Hopington AB - Analysis'!D51","v":791397.8116823663},{"$f":"'Hopington AB - Analysis'!E51","v":100816.20033359071},{"$f":"'Hopington AB - Analysis'!F51","v":18199.649548243142},{"$f":"'Hopington AB - Analysis'!G51","v":14881.256683102321},{"$f":"'Hopington AB - Analysis'!H51","v":9732.3473648422696},{"$f":"'Hopington AB - Analysis'!I51","v":15571.755783747631},{"$f":"'Hopington AB - Analysis'!J51","v":181745.53942983842},{"$f":"'Hopington AB - Analysis'!K51","v":1055937.8792601577},{"$f":"'Hopington AB - Analysis'!L51","v":2041588.6556530478},{"$f":"'Hopington AB - Analysis'!M51","v":2104094.2216950441},{"$f":"'Hopington AB - Analysis'!N51","v":9456055}]
[{"$f":"'Hopington AB - Analysis'!A77","v":"Recharge (m3)"},{"$f":"'Hopington AB - Analysis'!B77","v":768322.21263344632},{"$f":"'Hopington AB - Analysis'!C77","v":470303.11417869717},{"$f":"'Hopington AB - Analysis'!D77","v":257710.95831261843},{"$f":"'Hopington AB - Analysis'!E77","v":0},{"$f":"'Hopington AB - Analysis'!F77","v":0},{"$f":"'Hopington AB - Analysis'!G77","v":0},{"$f":"'Hopington AB - Analysis'!H77","v":0},{"$f":"'Hopington AB - Analysis'!I77","v":0},{"$f":"'Hopington AB - Analysis'!J77","v":0},{"$f":"'Hopington AB - Analysis'!K77","v":0},{"$f":"'Hopington AB - Analysis'!L77","v":0},{"$f":"'Hopington AB - Analysis'!M77","v":1508708.7148752378},{"$f":"'Hopington AB - Analysis'!N77","v":3005045}]
[{"$f":"'Hopington AB - Analysis'!A103","v":"Recharge (m3)"},{"$f":"'Hopington AB - Analysis'!B103","v":3795035.1009453936},{"$f":"'Hopington AB - Analysis'!C103","v":1427066.0348742951},{"$f":"'Hopington AB - Analysis'!D103","v":1449179.6572550309},{"$f":"'Hopington AB - Analysis'!E103","v":0},{"$f":"'Hopington AB - Analysis'!F103","v":0},{"$f":"'Hopington AB - Analysis'!G103","v":0},{"$f":"'Hopington AB - Analysis'!H103","v":0},{"$f":"'Hopington AB - Analysis'!I103","v":0},{"$f":"'Hopington AB - Analysis'!J103","v":326558.56496446166},{"$f":"'Hopington AB - Analysis'!K103","v":1758965.1347182472},{"$f":"'Hopington AB - Analysis'!L103","v":3284327.9478481691},{"$f":"'Hopington AB - Analysis'!M103","v":3270252.5593944006},{"$f":"'Hopington AB - Analysis'!N103","v":15311384.999999998}]
["","","","","","","","","","","","","",""]
["","","","","","","","","","","","","",""]
["","","","","","","","","","","","","",""]
["","","","","","","","","","","","","",""]
["","","","","","","","","","","","","",""]
["","","","","","","","","","","","","",""]
[{"$f":"'West of Aldergrove - Analysis'!A51","v":"GW inflow from Hopington C (m3)"},{"$f":"'West of Aldergrove - Analysis'!B51","v":233089},{"$f":"'West of Aldergrove - Analysis'!C51","v":210532},{"$f":"'West of Aldergrove - Analysis'!D51","v":233089},{"$f":"'West of Aldergrove - Analysis'!E51","v":225570},{"$f":"'West of Aldergrove - Analysis'!F51","v":233089},{"$f":"'West of Aldergrove - Analysis'!G51","v":225570},{"$f":"'West of Aldergrove - Analysis'!H51","v":233089},{"$f":"'West of Aldergrove - Analysis'!I51","v":233089},{"$f":"'West of Aldergrove - Analysis'!J51","v":225570},{"$f":"'West of Aldergrove - Analysis'!K51","v":233089},{"$f":"'West of Aldergrove - Analysis'!L51","v":225570},{"$f":"'West of Aldergrove - Analysis'!M51","v":233089},{"$f":"'West of Aldergrove - Analysis'!N51","v":2744435}]
[{"$f":"'West of Aldergrove - Analysis'!A82","v":"GW inflow from Hopington C (m3)"},{"$f":"'West of Aldergrove - Analysis'!B82","v":233089},{"$f":"'West of Aldergrove - Analysis'!C82","v":210532},{"$f":"'West of Aldergrove - Analysis'!D82","v":233089},{"$f":"'West of Aldergrove - Analysis'!E82","v":225570},{"$f":"'West of Aldergrove - Analysis'!F82","v":233089},{"$f":"'West of Aldergrove - Analysis'!G82","v":225570},{"$f":"'West of Aldergrove - Analysis'!H82","v":233089},{"$f":"'West of Aldergrove - Analysis'!I82","v":233089},{"$f":"'West of Aldergrove - Analysis'!J82","v":225570},{"$f":"'West of Aldergrove - Analysis'!K82","v":233089},{"$f":"'West of Aldergrove - Analysis'!L82","v":225570},{"$f":"'West of Aldergrove - Analysis'!M82","v":233089},{"$f":"'West of Aldergrove - Analysis'!N82","v":2744435}]
[{"$f":"'West of Aldergrove - Analysis'!A113","v":"GW inflow from Hopington C (m3)"},{"$f":"'West of Aldergrove - Analysis'!B113","v":233089},{"$f":"'West of Aldergrove - Analysis'!C113","v":210532},{"$f":"'West of Aldergrove - Analysis'!D113","v":233089},{"$f":"'West of Aldergrove - Analysis'!E113","v":225570},{"$f":"'West of Aldergrove - Analysis'!F113","v":233089},{"$f":"'West of Aldergrove - Analysis'!G113","v":225570},{"$f":"'West of Aldergrove - Analysis'!H113","v":233089},{"$f":"'West of Aldergrove - Analysis'!I113","v":233089},{"$f":"'West of Aldergrove - Analysis'!J113","v":225570},{"$f":"'West of Aldergrove - Analysis'!K113","v":233089},{"$f":"'West of Aldergrove - Analysis'!L113","v":225570},{"$f":"'West of Aldergrove - Analysis'!M113","v":233089},{"$f":"'West of Aldergrove - Analysis'!N113","v":2744435}]
["","","","","","","","","","","","","",""]
["","","","","","","","","","","","","",""]
["","","","","","","","","","","","","",""]
["","","","","","","","","","","","","",""]
["","","","","","","","","","","","","",""]
["","","","","","","","","","","","","",""]
["","","","","","","","","","","","","",""]
["","","","","","","","","","","","","",""]
["","","","","","","","","","","","","",""]
["","","","","","","","","","","","","",""]
["","","","","","","","","","","","","",""]
["","","","","","","","","","","","","",""]
["","","","","","","","","","","","","",""]
["","","","","","","","","","","","","",""]
[]
[]
[]
[]
["ROW 6 INFLOW"]
[{"$f":"'Hopington AB - Analysis'!A52","v":"SW inflow from Salmon River system (m3)"},{"$f":"'Hopington AB - Analysis'!B52","v":27807},{"$f":"'Hopington AB - Analysis'!C52","v":25116},{"$f":"'Hopington AB - Analysis'!D52","v":27807},{"$f":"'Hopington AB - Analysis'!E52","v":26910},{"$f":"'Hopington AB - Analysis'!F52","v":27807},{"$f":"'Hopington AB - Analysis'!G52","v":26910},{"$f":"'Hopington AB - Analysis'!H52","v":27807},{"$f":"'Hopington AB - Analysis'!I52","v":27807},{"$f":"'Hopington AB - Analysis'!J52","v":26910},{"$f":"'Hopington AB - Analysis'!K52","v":27807},{"$f":"'Hopington AB - Analysis'!L52","v":26910},{"$f":"'Hopington AB - Analysis'!M52","v":27807},{"$f":"'Hopington AB - Analysis'!N52","v":327405}]
[{"$f":"'Hopington AB - Analysis'!A78","v":"SW inflow from Salmon River system (m3)"},{"$f":"'Hopington AB - Analysis'!B78","v":27807},{"$f":"'Hopington AB - Analysis'!C78","v":25116},{"$f":"'Hopington AB - Analysis'!D78","v":27807},{"$f":"'Hopington AB - Analysis'!E78","v":26910},{"$f":"'Hopington AB - Analysis'!F78","v":27807},{"$f":"'Hopington AB - Analysis'!G78","v":26910},{"$f":"'Hopington AB - Analysis'!H78","v":27807},{"$f":"'Hopington AB - Analysis'!I78","v":27807},{"$f":"'Hopington AB - Analysis'!J78","v":26910},{"$f":"'Hopington AB - Analysis'!K78","v":27807},{"$f":"'Hopington AB - Analysis'!L78","v":26910},{"$f":"'Hopington AB - Analysis'!M78","v":27807},{"$f":"'Hopington AB - Analysis'!N78","v":327405}]
[{"$f":"'Hopington AB - Analysis'!A104","v":"SW inflow from Salmon River system (m3)"},{"$f":"'Hopington AB - Analysis'!B104","v":27807},{"$f":"'Hopington AB - Analysis'!C104","v":25116},{"$f":"'Hopington AB - Analysis'!D104","v":27807},{"$f":"'Hopington AB - Analysis'!E104","v":26910},{"$f":"'Hopington AB - Analysis'!F104","v":27807},{"$f":"'Hopington AB - Analysis'!G104","v":26910},{"$f":"'Hopington AB - Analysis'!H104","v":27807},{"$f":"'Hopington AB - Analysis'!I104","v":27807},{"$f":"'Hopington AB - Analysis'!J104","v":26910},{"$f":"'Hopington AB - Analysis'!K104","v":27807},{"$f":"'Hopington AB - Analysis'!L104","v":26910},{"$f":"'Hopington AB - Analysis'!M104","v":27807},{"$f":"'Hopington AB - Analysis'!N104","v":327405}]
["","","","","","","","","","","","","",""]
["","","","","","","","","","","","","",""]
["","","","","","","","","","","","","",""]
["","","","","","","","","","","","","",""]
["","","","","","","","","","","","","",""]
["","","","","","","","","","","","","",""]
[{"$f":"'West of Aldergrove - Analysis'!A52","v":"GW inflow from South of Hopington (m3)"},{"$f":"'West of Aldergrove - Analysis'!B52","v":13702},{"$f":"'West of Aldergrove - Analysis'!C52","v":12376},{"$f":"'West of Aldergrove - Analysis'!D52","v":13702},{"$f":"'West of Aldergrove - Analysis'!E52","v":13260},{"$f":"'West of Aldergrove - Analysis'!F52","v":13702},{"$f":"'West of Aldergrove - Analysis'!G52","v":13260},{"$f":"'West of Aldergrove - Analysis'!H52","v":13702},{"$f":"'West of Aldergrove - Analysis'!I52","v":13702},{"$f":"'West of Aldergrove - Analysis'!J52","v":13260},{"$f":"'West of Aldergrove - Analysis'!K52","v":13702},{"$f":"'West of Aldergrove - Analysis'!L52","v":13260},{"$f":"'West of Aldergrove - Analysis'!M52","v":13702},{"$f":"'West of Aldergrove - Analysis'!N52","v":161330}]
[{"$f":"'West of Aldergrove - Analysis'!A83","v":"GW inflow from South of Hopington (m3)"},{"$f":"'West of Aldergrove - Analysis'!B83","v":13702},{"$f":"'West of Aldergrove - Analysis'!C83","v":12376},{"$f":"'West of Aldergrove - Analysis'!D83","v":13702},{"$f":"'West of Aldergrove - Analysis'!E83","v":13260},{"$f":"'West of Aldergrove - Analysis'!F83","v":13702},{"$f":"'West of Aldergrove - Analysis'!G83","v":13260},{"$f":"'West of Aldergrove - Analysis'!H83","v":13702},{"$f":"'West of Aldergrove - Analysis'!I83","v":13702},{"$f":"'West of Aldergrove - Analysis'!J83","v":13260},{"$f":"'West of Aldergrove - Analysis'!K83","v":13702},{"$f":"'West of Aldergrove - Analysis'!L83","v":13260},{"$f":"'West of Aldergrove - Analysis'!M83","v":13702},{"$f":"'West of Aldergrove - Analysis'!N83","v":161330}]
[{"$f":"'West of Aldergrove - Analysis'!A114","v":"GW inflow from South of Hopington (m3)"},{"$f":"'West of Aldergrove - Analysis'!B114","v":13702},{"$f":"'West of Aldergrove - Analysis'!C114","v":12376},{"$f":"'West of Aldergrove - Analysis'!D114","v":13702},{"$f":"'West of Aldergrove - Analysis'!E114","v":13260},{"$f":"'West of Aldergrove - Analysis'!F114","v":13702},{"$f":"'West of Aldergrove - Analysis'!G114","v":13260},{"$f":"'West of Aldergrove - Analysis'!H114","v":13702},{"$f":"'West of Aldergrove - Analysis'!I114","v":13702},{"$f":"'West of Aldergrove - Analysis'!J114","v":13260},{"$f":"'West of Aldergrove - Analysis'!K114","v":13702},{"$f":"'West of Aldergrove - Analysis'!L114","v":13260},{"$f":"'West of Aldergrove - Analysis'!M114","v":13702},{"$f":"'West of Aldergrove - Analysis'!N114","v":161330}]
["","","","","","","","","","","","","",""]
["","","","","","","","","","","","","",""]
["","","","","","","","","","","","","",""]
["","","","","","","","","","","","","",""]
["","","","","","","","","","","","","",""]
["","","","","","","","","","","","","",""]
["","","","","","","","","","","","","",""]
["","","","","","","","","","","","","",""]
["","","","","","","","","","","","","",""]
["","","","","","","","","","","","","",""]
["","","","","","","","","","","","","",""]
["","","","","","","","","","","","","",""]
["","","","","","","","","","","","","",""]

{"sheet":"Outflow Data","index":17,"n_rows":341,"n_cols":30,"rows_kept":341,"cut":false,"hidden":true,"merged":[]}
[]
[]
[]
[]
[]
[]
[]
[]
[]
["ROW 1 OUTFLOW",null,null,null,null,null,null,null,null,null,null,null,null,null,null,null,"RESULT"]
[{"$f":"'Hopington AB - Analysis'!A58","v":"GW outflow to surrounding aquitards (m3)"},{"$f":"'Hopington AB - Analysis'!B58","v":419833},{"$f":"'Hopington AB - Analysis'!C58","v":379204},{"$f":"'Hopington AB - Analysis'!D58","v":419833},{"$f":"'Hopington AB - Analysis'!E58","v":406290},{"$f":"'Hopington AB - Analysis'!F58","v":419833},{"$f":"'Hopington AB - Analysis'!G58","v":406290},{"$f":"'Hopington AB - Analysis'!H58","v":419833},{"$f":"'Hopington AB - Analysis'!I58","v":419833},{"$f":"'Hopington AB - Analysis'!J58","v":406290},{"$f":"'Hopington AB - Analysis'!K58","v":419833},{"$f":"'Hopington AB - Analysis'!L58","v":406290},{"$f":"'Hopington AB - Analysis'!M58","v":419833},{"$f":"'Hopington AB - Analysis'!N58","v":4943195},null,"col number",1,2,3,4,5,6,7,8,9,10,11,12,13,14]
[{"$f":"'Hopington AB - Analysis'!A84","v":"GW outflow to surrounding aquitards (m3)"},{"$f":"'Hopington AB - Analysis'!B84","v":419833},{"$f":"'Hopington AB - Analysis'!C84","v":379204},{"$f":"'Hopington AB - Analysis'!D84","v":419833},{"$f":"'Hopington AB - Analysis'!E84","v":406290},{"$f":"'Hopington AB - Analysis'!F84","v":419833},{"$f":"'Hopington AB - Analysis'!G84","v":406290},{"$f":"'Hopington AB - Analysis'!H84","v":419833},{"$f":"'Hopington AB - Analysis'!I84","v":419833},{"$f":"'Hopington AB - Analysis'!J84","v":406290},{"$f":"'Hopington AB - Analysis'!K84","v":419833},{"$f":"'Hopington AB - Analysis'!L84","v":406290},{"$f":"'Hopington AB - Analysis'!M84","v":419833},{"$f":"'Hopington AB - Analysis'!N84","v":4943195},null,null,"INFLOW SOURCE / TYPE","JAN","FEB","MAR","APR","MAY","JUN","JUL","AUG","SEP","OCT","NOV","DEC","ANNUAL"]
[{"$f":"'Hopington AB - Analysis'!A110","v":"GW outflow to surrounding aquitards (m3)"},{"$f":"'Hopington AB - Analysis'!B110","v":419833},{"$f":"'Hopington AB - Analysis'!C110","v":379204},{"$f":"'Hopington AB - Analysis'!D110","v":419833},{"$f":"'Hopington AB - Analysis'!E110","v":406290},{"$f":"'Hopington AB - Analysis'!F110","v":419833},{"$f":"'Hopington AB - Analysis'!G110","v":406290},{"$f":"'Hopington AB - Analysis'!H110","v":419833},{"$f":"'Hopington AB - Analysis'!I110","v":419833},{"$f":"'Hopington AB - Analysis'!J110","v":406290},{"$f":"'Hopington AB - Analysis'!K110","v":419833},{"$f":"'Hopington AB - Analysis'!L110","v":406290},{"$f":"'Hopington AB - Analysis'!M110","v":419833},{"$f":"'Hopington AB - Analysis'!N110","v":4943195},null,null,{"$f":"INDEX($A$11:$N$31,'Form Control Selectors'!$B$34,Q$11)","v":"GW outflow to surrounding aquitards (m3)"},{"$f":"INDEX($A$11:$N$31,'Form Control Selectors'!$B$34,R$11)","v":419833},{"$f":"INDEX($A$11:$N$31,'Form Control Selectors'!$B$34,S$11)","v":379204},{"$f":"INDEX($A$11:$N$31,'Form Control Selectors'!$B$34,T$11)","v":419833},{"$f":"INDEX($A$11:$N$31,'Form Control Selectors'!$B$34,U$11)","v":406290},{"$f":"INDEX($A$11:$N$31,'Form Control Selectors'!$B$34,V$11)","v":419833},{"$f":"INDEX($A$11:$N$31,'Form Control Selectors'!$B$34,W$11)","v":406290},{"$f":"INDEX($A$11:$N$31,'Form Control Selectors'!$B$34,X$11)","v":419833},{"$f":"INDEX($A$11:$N$31,'Form Control Selectors'!$B$34,Y$11)","v":419833},{"$f":"INDEX($A$11:$N$31,'Form Control Selectors'!$B$34,Z$11)","v":406290},{"$f":"INDEX($A$11:$N$31,'Form Control Selectors'!$B$34,AA$11)","v":419833},{"$f":"INDEX($A$11:$N$31,'Form Control Selectors'!$B$34,AB$11)","v":406290},{"$f":"INDEX($A$11:$N$31,'Form Control Selectors'!$B$34,AC$11)","v":419833},{"$f":"INDEX($A$11:$N$31,'Form Control Selectors'!$B$34,AD$11)","v":4943195}]
[{"$f":"'Fort Langley - Analysis'!A58","v":"GW outflow to Fraser River (m3)"},{"$f":"'Fort Langley - Analysis'!B58","v":334041.5},{"$f":"'Fort Langley - Analysis'!C58","v":323203.60783249699},{"$f":"'Fort Langley - Analysis'!D58","v":309781.02128849539},{"$f":"'Fort Langley - Analysis'!E58","v":293300.54729582916},{"$f":"'Fort Langley - Analysis'!F58","v":266310.85351434856},{"$f":"'Fort Langley - Analysis'!G58","v":253839.05448297056},{"$f":"'Fort Langley - Analysis'!H58","v":261378.0012647165},{"$f":"'Fort Langley - Analysis'!I58","v":260663.56602186064},{"$f":"'Fort Langley - Analysis'!J58","v":257462.68416402349},{"$f":"'Fort Langley - Analysis'!K58","v":272582.46968402376},{"$f":"'Fort Langley - Analysis'!L58","v":312443.55359311309},{"$f":"'Fort Langley - Analysis'!M58","v":359744.31920781045},{"$f":"'Fort Langley - Analysis'!N58","v":3504751.1783496886},null,null,{"$f":"INDEX($A$42:$N$62,'Form Control Selectors'!$B$34,Q$11)","v":"GW outflow to Aldergrove CD (m3)"},{"$f":"INDEX($A$42:$N$62,'Form Control Selectors'!$B$34,R$11)","v":32705},{"$f":"INDEX($A$42:$N$62,'Form Control Selectors'!$B$34,S$11)","v":29540},{"$f":"INDEX($A$42:$N$62,'Form Control Selectors'!$B$34,T$11)","v":32705},{"$f":"INDEX($A$42:$N$62,'Form Control Selectors'!$B$34,U$11)","v":31650},{"$f":"INDEX($A$42:$N$62,'Form Control Selectors'!$B$34,V$11)","v":32705},{"$f":"INDEX($A$42:$N$62,'Form Control Selectors'!$B$34,W$11)","v":31650},{"$f":"INDEX($A$42:$N$62,'Form Control Selectors'!$B$34,X$11)","v":32705},{"$f":"INDEX($A$42:$N$62,'Form Control Selectors'!$B$34,Y$11)","v":32705},{"$f":"INDEX($A$42:$N$62,'Form Control Selectors'!$B$34,Z$11)","v":31650},{"$f":"INDEX($A$42:$N$62,'Form Control Selectors'!$B$34,AA$11)","v":32705},{"$f":"INDEX($A$42:$N$62,'Form Control Selectors'!$B$34,AB$11)","v":31650},{"$f":"INDEX($A$42:$N$62,'Form Control Selectors'!$B$34,AC$11)","v":32705},{"$f":"INDEX($A$42:$N$62,'Form Control Selectors'!$B$34,AD$11)","v":385075}]
[{"$f":"'Fort Langley - Analysis'!A84","v":"GW outflow to Fraser River (m3)"},{"$f":"'Fort Langley - Analysis'!B84","v":411917.39999999997},{"$f":"'Fort Langley - Analysis'!C84","v":304821.88858578552},{"$f":"'Fort Langley - Analysis'!D84","v":339595.73136341246},{"$f":"'Fort Langley - Analysis'!E84","v":314010.70470288926},{"$f":"'Fort Langley - Analysis'!F84","v":307447.37949115265},{"$f":"'Fort Langley - Analysis'!G84","v":292465.26071189938},{"$f":"'Fort Langley - Analysis'!H84","v":302357.29561796266},{"$f":"'Fort Langley - Analysis'!I84","v":301363.81184519676},{"$f":"'Fort Langley - Analysis'!J84","v":296330.12064182578},{"$f":"'Fort Langley - Analysis'!K84","v":305109.63370360603},{"$f":"'Fort Langley - Analysis'!L84","v":301032.88903409848},{"$f":"'Fort Langley - Analysis'!M84","v":311307.06846585037},{"$f":"'Fort Langley - Analysis'!N84","v":3787759.1841636798},null,null,{"$f":"INDEX($A$73:$N$93,'Form Control Selectors'!$B$34,Q$11)","v":"GW outflow to West of Aldergrove (m3)"},{"$f":"INDEX($A$73:$N$93,'Form Control Selectors'!$B$34,R$11)","v":10478},{"$f":"INDEX($A$73:$N$93,'Form Control Selectors'!$B$34,S$11)","v":9464},{"$f":"INDEX($A$73:$N$93,'Form Control Selectors'!$B$34,T$11)","v":10478},{"$f":"INDEX($A$73:$N$93,'Form Control Selectors'!$B$34,U$11)","v":10140},{"$f":"INDEX($A$73:$N$93,'Form Control Selectors'!$B$34,V$11)","v":10478},{"$f":"INDEX($A$73:$N$93,'Form Control Selectors'!$B$34,W$11)","v":10140},{"$f":"INDEX($A$73:$N$93,'Form Control Selectors'!$B$34,X$11)","v":10478},{"$f":"INDEX($A$73:$N$93,'Form Control Selectors'!$B$34,Y$11)","v":10478},{"$f":"INDEX($A$73:$N$93,'Form Control Selectors'!$B$34,Z$11)","v":10140},{"$f":"INDEX($A$73:$N$93,'Form Control Selectors'!$B$34,AA$11)","v":10478},{"$f":"INDEX($A$73:$N$93,'Form Control Selectors'!$B$34,AB$11)","v":10140},{"$f":"INDEX($A$73:$N$93,'Form Control Selectors'!$B$34,AC$11)","v":10478},{"$f":"INDEX($A$73:$N$93,'Form Control Selectors'!$B$34,AD$11)","v":123370}]
[{"$f":"'Fort Langley - Analysis'!A110","v":"GW outflow to Fraser River (m3)"},{"$f":"'Fort Langley - Analysis'!B110","v":448917.39999999997},{"$f":"'Fort Langley - Analysis'!C110","v":439440.95440224372},{"$f":"'Fort Langley - Analysis'!D110","v":346839.2915276757},{"$f":"'Fort Langley - Analysis'!E110","v":369207.8510643206},{"$f":"'Fort Langley - Analysis'!F110","v":293648.09290079481},{"$f":"'Fort Langley - Analysis'!G110","v":295915.08235948882},{"$f":"'Fort Langley - Analysis'!H110","v":301494.84020606527},{"$f":"'Fort Langley - Analysis'!I110","v":301579.42569817114},{"$f":"'Fort Langley - Analysis'!J110","v":296276.21717858221},{"$f":"'Fort Langley - Analysis'!K110","v":322056.68411085877},{"$f":"'Fort Langley - Analysis'!L110","v":388006.61796476203},{"$f":"'Fort Langley - Analysis'!M110","v":459871.25664265145},{"$f":"'Fort Langley - Analysis'!N110","v":4263253.7140556145},null,null,{"$f":"INDEX($A$104:$N$124,'Form Control Selectors'!$B$34,Q$11)","v":"GW outflow from pumping - Private minor users (m3)"},{"$f":"INDEX($A$104:$N$124,'Form Control Selectors'!$B$34,R$11)","v":131450.69236799999},{"$f":"INDEX($A$104:$N$124,'Form Control Selectors'!$B$34,S$11)","v":128377.9842885},{"$f":"INDEX($A$104:$N$124,'Form Control Selectors'!$B$34,T$11)","v":126947.3781765},{"$f":"INDEX($A$104:$N$124,'Form Control Selectors'!$B$34,U$11)","v":135319.51899300001},{"$f":"INDEX($A$104:$N$124,'Form Control Selectors'!$B$34,V$11)","v":157395.90345449996},{"$f":"INDEX($A$104:$N$124,'Form Control Selectors'!$B$34,W$11)","v":163193.9849565},{"$f":"INDEX($A$104:$N$124,'Form Control Selectors'!$B$34,X$11)","v":167052.4947105},{"$f":"INDEX($A$104:$N$124,'Form Control Selectors'!$B$34,Y$11)","v":151159.35493499998},{"$f":"INDEX($A$104:$N$124,'Form Control Selectors'!$B$34,Z$11)","v":153300.1056675},{"$f":"INDEX($A$104:$N$124,'Form Control Selectors'!$B$34,AA$11)","v":136155.18554399998},{"$f":"INDEX($A$104:$N$124,'Form Control Selectors'!$B$34,AB$11)","v":133682.57546099997},{"$f":"INDEX($A$104:$N$124,'Form Control Selectors'!$B$34,AC$11)","v":135445.04092349997},{"$f":"INDEX($A$104:$N$124,'Form Control Selectors'!$B$34,AD$11)","v":1719480.2194784998}]
[{"$f":"'Beaver River - Analysis'!A58","v":"GW outflow to surrounding aquitards (m3)"},{"$f":"'Beaver River - Analysis'!B58","v":1124339},{"$f":"'Beaver River - Analysis'!C58","v":1015532},{"$f":"'Beaver River - Analysis'!D58","v":1124339},{"$f":"'Beaver River - Analysis'!E58","v":1088070},{"$f":"'Beaver River - Analysis'!F58","v":1124339},{"$f":"'Beaver River - Analysis'!G58","v":1088070},{"$f":"'Beaver River - Analysis'!H58","v":1124339},{"$f":"'Beaver River - Analysis'!I58","v":1124339},{"$f":"'Beaver River - Analysis'!J58","v":1088070},{"$f":"'Beaver River - Analysis'!K58","v":1124339},{"$f":"'Beaver River - Analysis'!L58","v":1088070},{"$f":"'Beaver River - Analysis'!M58","v":1124339},{"$f":"'Beaver River - Analysis'!N58","v":13238185},null,null,{"$f":"INDEX($A$135:$N$155,'Form Control Selectors'!$B$34,Q$11)","v":"GW outflow to SW (m3) - Nicomekl R. / Bertrand Ck."},{"$f":"INDEX($A$135:$N$155,'Form Control Selectors'!$B$34,R$11)","v":108979},{"$f":"INDEX($A$135:$N$155,'Form Control Selectors'!$B$34,S$11)","v":90405.815353876867},{"$f":"INDEX($A$135:$N$155,'Form Control Selectors'!$B$34,T$11)","v":89296.152690548668},{"$f":"INDEX($A$135:$N$155,'Form Control Selectors'!$B$34,U$11)","v":80593.337999264491},{"$f":"INDEX($A$135:$N$155,'Form Control Selectors'!$B$34,V$11)","v":73018.432042230066},{"$f":"INDEX($A$135:$N$155,'Form Control Selectors'!$B$34,W$11)","v":69774.825754212245},{"$f":"INDEX($A$135:$N$155,'Form Control Selectors'!$B$34,X$11)","v":72763.353620357098},{"$f":"INDEX($A$135:$N$155,'Form Control Selectors'!$B$34,Y$11)","v":72223.043275743083},{"$f":"INDEX($A$135:$N$155,'Form Control Selectors'!$B$34,Z$11)","v":69953.676872642871},{"$f":"INDEX($A$135:$N$155,'Form Control Selectors'!$B$34,AA$11)","v":75653.035626182158},{"$f":"INDEX($A$135:$N$155,'Form Control Selectors'!$B$34,AB$11)","v":86852.787852389272},{"$f":"INDEX($A$135:$N$155,'Form Control Selectors'!$B$34,AC$11)","v":104129.2696453104},{"$f":"INDEX($A$135:$N$155,'Form Control Selectors'!$B$34,AD$11)","v":993642.73073275725}]
[{"$f":"'Beaver River - Analysis'!A84","v":"GW outflow to surrounding aquitards (m3)"},{"$f":"'Beaver River - Analysis'!B84","v":1124339},{"$f":"'Beaver River - Analysis'!C84","v":1015532},{"$f":"'Beaver River - Analysis'!D84","v":1124339},{"$f":"'Beaver River - Analysis'!E84","v":1088070},{"$f":"'Beaver River - Analysis'!F84","v":1124339},{"$f":"'Beaver River - Analysis'!G84","v":1088070},{"$f":"'Beaver River - Analysis'!H84","v":1124339},{"$f":"'Beaver River - Analysis'!I84","v":1124339},{"$f":"'Beaver River - Analysis'!J84","v":1088070},{"$f":"'Beaver River - Analysis'!K84","v":1124339},{"$f":"'Beaver River - Analysis'!L84","v":1088070},{"$f":"'Beaver River - Analysis'!M84","v":1124339},{"$f":"'Beaver River - Analysis'!N84","v":13238185},null,null,{"$f":"INDEX($A$166:$N$186,'Form Control Selectors'!$B$34,Q$11)","v":"GW outflow to Salmon River System (m3)"},{"$f":"INDEX($A$166:$N$186,'Form Control Selectors'!$B$34,R$11)","v":987707},{"$f":"INDEX($A$166:$N$186,'Form Control Selectors'!$B$34,S$11)","v":784069.5969540946},{"$f":"INDEX($A$166:$N$186,'Form Control Selectors'!$B$34,T$11)","v":780727.599041712},{"$f":"INDEX($A$166:$N$186,'Form Control Selectors'!$B$34,U$11)","v":708435.18926677632},{"$f":"INDEX($A$166:$N$186,'Form Control Selectors'!$B$34,V$11)","v":649026.04106895241},{"$f":"INDEX($A$166:$N$186,'Form Control Selectors'!$B$34,W$11)","v":620903.59019317187},{"$f":"INDEX($A$166:$N$186,'Form Control Selectors'!$B$34,X$11)","v":646962.22474652564},{"$f":"INDEX($A$166:$N$186,'Form Control Selectors'!$B$34,Y$11)","v":642590.62286737585},{"$f":"INDEX($A$166:$N$186,'Form Control Selectors'!$B$34,Z$11)","v":622350.65833320143},{"$f":"INDEX($A$166:$N$186,'Form Control Selectors'!$B$34,AA$11)","v":670342.37915729196},{"$f":"INDEX($A$166:$N$186,'Form Control Selectors'!$B$34,AB$11)","v":759079.8289875132},{"$f":"INDEX($A$166:$N$186,'Form Control Selectors'!$B$34,AC$11)","v":900740.99985751137},{"$f":"INDEX($A$166:$N$186,'Form Control Selectors'!$B$34,AD$11)","v":8772935.7304741256}]
[{"$f":"'Beaver River - Analysis'!A110","v":"GW outflow to surrounding aquitards (m3)"},{"$f":"'Beaver River - Analysis'!B110","v":1124339},{"$f":"'Beaver River - Analysis'!C110","v":1015532},{"$f":"'Beaver River - Analysis'!D110","v":1124339},{"$f":"'Beaver River - Analysis'!E110","v":1088070},{"$f":"'Beaver River - Analysis'!F110","v":1124339},{"$f":"'Beaver River - Analysis'!G110","v":1088070},{"$f":"'Beaver River - Analysis'!H110","v":1124339},{"$f":"'Beaver River - Analysis'!I110","v":1124339},{"$f":"'Beaver River - Analysis'!J110","v":1088070},{"$f":"'Beaver River - Analysis'!K110","v":1124339},{"$f":"'Beaver River - Analysis'!L110","v":1088070},{"$f":"'Beaver River - Analysis'!M110","v":1124339},{"$f":"'Beaver River - Analysis'!N110","v":13238185},null,null,{"$f":"INDEX($A$197:$N$217,'Form Control Selectors'!$B$34,Q$11)","v":""},{"$f":"INDEX($A$197:$N$217,'Form Control Selectors'!$B$34,R$11)","v":""},{"$f":"INDEX($A$197:$N$217,'Form Control Selectors'!$B$34,S$11)","v":""},{"$f":"INDEX($A$197:$N$217,'Form Control Selectors'!$B$34,T$11)","v":""},{"$f":"INDEX($A$197:$N$217,'Form Control Selectors'!$B$34,U$11)","v":""},{"$f":"INDEX($A$197:$N$217,'Form Control Selectors'!$B$34,V$11)","v":""},{"$f":"INDEX($A$197:$N$217,'Form Control Selectors'!$B$34,W$11)","v":""},{"$f":"INDEX($A$197:$N$217,'Form Control Selectors'!$B$34,X$11)","v":""},{"$f":"INDEX($A$197:$N$217,'Form Control Selectors'!$B$34,Y$11)","v":""},{"$f":"INDEX($A$197:$N$217,'Form Control Selectors'!$B$34,Z$11)","v":""},{"$f":"INDEX($A$197:$N$217,'Form Control Selectors'!$B$34,AA$11)","v":""},{"$f":"INDEX($A$197:$N$217,'Form Control Selectors'!$B$34,AB$11)","v":""},{"$f":"INDEX($A$197:$N$217,'Form Control Selectors'!$B$34,AC$11)","v":""},{"$f":"INDEX($A$197:$N$217,'Form Control Selectors'!$B$34,AD$11)","v":""}]
[{"$f":"'West of Aldergrove - Analysis'!A58","v":"GW outflow to surrounding aquitards (m3)"},{"$f":"'West of Aldergrove - Analysis'!B58","v":2344344},{"$f":"'West of Aldergrove - Analysis'!C58","v":2117472},{"$f":"'West of Aldergrove - Analysis'!D58","v":2344344},{"$f":"'West of Aldergrove - Analysis'!E58","v":2268720},{"$f":"'West of Aldergrove - Analysis'!F58","v":2344344},{"$f":"'West of Aldergrove - Analysis'!G58","v":2268720},{"$f":"'West of Aldergrove - Analysis'!H58","v":2344344},{"$f":"'West of Aldergrove - Analysis'!I58","v":2344344},{"$f":"'West of Aldergrove - Analysis'!J58","v":2268720},{"$f":"'West of Aldergrove - Analysis'!K58","v":2344344},{"$f":"'West of Aldergrove - Analysis'!L58","v":2268720},{"$f":"'West of Aldergrove - Analysis'!M58","v":2344344},{"$f":"'West of Aldergrove - Analysis'!N58","v":27602760},null,null,{"$f":"INDEX($A$228:$N$248,'Form Control Selectors'!$B$34,Q$11)","v":""},{"$f":"INDEX($A$228:$N$248,'Form Control Selectors'!$B$34,R$11)","v":""},{"$f":"INDEX($A$228:$N$248,'Form Control Selectors'!$B$34,S$11)","v":""},{"$f":"INDEX($A$228:$N$248,'Form Control Selectors'!$B$34,T$11)","v":""},{"$f":"INDEX($A$228:$N$248,'Form Control Selectors'!$B$34,U$11)","v":""},{"$f":"INDEX($A$228:$N$248,'Form Control Selectors'!$B$34,V$11)","v":""},{"$f":"INDEX($A$228:$N$248,'Form Control Selectors'!$B$34,W$11)","v":""},{"$f":"INDEX($A$228:$N$248,'Form Control Selectors'!$B$34,X$11)","v":""},{"$f":"INDEX($A$228:$N$248,'Form Control Selectors'!$B$34,Y$11)","v":""},{"$f":"INDEX($A$228:$N$248,'Form Control Selectors'!$B$34,Z$11)","v":""},{"$f":"INDEX($A$228:$N$248,'Form Control Selectors'!$B$34,AA$11)","v":""},{"$f":"INDEX($A$228:$N$248,'Form Control Selectors'!$B$34,AB$11)","v":""},{"$f":"INDEX($A$228:$N$248,'Form Control Selectors'!$B$34,AC$11)","v":""},{"$f":"INDEX($A$228:$N$248,'Form Control Selectors'!$B$34,AD$11)","v":""}]
[{"$f":"'West of Aldergrove - Analysis'!A89","v":"GW outflow to surrounding aquitards (m3)"},{"$f":"'West of Aldergrove - Analysis'!B89","v":2344344},{"$f":"'West of Aldergrove - Analysis'!C89","v":2117472},{"$f":"'West of Aldergrove - Analysis'!D89","v":2344344},{"$f":"'West of Aldergrove - Analysis'!E89","v":2268720},{"$f":"'West of Aldergrove - Analysis'!F89","v":2344344},{"$f":"'West of Aldergrove - Analysis'!G89","v":2268720},{"$f":"'West of Aldergrove - Analysis'!H89","v":2344344},{"$f":"'West of Aldergrove - Analysis'!I89","v":2344344},{"$f":"'West of Aldergrove - Analysis'!J89","v":2268720},{"$f":"'West of Aldergrove - Analysis'!K89","v":2344344},{"$f":"'West of Aldergrove - Analysis'!L89","v":2268720},{"$f":"'West of Aldergrove - Analysis'!M89","v":2344344},{"$f":"'West of Aldergrove - Analysis'!N89","v":27602760},null,null,{"$f":"INDEX($A$259:$N$279,'Form Control Selectors'!$B$34,Q$11)","v":""},{"$f":"INDEX($A$259:$N$279,'Form Control Selectors'!$B$34,R$11)","v":""},{"$f":"INDEX($A$259:$N$279,'Form Control Selectors'!$B$34,S$11)","v":""},{"$f":"INDEX($A$259:$N$279,'Form Control Selectors'!$B$34,T$11)","v":""},{"$f":"INDEX($A$259:$N$279,'Form Control Selectors'!$B$34,U$11)","v":""},{"$f":"INDEX($A$259:$N$279,'Form Control Selectors'!$B$34,V$11)","v":""},{"$f":"INDEX($A$259:$N$279,'Form Control Selectors'!$B$34,W$11)","v":""},{"$f":"INDEX($A$259:$N$279,'Form Control Selectors'!$B$34,X$11)","v":""},{"$f":"INDEX($A$259:$N$279,'Form Control Selectors'!$B$34,Y$11)","v":""},{"$f":"INDEX($A$259:$N$279,'Form Control Selectors'!$B$34,Z$11)","v":""},{"$f":"INDEX($A$259:$N$279,'Form Control Selectors'!$B$34,AA$11)","v":""},{"$f":"INDEX($A$259:$N$279,'Form Control Selectors'!$B$34,AB$11)","v":""},{"$f":"INDEX($A$259:$N$279,'Form Control Selectors'!$B$34,AC$11)","v":""},{"$f":"INDEX($A$259:$N$279,'Form Control Selectors'!$B$34,AD$11)","v":""}]
[{"$f":"'West of Aldergrove - Analysis'!A120","v":"GW outflow to surrounding aquitards (m3)"},{"$f":"'West of Aldergrove - Analysis'!B120","v":2344344},{"$f":"'West of Aldergrove - Analysis'!C120","v":2117472},{"$f":"'West of Aldergrove - Analysis'!D120","v":2344344},{"$f":"'West of Aldergrove - Analysis'!E120","v":2268720},{"$f":"'West of Aldergrove - Analysis'!F120","v":2344344},{"$f":"'West of Aldergrove - Analysis'!G120","v":2268720},{"$f":"'West of Aldergrove - Analysis'!H120","v":2344344},{"$f":"'West of Aldergrove - Analysis'!I120","v":2344344},{"$f":"'West of Aldergrove - Analysis'!J120","v":2268720},{"$f":"'West of Aldergrove - Analysis'!K120","v":2344344},{"$f":"'West of Aldergrove - Analysis'!L120","v":2268720},{"$f":"'West of Aldergrove - Analysis'!M120","v":2344344},{"$f":"'West of Aldergrove - Analysis'!N120","v":27602760},null,null,{"$f":"INDEX($A$290:$N$310,'Form Control Selectors'!$B$34,Q$11)","v":""},{"$f":"INDEX($A$290:$N$310,'Form Control Selectors'!$B$34,R$11)","v":""},{"$f":"INDEX($A$290:$N$310,'Form Control Selectors'!$B$34,S$11)","v":""},{"$f":"INDEX($A$290:$N$310,'Form Control Selectors'!$B$34,T$11)","v":""},{"$f":"INDEX($A$290:$N$310,'Form Control Selectors'!$B$34,U$11)","v":""},{"$f":"INDEX($A$290:$N$310,'Form Control Selectors'!$B$34,V$11)","v":""},{"$f":"INDEX($A$290:$N$310,'Form Control Selectors'!$B$34,W$11)","v":""},{"$f":"INDEX($A$290:$N$310,'Form Control Selectors'!$B$34,X$11)","v":""},{"$f":"INDEX($A$290:$N$310,'Form Control Selectors'!$B$34,Y$11)","v":""},{"$f":"INDEX($A$290:$N$310,'Form Control Selectors'!$B$34,Z$11)","v":""},{"$f":"INDEX($A$290:$N$310,'Form Control Selectors'!$B$34,AA$11)","v":""},{"$f":"INDEX($A$290:$N$310,'Form Control Selectors'!$B$34,AB$11)","v":""},{"$f":"INDEX($A$290:$N$310,'Form Control Selectors'!$B$34,AC$11)","v":""},{"$f":"INDEX($A$290:$N$310,'Form Control Selectors'!$B$34,AD$11)","v":""}]
[{"$f":"'S of Murrayville AC - Analysis'!A58","v":"GW outflow to surrounding aquitards (m3)"},{"$f":"'S of Murrayville AC - Analysis'!B58","v":1754972},{"$f":"'S of Murrayville AC - Analysis'!C58","v":1585136},{"$f":"'S of Murrayville AC - Analysis'!D58","v":1754972},{"$f":"'S of Murrayville AC - Analysis'!E58","v":1698360},{"$f":"'S of Murrayville AC - Analysis'!F58","v":1754972},{"$f":"'S of Murrayville AC - Analysis'!G58","v":1698360},{"$f":"'S of Murrayville AC - Analysis'!H58","v":1754972},{"$f":"'S of Murrayville AC - Analysis'!I58","v":1754972},{"$f":"'S of Murrayville AC - Analysis'!J58","v":1698360},{"$f":"'S of Murrayville AC - Analysis'!K58","v":1754972},{"$f":"'S of Murrayville AC - Analysis'!L58","v":1698360},{"$f":"'S of Murrayville AC - Analysis'!M58","v":1754972},{"$f":"'S of Murrayville AC - Analysis'!N58","v":20663380},null,null,{"$f":"INDEX($A$321:$N$341,'Form Control Selectors'!$B$34,Q$11)","v":""},{"$f":"INDEX($A$321:$N$341,'Form Control Selectors'!$B$34,R$11)","v":""},{"$f":"INDEX($A$321:$N$341,'Form Control Selectors'!$B$34,S$11)","v":""},{"$f":"INDEX($A$321:$N$341,'Form Control Selectors'!$B$34,T$11)","v":""},{"$f":"INDEX($A$321:$N$341,'Form Control Selectors'!$B$34,U$11)","v":""},{"$f":"INDEX($A$321:$N$341,'Form Control Selectors'!$B$34,V$11)","v":""},{"$f":"INDEX($A$321:$N$341,'Form Control Selectors'!$B$34,W$11)","v":""},{"$f":"INDEX($A$321:$N$341,'Form Control Selectors'!$B$34,X$11)","v":""},{"$f":"INDEX($A$321:$N$341,'Form Control Selectors'!$B$34,Y$11)","v":""},{"$f":"INDEX($A$321:$N$341,'Form Control Selectors'!$B$34,Z$11)","v":""},{"$f":"INDEX($A$321:$N$341,'Form Control Selectors'!$B$34,AA$11)","v":""},{"$f":"INDEX($A$321:$N$341,'Form Control Selectors'!$B$34,AB$11)","v":""},{"$f":"INDEX($A$321:$N$341,'Form Control Selectors'!$B$34,AC$11)","v":""},{"$f":"INDEX($A$321:$N$341,'Form Control Selectors'!$B$34,AD$11)","v":""}]
[{"$f":"'S of Murrayville AC - Analysis'!A84","v":"GW outflow to surrounding aquitards (m3)"},{"$f":"'S of Murrayville AC - Analysis'!B84","v":1754972},{"$f":"'S of Murrayville AC - Analysis'!C84","v":1585136},{"$f":"'S of Murrayville AC - Analysis'!D84","v":1754972},{"$f":"'S of Murrayville AC - Analysis'!E84","v":1698360},{"$f":"'S of Murrayville AC - Analysis'!F84","v":1754972},{"$f":"'S of Murrayville AC - Analysis'!G84","v":1698360},{"$f":"'S of Murrayville AC - Analysis'!H84","v":1754972},{"$f":"'S of Murrayville AC - Analysis'!I84","v":1754972},{"$f":"'S of Murrayville AC - Analysis'!J84","v":1698360},{"$f":"'S of Murrayville AC - Analysis'!K84","v":1754972},{"$f":"'S of Murrayville AC - Analysis'!L84","v":1698360},{"$f":"'S of Murrayville AC - Analysis'!M84","v":1754972},{"$f":"'S of Murrayville AC - Analysis'!N84","v":20663380}]
[{"$f":"'S of Murrayville AC - Analysis'!A110","v":"GW outflow to surrounding aquitards (m3)"},{"$f":"'S of Murrayville AC - Analysis'!B110","v":1754972},{"$f":"'S of Murrayville AC - Analysis'!C110","v":1585136},{"$f":"'S of Murrayville AC - Analysis'!D110","v":1754972},{"$f":"'S of Murrayville AC - Analysis'!E110","v":1698360},{"$f":"'S of Murrayville AC - Analysis'!F110","v":1754972},{"$f":"'S of Murrayville AC - Analysis'!G110","v":1698360},{"$f":"'S of Murrayville AC - Analysis'!H110","v":1754972},{"$f":"'S of Murrayville AC - Analysis'!I110","v":1754972},{"$f":"'S of Murrayville AC - Analysis'!J110","v":1698360},{"$f":"'S of Murrayville AC - Analysis'!K110","v":1754972},{"$f":"'S of Murrayville AC - Analysis'!L110","v":1698360},{"$f":"'S of Murrayville AC - Analysis'!M110","v":1754972},{"$f":"'S of Murrayville AC - Analysis'!N110","v":20663380}]
[{"$f":"'Salmon River - Analysis'!A58","v":"GW outflow to surrounding aquitards (m3)"},{"$f":"'Salmon River - Analysis'!B58","v":1123967},{"$f":"'Salmon River - Analysis'!C58","v":1015196},{"$f":"'Salmon River - Analysis'!D58","v":1123967},{"$f":"'Salmon River - Analysis'!E58","v":1087710},{"$f":"'Salmon River - Analysis'!F58","v":1123967},{"$f":"'Salmon River - Analysis'!G58","v":1087710},{"$f":"'Salmon River - Analysis'!H58","v":1123967},{"$f":"'Salmon River - Analysis'!I58","v":1123967},{"$f":"'Salmon River - Analysis'!J58","v":1087710},{"$f":"'Salmon River - Analysis'!K58","v":1123967},{"$f":"'Salmon River - Analysis'!L58","v":1087710},{"$f":"'Salmon River - Analysis'!M58","v":1123967},{"$f":"'Salmon River - Analysis'!N58","v":13233805}]
[{"$f":"'Salmon River - Analysis'!A84","v":"GW outflow to surrounding aquitards (m3)"},{"$f":"'Salmon River - Analysis'!B84","v":1123967},{"$f":"'Salmon River - Analysis'!C84","v":1015196},{"$f":"'Salmon River - Analysis'!D84","v":1123967},{"$f":"'Salmon River - Analysis'!E84","v":1087710},{"$f":"'Salmon River - Analysis'!F84","v":1123967},{"$f":"'Salmon River - Analysis'!G84","v":1087710},{"$f":"'Salmon River - Analysis'!H84","v":1123967},{"$f":"'Salmon River - Analysis'!I84","v":1123967},{"$f":"'Salmon River - Analysis'!J84","v":1087710},{"$f":"'Salmon River - Analysis'!K84","v":1123967},{"$f":"'Salmon River - Analysis'!L84","v":1087710},{"$f":"'Salmon River - Analysis'!M84","v":1123967},{"$f":"'Salmon River - Analysis'!N84","v":13233805}]
[{"$f":"'Salmon River - Analysis'!A110","v":"GW outflow to surrounding aquitards (m3)"},{"$f":"'Salmon River - Analysis'!B110","v":1123967},{"$f":"'Salmon River - Analysis'!C110","v":1015196},{"$f":"'Salmon River - Analysis'!D110","v":1123967},{"$f":"'Salmon River - Analysis'!E110","v":1087710},{"$f":"'Salmon River - Analysis'!F110","v":1123967},{"$f":"'Salmon River - Analysis'!G110","v":1087710},{"$f":"'Salmon River - Analysis'!H110","v":1123967},{"$f":"'Salmon River - Analysis'!I110","v":1123967},{"$f":"'Salmon River - Analysis'!J110","v":1087710},{"$f":"'Salmon River - Analysis'!K110","v":1123967},{"$f":"'Salmon River - Analysis'!L110","v":1087710},{"$f":"'Salmon River - Analysis'!M110","v":1123967},{"$f":"'Salmon River - Analysis'!N110","v":13233805}]
[{"$f":"'Nicomekl Serpentine - Analysis'!A58","v":"GW outflow to surrounding aquitards (m3)"},{"$f":"'Nicomekl Serpentine - Analysis'!B58","v":2700379},{"$f":"'Nicomekl Serpentine - Analysis'!C58","v":2439052},{"$f":"'Nicomekl Serpentine - Analysis'!D58","v":2700379},{"$f":"'Nicomekl Serpentine - Analysis'!E58","v":2613270},{"$f":"'Nicomekl Serpentine - Analysis'!F58","v":2700379},{"$f":"'Nicomekl Serpentine - Analysis'!G58","v":2613270},{"$f":"'Nicomekl Serpentine - Analysis'!H58","v":2700379},{"$f":"'Nicomekl Serpentine - Analysis'!I58","v":2700379},{"$f":"'Nicomekl Serpentine - Analysis'!J58","v":2613270},{"$f":"'Nicomekl Serpentine - Analysis'!K58","v":2700379},{"$f":"'Nicomekl Serpentine - Analysis'!L58","v":2613270},{"$f":"'Nicomekl Serpentine - Analysis'!M58","v":2700379},{"$f":"'Nicomekl Serpentine - Analysis'!N58","v":31794785}]
[{"$f":"'Nicomekl Serpentine - Analysis'!A84","v":"GW outflow to surrounding aquitards (m3)"},{"$f":"'Nicomekl Serpentine - Analysis'!B84","v":2700379},{"$f":"'Nicomekl Serpentine - Analysis'!C84","v":2439052},{"$f":"'Nicomekl Serpentine - Analysis'!D84","v":2700379},{"$f":"'Nicomekl Serpentine - Analysis'!E84","v":2613270},{"$f":"'Nicomekl Serpentine - Analysis'!F84","v":2700379},{"$f":"'Nicomekl Serpentine - Analysis'!G84","v":2613270},{"$f":"'Nicomekl Serpentine - Analysis'!H84","v":2700379},{"$f":"'Nicomekl Serpentine - Analysis'!I84","v":2700379},{"$f":"'Nicomekl Serpentine - Analysis'!J84","v":2613270},{"$f":"'Nicomekl Serpentine - Analysis'!K84","v":2700379},{"$f":"'Nicomekl Serpentine - Analysis'!L84","v":2613270},{"$f":"'Nicomekl Serpentine - Analysis'!M84","v":2700379},{"$f":"'Nicomekl Serpentine - Analysis'!N84","v":31794785}]
[{"$f":"'Nicomekl Serpentine - Analysis'!A110","v":"GW outflow to surrounding aquitards (m3)"},{"$f":"'Nicomekl Serpentine - Analysis'!B110","v":2700379},{"$f":"'Nicomekl Serpentine - Analysis'!C110","v":2439052},{"$f":"'Nicomekl Serpentine - Analysis'!D110","v":2700379},{"$f":"'Nicomekl Serpentine - Analysis'!E110","v":2613270},{"$f":"'Nicomekl Serpentine - Analysis'!F110","v":2700379},{"$f":"'Nicomekl Serpentine - Analysis'!G110","v":2613270},{"$f":"'Nicomekl Serpentine - Analysis'!H110","v":2700379},{"$f":"'Nicomekl Serpentine - Analysis'!I110","v":2700379},{"$f":"'Nicomekl Serpentine - Analysis'!J110","v":2613270},{"$f":"'Nicomekl Serpentine - Analysis'!K110","v":2700379},{"$f":"'Nicomekl Serpentine - Analysis'!L110","v":2613270},{"$f":"'Nicomekl Serpentine - Analysis'!M110","v":2700379},{"$f":"'Nicomekl Serpentine - Analysis'!N110","v":31794785}]
[]
[]
[]
[]
[]
[]
[]
[]
[]
["ROW 2 OUTFLOW"]
[{"$f":"'Hopington AB - Analysis'!A59","v":"GW outflow to Aldergrove CD (m3)"},{"$f":"'Hopington AB - Analysis'!B59","v":32705},{"$f":"'Hopington AB - Analysis'!C59","v":29540},{"$f":"'Hopington AB - Analysis'!D59","v":32705},{"$f":"'Hopington AB - Analysis'!E59","v":31650},{"$f":"'Hopington AB - Analysis'!F59","v":32705},{"$f":"'Hopington AB - Analysis'!G59","v":31650},{"$f":"'Hopington AB - Analysis'!H59","v":32705},{"$f":"'Hopington AB - Analysis'!I59","v":32705},{"$f":"'Hopington AB - Analysis'!J59","v":31650},{"$f":"'Hopington AB - Analysis'!K59","v":32705},{"$f":"'Hopington AB - Analysis'!L59","v":31650},{"$f":"'Hopington AB - Analysis'!M59","v":32705},{"$f":"'Hopington AB - Analysis'!N59","v":385075}]
[{"$f":"'Hopington AB - Analysis'!A85","v":"GW outflow to Aldergrove CD (m3)"},{"$f":"'Hopington AB - Analysis'!B85","v":32705},{"$f":"'Hopington AB - Analysis'!C85","v":29540},{"$f":"'Hopington AB - Analysis'!D85","v":32705},{"$f":"'Hopington AB - Analysis'!E85","v":31650},{"$f":"'Hopington AB - Analysis'!F85","v":32705},{"$f":"'Hopington AB - Analysis'!G85","v":31650},{"$f":"'Hopington AB - Analysis'!H85","v":32705},{"$f":"'Hopington AB - Analysis'!I85","v":32705},{"$f":"'Hopington AB - Analysis'!J85","v":31650},{"$f":"'Hopington AB - Analysis'!K85","v":32705},{"$f":"'Hopington AB - Analysis'!L85","v":31650},{"$f":"'Hopington AB - Analysis'!M85","v":32705},{"$f":"'Hopington AB - Analysis'!N85","v":385075}]
[{"$f":"'Hopington AB - Analysis'!A111","v":"GW outflow to Aldergrove CD (m3)"},{"$f":"'Hopington AB - Analysis'!B111","v":32705},{"$f":"'Hopington AB - Analysis'!C111","v":29540},{"$f":"'Hopington AB - Analysis'!D111","v":32705},{"$f":"'Hopington AB - Analysis'!E111","v":31650},{"$f":"'Hopington AB - Analysis'!F111","v":32705},{"$f":"'Hopington AB - Analysis'!G111","v":31650},{"$f":"'Hopington AB - Analysis'!H111","v":32705},{"$f":"'Hopington AB - Analysis'!I111","v":32705},{"$f":"'Hopington AB - Analysis'!J111","v":31650},{"$f":"'Hopington AB - Analysis'!K111","v":32705},{"$f":"'Hopington AB - Analysis'!L111","v":31650},{"$f":"'Hopington AB - Analysis'!M111","v":32705},{"$f":"'Hopington AB - Analysis'!N111","v":385075}]
[{"$f":"'Fort Langley - Analysis'!A59","v":"GW outflow from pumping - Muni - Ft. Langley 2 (m3)"},{"$f":"'Fort Langley - Analysis'!B59","v":214829.20048},{"$f":"'Fort Langley - Analysis'!C59","v":209807.48923500002},{"$f":"'Fort Langley - Analysis'!D59","v":207469.45691499999},{"$f":"'Fort Langley - Analysis'!E59","v":221152.00423000002},{"$f":"'Fort Langley - Analysis'!F59","v":257231.32749499998},{"$f":"'Fort Langley - Analysis'!G59","v":266707.10271499999},{"$f":"'Fort Langley - Analysis'!H59","v":273013.04565500002},{"$f":"'Fort Langley - Analysis'!I59","v":247038.96784999996},{"$f":"'Fort Langley - Analysis'!J59","v":250537.58592499999},{"$f":"'Fort Langley - Analysis'!K59","v":222517.72983999999},{"$f":"'Fort Langley - Analysis'!L59","v":218476.75570999997},{"$f":"'Fort Langley - Analysis'!M59","v":221357.14408499998},{"$f":"'Fort Langley - Analysis'!N59","v":2810137.8101349999}]
[{"$f":"'Fort Langley - Analysis'!A85","v":"GW outflow from pumping - Muni - Ft. Langley 2 (m3)"},{"$f":"'Fort Langley - Analysis'!B85","v":214829.20048},{"$f":"'Fort Langley - Analysis'!C85","v":209807.48923500002},{"$f":"'Fort Langley - Analysis'!D85","v":207469.45691499999},{"$f":"'Fort Langley - Analysis'!E85","v":221152.00423000002},{"$f":"'Fort Langley - Analysis'!F85","v":257231.32749499998},{"$f":"'Fort Langley - Analysis'!G85","v":266707.10271499999},{"$f":"'Fort Langley - Analysis'!H85","v":273013.04565500002},{"$f":"'Fort Langley - Analysis'!I85","v":247038.96784999996},{"$f":"'Fort Langley - Analysis'!J85","v":250537.58592499999},{"$f":"'Fort Langley - Analysis'!K85","v":222517.72983999999},{"$f":"'Fort Langley - Analysis'!L85","v":218476.75570999997},{"$f":"'Fort Langley - Analysis'!M85","v":221357.14408499998},{"$f":"'Fort Langley - Analysis'!N85","v":2810137.8101349999}]
[{"$f":"'Fort Langley - Analysis'!A111","v":"GW outflow from pumping - Muni - Ft. Langley 2 (m3)"},{"$f":"'Fort Langley - Analysis'!B111","v":214829.20048},{"$f":"'Fort Langley - Analysis'!C111","v":209807.48923500002},{"$f":"'Fort Langley - Analysis'!D111","v":207469.45691499999},{"$f":"'Fort Langley - Analysis'!E111","v":221152.00423000002},{"$f":"'Fort Langley - Analysis'!F111","v":257231.32749499998},{"$f":"'Fort Langley - Analysis'!G111","v":266707.10271499999},{"$f":"'Fort Langley - Analysis'!H111","v":273013.04565500002},{"$f":"'Fort Langley - Analysis'!I111","v":247038.96784999996},{"$f":"'Fort Langley - Analysis'!J111","v":250537.58592499999},{"$f":"'Fort Langley - Analysis'!K111","v":222517.72983999999},{"$f":"'Fort Langley - Analysis'!L111","v":218476.75570999997},{"$f":"'Fort Langley - Analysis'!M111","v":221357.14408499998},{"$f":"'Fort Langley - Analysis'!N111","v":2810137.8101349999}]
[{"$f":"'Beaver River - Analysis'!A59","v":"GW outflow to Hopington AB (m3)"},{"$f":"'Beaver River - Analysis'!B59","v":112530},{"$f":"'Beaver River - Analysis'!C59","v":101640},{"$f":"'Beaver River - Analysis'!D59","v":112530},{"$f":"'Beaver River - Analysis'!E59","v":108900},{"$f":"'Beaver River - Analysis'!F59","v":112530},{"$f":"'Beaver River - Analysis'!G59","v":108900},{"$f":"'Beaver River - Analysis'!H59","v":112530},{"$f":"'Beaver River - Analysis'!I59","v":112530},{"$f":"'Beaver River - Analysis'!J59","v":108900},{"$f":"'Beaver River - Analysis'!K59","v":112530},{"$f":"'Beaver River - Analysis'!L59","v":108900},{"$f":"'Beaver River - Analysis'!M59","v":112530},{"$f":"'Beaver River - Analysis'!N59","v":1324950}]
[{"$f":"'Beaver River - Analysis'!A85","v":"GW outflow to Hopington AB (m3)"},{"$f":"'Beaver River - Analysis'!B85","v":112530},{"$f":"'Beaver River - Analysis'!C85","v":101640},{"$f":"'Beaver River - Analysis'!D85","v":112530},{"$f":"'Beaver River - Analysis'!E85","v":108900},{"$f":"'Beaver River - Analysis'!F85","v":112530},{"$f":"'Beaver River - Analysis'!G85","v":108900},{"$f":"'Beaver River - Analysis'!H85","v":112530},{"$f":"'Beaver River - Analysis'!I85","v":112530},{"$f":"'Beaver River - Analysis'!J85","v":108900},{"$f":"'Beaver River - Analysis'!K85","v":112530},{"$f":"'Beaver River - Analysis'!L85","v":108900},{"$f":"'Beaver River - Analysis'!M85","v":112530},{"$f":"'Beaver River - Analysis'!N85","v":1324950}]
[{"$f":"'Beaver River - Analysis'!A111","v":"GW outflow to Hopington AB (m3)"},{"$f":"'Beaver River - Analysis'!B111","v":112530},{"$f":"'Beaver River - Analysis'!C111","v":101640},{"$f":"'Beaver River - Analysis'!D111","v":112530},{"$f":"'Beaver River - Analysis'!E111","v":108900},{"$f":"'Beaver River - Analysis'!F111","v":112530},{"$f":"'Beaver River - Analysis'!G111","v":108900},{"$f":"'Beaver River - Analysis'!H111","v":112530},{"$f":"'Beaver River - Analysis'!I111","v":112530},{"$f":"'Beaver River - Analysis'!J111","v":108900},{"$f":"'Beaver River - Analysis'!K111","v":112530},{"$f":"'Beaver River - Analysis'!L111","v":108900},{"$f":"'Beaver River - Analysis'!M111","v":112530},{"$f":"'Beaver River - Analysis'!N111","v":1324950}]
[{"$f":"'West of Aldergrove - Analysis'!A59","v":"GW outflow to Abbotsford (m3)"},{"$f":"'West of Aldergrove - Analysis'!B59","v":174003},{"$f":"'West of Aldergrove - Analysis'!C59","v":157164},{"$f":"'West of Aldergrove - Analysis'!D59","v":174003},{"$f":"'West of Aldergrove - Analysis'!E59","v":168390},{"$f":"'West of Aldergrove - Analysis'!F59","v":174003},{"$f":"'West of Aldergrove - Analysis'!G59","v":168390},{"$f":"'West of Aldergrove - Analysis'!H59","v":174003},{"$f":"'West of Aldergrove - Analysis'!I59","v":174003},{"$f":"'West of Aldergrove - Analysis'!J59","v":168390},{"$f":"'West of Aldergrove - Analysis'!K59","v":174003},{"$f":"'West of Aldergrove - Analysis'!L59","v":168390},{"$f":"'West of Aldergrove - Analysis'!M59","v":174003},{"$f":"'West of Aldergrove - Analysis'!N59","v":2048745}]
[{"$f":"'West of Aldergrove - Analysis'!A90","v":"GW outflow to Abbotsford (m3)"},{"$f":"'West of Aldergrove - Analysis'!B90","v":174003},{"$f":"'West of Aldergrove - Analysis'!C90","v":157164},{"$f":"'West of Aldergrove - Analysis'!D90","v":174003},{"$f":"'West of Aldergrove - Analysis'!E90","v":168390},{"$f":"'West of Aldergrove - Analysis'!F90","v":174003},{"$f":"'West of Aldergrove - Analysis'!G90","v":168390},{"$f":"'West of Aldergrove - Analysis'!H90","v":174003},{"$f":"'West of Aldergrove - Analysis'!I90","v":174003},{"$f":"'West of Aldergrove - Analysis'!J90","v":168390},{"$f":"'West of Aldergrove - Analysis'!K90","v":174003},{"$f":"'West of Aldergrove - Analysis'!L90","v":168390},{"$f":"'West of Aldergrove - Analysis'!M90","v":174003},{"$f":"'West of Aldergrove - Analysis'!N90","v":2048745}]
[{"$f":"'West of Aldergrove - Analysis'!A121","v":"GW outflow to Abbotsford (m3)"},{"$f":"'West of Aldergrove - Analysis'!B121","v":174003},{"$f":"'West of Aldergrove - Analysis'!C121","v":157164},{"$f":"'West of Aldergrove - Analysis'!D121","v":174003},{"$f":"'West of Aldergrove - Analysis'!E121","v":168390},{"$f":"'West of Aldergrove - Analysis'!F121","v":174003},{"$f":"'West of Aldergrove - Analysis'!G121","v":168390},{"$f":"'West of Aldergrove - Analysis'!H121","v":174003},{"$f":"'West of Aldergrove - Analysis'!I121","v":174003},{"$f":"'West of Aldergrove - Analysis'!J121","v":168390},{"$f":"'West of Aldergrove - Analysis'!K121","v":174003},{"$f":"'West of Aldergrove - Analysis'!L121","v":168390},{"$f":"'West of Aldergrove - Analysis'!M121","v":174003},{"$f":"'West of Aldergrove - Analysis'!N121","v":2048745}]
[{"$f":"'S of Murrayville AC - Analysis'!A59","v":"GW outflow to South of Murrayville B aquifer (m3)"},{"$f":"'S of Murrayville AC - Analysis'!B59","v":372},{"$f":"'S of Murrayville AC - Analysis'!C59","v":336},{"$f":"'S of Murrayville AC - Analysis'!D59","v":372},{"$f":"'S of Murrayville AC - Analysis'!E59","v":360},{"$f":"'S of Murrayville AC - Analysis'!F59","v":372},{"$f":"'S of Murrayville AC - Analysis'!G59","v":360},{"$f":"'S of Murrayville AC - Analysis'!H59","v":372},{"$f":"'S of Murrayville AC - Analysis'!I59","v":372},{"$f":"'S of Murrayville AC - Analysis'!J59","v":360},{"$f":"'S of Murrayville AC - Analysis'!K59","v":372},{"$f":"'S of Murrayville AC - Analysis'!L59","v":360},{"$f":"'S of Murrayville AC - Analysis'!M59","v":372},{"$f":"'S of Murrayville AC - Analysis'!N59","v":4380}]
[{"$f":"'S of Murrayville AC - Analysis'!A85","v":"GW outflow to South of Murrayville B aquifer (m3)"},{"$f":"'S of Murrayville AC - Analysis'!B85","v":372},{"$f":"'S of Murrayville AC - Analysis'!C85","v":336},{"$f":"'S of Murrayville AC - Analysis'!D85","v":372},{"$f":"'S of Murrayville AC - Analysis'!E85","v":360},{"$f":"'S of Murrayville AC - Analysis'!F85","v":372},{"$f":"'S of Murrayville AC - Analysis'!G85","v":360},{"$f":"'S of Murrayville AC - Analysis'!H85","v":372},{"$f":"'S of Murrayville AC - Analysis'!I85","v":372},{"$f":"'S of Murrayville AC - Analysis'!J85","v":360},{"$f":"'S of Murrayville AC - Analysis'!K85","v":372},{"$f":"'S of Murrayville AC - Analysis'!L85","v":360},{"$f":"'S of Murrayville AC - Analysis'!M85","v":372},{"$f":"'S of Murrayville AC - Analysis'!N85","v":4380}]
[{"$f":"'S of Murrayville AC - Analysis'!A111","v":"GW outflow to South of Murrayville B aquifer (m3)"},{"$f":"'S of Murrayville AC - Analysis'!B111","v":372},{"$f":"'S of Murrayville AC - Analysis'!C111","v":336},{"$f":"'S of Murrayville AC - Analysis'!D111","v":372},{"$f":"'S of Murrayville AC - Analysis'!E111","v":360},{"$f":"'S of Murrayville AC - Analysis'!F111","v":372},{"$f":"'S of Murrayville AC - Analysis'!G111","v":360},{"$f":"'S of Murrayville AC - Analysis'!H111","v":372},{"$f":"'S of Murrayville AC - Analysis'!I111","v":372},{"$f":"'S of Murrayville AC - Analysis'!J111","v":360},{"$f":"'S of Murrayville AC - Analysis'!K111","v":372},{"$f":"'S of Murrayville AC - Analysis'!L111","v":360},{"$f":"'S of Murrayville AC - Analysis'!M111","v":372},{"$f":"'S of Murrayville AC - Analysis'!N111","v":4380}]
["","","","","","","","","","","","","",""]
["","","","","","","","","","","","","",""]
["","","","","","","","","","","","","",""]
[{"$f":"'Nicomekl Serpentine - Analysis'!A59","v":"GW outflow to boundary (m3)"},{"$f":"'Nicomekl Serpentine - Analysis'!B59","v":711388},{"$f":"'Nicomekl Serpentine - Analysis'!C59","v":642544},{"$f":"'Nicomekl Serpentine - Analysis'!D59","v":711388},{"$f":"'Nicomekl Serpentine - Analysis'!E59","v":688440},{"$f":"'Nicomekl Serpentine - Analysis'!F59","v":711388},{"$f":"'Nicomekl Serpentine - Analysis'!G59","v":688440},{"$f":"'Nicomekl Serpentine - Analysis'!H59","v":711388},{"$f":"'Nicomekl Serpentine - Analysis'!I59","v":711388},{"$f":"'Nicomekl Serpentine - Analysis'!J59","v":688440},{"$f":"'Nicomekl Serpentine - Analysis'!K59","v":711388},{"$f":"'Nicomekl Serpentine - Analysis'!L59","v":688440},{"$f":"'Nicomekl Serpentine - Analysis'!M59","v":711388},{"$f":"'Nicomekl Serpentine - Analysis'!N59","v":8376020}]
[{"$f":"'Nicomekl Serpentine - Analysis'!A85","v":"GW outflow to boundary (m3)"},{"$f":"'Nicomekl Serpentine - Analysis'!B85","v":711388},{"$f":"'Nicomekl Serpentine - Analysis'!C85","v":642544},{"$f":"'Nicomekl Serpentine - Analysis'!D85","v":711388},{"$f":"'Nicomekl Serpentine - Analysis'!E85","v":688440},{"$f":"'Nicomekl Serpentine - Analysis'!F85","v":711388},{"$f":"'Nicomekl Serpentine - Analysis'!G85","v":688440},{"$f":"'Nicomekl Serpentine - Analysis'!H85","v":711388},{"$f":"'Nicomekl Serpentine - Analysis'!I85","v":711388},{"$f":"'Nicomekl Serpentine - Analysis'!J85","v":688440},{"$f":"'Nicomekl Serpentine - Analysis'!K85","v":711388},{"$f":"'Nicomekl Serpentine - Analysis'!L85","v":688440},{"$f":"'Nicomekl Serpentine - Analysis'!M85","v":711388},{"$f":"'Nicomekl Serpentine - Analysis'!N85","v":8376020}]
[{"$f":"'Nicomekl Serpentine - Analysis'!A111","v":"GW outflow to boundary (m3)"},{"$f":"'Nicomekl Serpentine - Analysis'!B111","v":711388},{"$f":"'Nicomekl Serpentine - Analysis'!C111","v":642544},{"$f":"'Nicomekl Serpentine - Analysis'!D111","v":711388},{"$f":"'Nicomekl Serpentine - Analysis'!E111","v":688440},{"$f":"'Nicomekl Serpentine - Analysis'!F111","v":711388},{"$f":"'Nicomekl Serpentine - Analysis'!G111","v":688440},{"$f":"'Nicomekl Serpentine - Analysis'!H111","v":711388},{"$f":"'Nicomekl Serpentine - Analysis'!I111","v":711388},{"$f":"'Nicomekl Serpentine - Analysis'!J111","v":688440},{"$f":"'Nicomekl Serpentine - Analysis'!K111","v":711388},{"$f":"'Nicomekl Serpentine - Analysis'!L111","v":688440},{"$f":"'Nicomekl Serpentine - Analysis'!M111","v":711388},{"$f":"'Nicomekl Serpentine - Analysis'!N111","v":8376020}]
[]
[]
[]
[]
[]
[]
[]
[]
[]
["ROW 3 OUTFLOW"]
[{"$f":"'Hopington AB - Analysis'!A60","v":"GW outflow to West of Aldergrove (m3)"},{"$f":"'Hopington AB - Analysis'!B60","v":10478},{"$f":"'Hopington AB - Analysis'!C60","v":9464},{"$f":"'Hopington AB - Analysis'!D60","v":10478},{"$f":"'Hopington AB - Analysis'!E60","v":10140},{"$f":"'Hopington AB - Analysis'!F60","v":10478},{"$f":"'Hopington AB - Analysis'!G60","v":10140},{"$f":"'Hopington AB - Analysis'!H60","v":10478},{"$f":"'Hopington AB - Analysis'!I60","v":10478},{"$f":"'Hopington AB - Analysis'!J60","v":10140},{"$f":"'Hopington AB - Analysis'!K60","v":10478},{"$f":"'Hopington AB - Analysis'!L60","v":10140},{"$f":"'Hopington AB - Analysis'!M60","v":10478},{"$f":"'Hopington AB - Analysis'!N60","v":123370}]
[{"$f":"'Hopington AB - Analysis'!A86","v":"GW outflow to West of Aldergrove (m3)"},{"$f":"'Hopington AB - Analysis'!B86","v":10478},{"$f":"'Hopington AB - Analysis'!C86","v":9464},{"$f":"'Hopington AB - Analysis'!D86","v":10478},{"$f":"'Hopington AB - Analysis'!E86","v":10140},{"$f":"'Hopington AB - Analysis'!F86","v":10478},{"$f":"'Hopington AB - Analysis'!G86","v":10140},{"$f":"'Hopington AB - Analysis'!H86","v":10478},{"$f":"'Hopington AB - Analysis'!I86","v":10478},{"$f":"'Hopington AB - Analysis'!J86","v":10140},{"$f":"'Hopington AB - Analysis'!K86","v":10478},{"$f":"'Hopington AB - Analysis'!L86","v":10140},{"$f":"'Hopington AB - Analysis'!M86","v":10478},{"$f":"'Hopington AB - Analysis'!N86","v":123370}]
[{"$f":"'Hopington AB - Analysis'!A112","v":"GW outflow to West of Aldergrove (m3)"},{"$f":"'Hopington AB - Analysis'!B112","v":10478},{"$f":"'Hopington AB - Analysis'!C112","v":9464},{"$f":"'Hopington AB - Analysis'!D112","v":10478},{"$f":"'Hopington AB - Analysis'!E112","v":10140},{"$f":"'Hopington AB - Analysis'!F112","v":10478},{"$f":"'Hopington AB - Analysis'!G112","v":10140},{"$f":"'Hopington AB - Analysis'!H112","v":10478},{"$f":"'Hopington AB - Analysis'!I112","v":10478},{"$f":"'Hopington AB - Analysis'!J112","v":10140},{"$f":"'Hopington AB - Analysis'!K112","v":10478},{"$f":"'Hopington AB - Analysis'!L112","v":10140},{"$f":"'Hopington AB - Analysis'!M112","v":10478},{"$f":"'Hopington AB - Analysis'!N112","v":123370}]
[{"$f":"'Fort Langley - Analysis'!A60","v":"GW outflow from pumping - Private minor users (m3)"},{"$f":"'Fort Langley - Analysis'!B60","v":11021.8904},{"$f":"'Fort Langley - Analysis'!C60","v":10764.249675000001},{"$f":"'Fort Langley - Analysis'!D60","v":10644.296075},{"$f":"'Fort Langley - Analysis'!E60","v":11346.284150000001},{"$f":"'Fort Langley - Analysis'!F60","v":13197.346974999999},{"$f":"'Fort Langley - Analysis'!G60","v":13683.505074999999},{"$f":"'Fort Langley - Analysis'!H60","v":14007.033775},{"$f":"'Fort Langley - Analysis'!I60","v":12674.424249999998},{"$f":"'Fort Langley - Analysis'!J60","v":12853.922125000001},{"$f":"'Fort Langley - Analysis'!K60","v":11416.3532},{"$f":"'Fort Langley - Analysis'!L60","v":11209.029549999999},{"$f":"'Fort Langley - Analysis'!M60","v":11356.808924999998},{"$f":"'Fort Langley - Analysis'!N60","v":144175.14417499999}]
[{"$f":"'Fort Langley - Analysis'!A86","v":"GW outflow from pumping - Private minor users (m3)"},{"$f":"'Fort Langley - Analysis'!B86","v":11021.8904},{"$f":"'Fort Langley - Analysis'!C86","v":10764.249675000001},{"$f":"'Fort Langley - Analysis'!D86","v":10644.296075},{"$f":"'Fort Langley - Analysis'!E86","v":11346.284150000001},{"$f":"'Fort Langley - Analysis'!F86","v":13197.346974999999},{"$f":"'Fort Langley - Analysis'!G86","v":13683.505074999999},{"$f":"'Fort Langley - Analysis'!H86","v":14007.033775},{"$f":"'Fort Langley - Analysis'!I86","v":12674.424249999998},{"$f":"'Fort Langley - Analysis'!J86","v":12853.922125000001},{"$f":"'Fort Langley - Analysis'!K86","v":11416.3532},{"$f":"'Fort Langley - Analysis'!L86","v":11209.029549999999},{"$f":"'Fort Langley - Analysis'!M86","v":11356.808924999998},{"$f":"'Fort Langley - Analysis'!N86","v":144175.14417499999}]
[{"$f":"'Fort Langley - Analysis'!A112","v":"GW outflow from pumping - Private minor users (m3)"},{"$f":"'Fort Langley - Analysis'!B112","v":11021.8904},{"$f":"'Fort Langley - Analysis'!C112","v":10764.249675000001},{"$f":"'Fort Langley - Analysis'!D112","v":10644.296075},{"$f":"'Fort Langley - Analysis'!E112","v":11346.284150000001},{"$f":"'Fort Langley - Analysis'!F112","v":13197.346974999999},{"$f":"'Fort Langley - Analysis'!G112","v":13683.505074999999},{"$f":"'Fort Langley - Analysis'!H112","v":14007.033775},{"$f":"'Fort Langley - Analysis'!I112","v":12674.424249999998},{"$f":"'Fort Langley - Analysis'!J112","v":12853.922125000001},{"$f":"'Fort Langley - Analysis'!K112","v":11416.3532},{"$f":"'Fort Langley - Analysis'!L112","v":11209.029549999999},{"$f":"'Fort Langley - Analysis'!M112","v":11356.808924999998},{"$f":"'Fort Langley - Analysis'!N112","v":144175.14417499999}]
[{"$f":"'Beaver River - Analysis'!A60","v":"GW outflow to Aldergrove CD (m3)"},{"$f":"'Beaver River - Analysis'!B60","v":370977},{"$f":"'Beaver River - Analysis'!C60","v":335076},{"$f":"'Beaver River - Analysis'!D60","v":370977},{"$f":"'Beaver River - Analysis'!E60","v":359010},{"$f":"'Beaver River - Analysis'!F60","v":370977},{"$f":"'Beaver River - Analysis'!G60","v":359010},{"$f":"'Beaver River - Analysis'!H60","v":370977},{"$f":"'Beaver River - Analysis'!I60","v":370977},{"$f":"'Beaver River - Analysis'!J60","v":359010},{"$f":"'Beaver River - Analysis'!K60","v":370977},{"$f":"'Beaver River - Analysis'!L60","v":359010},{"$f":"'Beaver River - Analysis'!M60","v":370977},{"$f":"'Beaver River - Analysis'!N60","v":4367955}]
[{"$f":"'Beaver River - Analysis'!A86","v":"GW outflow to Aldergrove CD (m3)"},{"$f":"'Beaver River - Analysis'!B86","v":370977},{"$f":"'Beaver River - Analysis'!C86","v":335076},{"$f":"'Beaver River - Analysis'!D86","v":370977},{"$f":"'Beaver River - Analysis'!E86","v":359010},{"$f":"'Beaver River - Analysis'!F86","v":370977},{"$f":"'Beaver River - Analysis'!G86","v":359010},{"$f":"'Beaver River - Analysis'!H86","v":370977},{"$f":"'Beaver River - Analysis'!I86","v":370977},{"$f":"'Beaver River - Analysis'!J86","v":359010},{"$f":"'Beaver River - Analysis'!K86","v":370977},{"$f":"'Beaver River - Analysis'!L86","v":359010},{"$f":"'Beaver River - Analysis'!M86","v":370977},{"$f":"'Beaver River - Analysis'!N86","v":4367955}]
[{"$f":"'Beaver River - Analysis'!A112","v":"GW outflow to Aldergrove CD (m3)"},{"$f":"'Beaver River - Analysis'!B112","v":370977},{"$f":"'Beaver River - Analysis'!C112","v":335076},{"$f":"'Beaver River - Analysis'!D112","v":370977},{"$f":"'Beaver River - Analysis'!E112","v":359010},{"$f":"'Beaver River - Analysis'!F112","v":370977},{"$f":"'Beaver River - Analysis'!G112","v":359010},{"$f":"'Beaver River - Analysis'!H112","v":370977},{"$f":"'Beaver River - Analysis'!I112","v":370977},{"$f":"'Beaver River - Analysis'!J112","v":359010},{"$f":"'Beaver River - Analysis'!K112","v":370977},{"$f":"'Beaver River - Analysis'!L112","v":359010},{"$f":"'Beaver River - Analysis'!M112","v":370977},{"$f":"'Beaver River - Analysis'!N112","v":4367955}]
[{"$f":"'West of Aldergrove - Analysis'!A60","v":"GW outflow to Hopington C (m3)"},{"$f":"'West of Aldergrove - Analysis'!B60","v":45942},{"$f":"'West of Aldergrove - Analysis'!C60","v":41496},{"$f":"'West of Aldergrove - Analysis'!D60","v":45942},{"$f":"'West of Aldergrove - Analysis'!E60","v":44460},{"$f":"'West of Aldergrove - Analysis'!F60","v":45942},{"$f":"'West of Aldergrove - Analysis'!G60","v":44460},{"$f":"'West of Aldergrove - Analysis'!H60","v":45942},{"$f":"'West of Aldergrove - Analysis'!I60","v":45942},{"$f":"'West of Aldergrove - Analysis'!J60","v":44460},{"$f":"'West of Aldergrove - Analysis'!K60","v":45942},{"$f":"'West of Aldergrove - Analysis'!L60","v":44460},{"$f":"'West of Aldergrove - Analysis'!M60","v":45942},{"$f":"'West of Aldergrove - Analysis'!N60","v":540930}]
[{"$f":"'West of Aldergrove - Analysis'!A91","v":"GW outflow to Hopington C (m3)"},{"$f":"'West of Aldergrove - Analysis'!B91","v":45942},{"$f":"'West of Aldergrove - Analysis'!C91","v":41496},{"$f":"'West of Aldergrove - Analysis'!D91","v":45942},{"$f":"'West of Aldergrove - Analysis'!E91","v":44460},{"$f":"'West of Aldergrove - Analysis'!F91","v":45942},{"$f":"'West of Aldergrove - Analysis'!G91","v":44460},{"$f":"'West of Aldergrove - Analysis'!H91","v":45942},{"$f":"'West of Aldergrove - Analysis'!I91","v":45942},{"$f":"'West of Aldergrove - Analysis'!J91","v":44460},{"$f":"'West of Aldergrove - Analysis'!K91","v":45942},{"$f":"'West of Aldergrove - Analysis'!L91","v":44460},{"$f":"'West of Aldergrove - Analysis'!M91","v":45942},{"$f":"'West of Aldergrove - Analysis'!N91","v":540930}]
[{"$f":"'West of Aldergrove - Analysis'!A122","v":"GW outflow to Hopington C (m3)"},{"$f":"'West of Aldergrove - Analysis'!B122","v":45942},{"$f":"'West of Aldergrove - Analysis'!C122","v":41496},{"$f":"'West of Aldergrove - Analysis'!D122","v":45942},{"$f":"'West of Aldergrove - Analysis'!E122","v":44460},{"$f":"'West of Aldergrove - Analysis'!F122","v":45942},{"$f":"'West of Aldergrove - Analysis'!G122","v":44460},{"$f":"'West of Aldergrove - Analysis'!H122","v":45942},{"$f":"'West of Aldergrove - Analysis'!I122","v":45942},{"$f":"'West of Aldergrove - Analysis'!J122","v":44460},{"$f":"'West of Aldergrove - Analysis'!K122","v":45942},{"$f":"'West of Aldergrove - Analysis'!L122","v":44460},{"$f":"'West of Aldergrove - Analysis'!M122","v":45942},{"$f":"'West of Aldergrove - Analysis'!N122","v":540930}]
[{"$f":"'S of Murrayville AC - Analysis'!A60","v":"GW outflow to Langley Upland Intertill aquifer (m3)"},{"$f":"'S of Murrayville AC - Analysis'!B60","v":19313},{"$f":"'S of Murrayville AC - Analysis'!C60","v":17444},{"$f":"'S of Murrayville AC - Analysis'!D60","v":19313},{"$f":"'S of Murrayville AC - Analysis'!E60","v":18690},{"$f":"'S of Murrayville AC - Analysis'!F60","v":19313},{"$f":"'S of Murrayville AC - Analysis'!G60","v":18690},{"$f":"'S of Murrayville AC - Analysis'!H60","v":19313},{"$f":"'S of Murrayville AC - Analysis'!I60","v":19313},{"$f":"'S of Murrayville AC - Analysis'!J60","v":18690},{"$f":"'S of Murrayville AC - Analysis'!K60","v":19313},{"$f":"'S of Murrayville AC - Analysis'!L60","v":18690},{"$f":"'S of Murrayville AC - Analysis'!M60","v":19313},{"$f":"'S of Murrayville AC - Analysis'!N60","v":227395}]
[{"$f":"'S of Murrayville AC - Analysis'!A86","v":"GW outflow to Langley Upland Intertill aquifer (m3)"},{"$f":"'S of Murrayville AC - Analysis'!B86","v":19313},{"$f":"'S of Murrayville AC - Analysis'!C86","v":17444},{"$f":"'S of Murrayville AC - Analysis'!D86","v":19313},{"$f":"'S of Murrayville AC - Analysis'!E86","v":18690},{"$f":"'S of Murrayville AC - Analysis'!F86","v":19313},{"$f":"'S of Murrayville AC - Analysis'!G86","v":18690},{"$f":"'S of Murrayville AC - Analysis'!H86","v":19313},{"$f":"'S of Murrayville AC - Analysis'!I86","v":19313},{"$f":"'S of Murrayville AC - Analysis'!J86","v":18690},{"$f":"'S of Murrayville AC - Analysis'!K86","v":19313},{"$f":"'S of Murrayville AC - Analysis'!L86","v":18690},{"$f":"'S of Murrayville AC - Analysis'!M86","v":19313},{"$f":"'S of Murrayville AC - Analysis'!N86","v":227395}]
[{"$f":"'S of Murrayville AC - Analysis'!A112","v":"GW outflow to Langley Upland Intertill aquifer (m3)"},{"$f":"'S of Murrayville AC - Analysis'!B112","v":19313},{"$f":"'S of Murrayville AC - Analysis'!C112","v":17444},{"$f":"'S of Murrayville AC - Analysis'!D112","v":19313},{"$f":"'S of Murrayville AC - Analysis'!E112","v":18690},{"$f":"'S of Murrayville AC - Analysis'!F112","v":19313},{"$f":"'S of Murrayville AC - Analysis'!G112","v":18690},{"$f":"'S of Murrayville AC - Analysis'!H112","v":19313},{"$f":"'S of Murrayville AC - Analysis'!I112","v":19313},{"$f":"'S of Murrayville AC - Analysis'!J112","v":18690},{"$f":"'S of Murrayville AC - Analysis'!K112","v":19313},{"$f":"'S of Murrayville AC - Analysis'!L112","v":18690},{"$f":"'S of Murrayville AC - Analysis'!M112","v":19313},{"$f":"'S of Murrayville AC - Analysis'!N112","v":227395}]
["","","","","","","","","","","","","",""]
["","","","","","","","","","","","","",""]
["","","","","","","","","","","","","",""]
[{"$f":"'Nicomekl Serpentine - Analysis'!A60","v":"GW outflow from pumping  - ICI - Trin. W. College (m3)"},{"$f":"'Nicomekl Serpentine - Analysis'!B60","v":13154.951812210829},{"$f":"'Nicomekl Serpentine - Analysis'!C60","v":13190.601409895324},{"$f":"'Nicomekl Serpentine - Analysis'!D60","v":14070.976777796321},{"$f":"'Nicomekl Serpentine - Analysis'!E60","v":14656.772569965533},{"$f":"'Nicomekl Serpentine - Analysis'!F60","v":15062.774793305844},{"$f":"'Nicomekl Serpentine - Analysis'!G60","v":17222.744739579357},{"$f":"'Nicomekl Serpentine - Analysis'!H60","v":20089.149029117867},{"$f":"'Nicomekl Serpentine - Analysis'!I60","v":17951.89450779949},{"$f":"'Nicomekl Serpentine - Analysis'!J60","v":15943.585637590199},{"$f":"'Nicomekl Serpentine - Analysis'!K60","v":14300.352277900891},{"$f":"'Nicomekl Serpentine - Analysis'!L60","v":13610.059105362008},{"$f":"'Nicomekl Serpentine - Analysis'!M60","v":13246.137339476325},{"$f":"'Nicomekl Serpentine - Analysis'!N60","v":182499.99999999997}]
[{"$f":"'Nicomekl Serpentine - Analysis'!A86","v":"GW outflow from pumping  - ICI - Trin. W. College (m3)"},{"$f":"'Nicomekl Serpentine - Analysis'!B86","v":13154.951812210829},{"$f":"'Nicomekl Serpentine - Analysis'!C86","v":13190.601409895324},{"$f":"'Nicomekl Serpentine - Analysis'!D86","v":14070.976777796321},{"$f":"'Nicomekl Serpentine - Analysis'!E86","v":14656.772569965533},{"$f":"'Nicomekl Serpentine - Analysis'!F86","v":15062.774793305844},{"$f":"'Nicomekl Serpentine - Analysis'!G86","v":17222.744739579357},{"$f":"'Nicomekl Serpentine - Analysis'!H86","v":20089.149029117867},{"$f":"'Nicomekl Serpentine - Analysis'!I86","v":17951.89450779949},{"$f":"'Nicomekl Serpentine - Analysis'!J86","v":15943.585637590199},{"$f":"'Nicomekl Serpentine - Analysis'!K86","v":14300.352277900891},{"$f":"'Nicomekl Serpentine - Analysis'!L86","v":13610.059105362008},{"$f":"'Nicomekl Serpentine - Analysis'!M86","v":13246.137339476325},{"$f":"'Nicomekl Serpentine - Analysis'!N86","v":182499.99999999997}]
[{"$f":"'Nicomekl Serpentine - Analysis'!A112","v":"GW outflow from pumping  - ICI - Trin. W. College (m3)"},{"$f":"'Nicomekl Serpentine - Analysis'!B112","v":13154.951812210829},{"$f":"'Nicomekl Serpentine - Analysis'!C112","v":13190.601409895324},{"$f":"'Nicomekl Serpentine - Analysis'!D112","v":14070.976777796321},{"$f":"'Nicomekl Serpentine - Analysis'!E112","v":14656.772569965533},{"$f":"'Nicomekl Serpentine - Analysis'!F112","v":15062.774793305844},{"$f":"'Nicomekl Serpentine - Analysis'!G112","v":17222.744739579357},{"$f":"'Nicomekl Serpentine - Analysis'!H112","v":20089.149029117867},{"$f":"'Nicomekl Serpentine - Analysis'!I112","v":17951.89450779949},{"$f":"'Nicomekl Serpentine - Analysis'!J112","v":15943.585637590199},{"$f":"'Nicomekl Serpentine - Analysis'!K112","v":14300.352277900891},{"$f":"'Nicomekl Serpentine - Analysis'!L112","v":13610.059105362008},{"$f":"'Nicomekl Serpentine - Analysis'!M112","v":13246.137339476325},{"$f":"'Nicomekl Serpentine - Analysis'!N112","v":182499.99999999997}]
[]
[]
[]
[]
[]
[]
[]
[]
[]
["ROW 4 OUTFLOW"]
[{"$f":"'Hopington AB - Analysis'!A61","v":"GW outflow from pumping - Private minor users (m3)"},{"$f":"'Hopington AB - Analysis'!B61","v":131450.69236799999},{"$f":"'Hopington AB - Analysis'!C61","v":128377.9842885},{"$f":"'Hopington AB - Analysis'!D61","v":126947.3781765},{"$f":"'Hopington AB - Analysis'!E61","v":135319.51899300001},{"$f":"'Hopington AB - Analysis'!F61","v":157395.90345449996},{"$f":"'Hopington AB - Analysis'!G61","v":163193.9849565},{"$f":"'Hopington AB - Analysis'!H61","v":167052.4947105},{"$f":"'Hopington AB - Analysis'!I61","v":151159.35493499998},{"$f":"'Hopington AB - Analysis'!J61","v":153300.1056675},{"$f":"'Hopington AB - Analysis'!K61","v":136155.18554399998},{"$f":"'Hopington AB - Analysis'!L61","v":133682.57546099997},{"$f":"'Hopington AB - Analysis'!M61","v":135445.04092349997},{"$f":"'Hopington AB - Analysis'!N61","v":1719480.2194784998}]
[{"$f":"'Hopington AB - Analysis'!A87","v":"GW outflow from pumping - Private minor users (m3)"},{"$f":"'Hopington AB - Analysis'!B87","v":131450.69236799999},{"$f":"'Hopington AB - Analysis'!C87","v":128377.9842885},{"$f":"'Hopington AB - Analysis'!D87","v":126947.3781765},{"$f":"'Hopington AB - Analysis'!E87","v":135319.51899300001},{"$f":"'Hopington AB - Analysis'!F87","v":157395.90345449996},{"$f":"'Hopington AB - Analysis'!G87","v":163193.9849565},{"$f":"'Hopington AB - Analysis'!H87","v":167052.4947105},{"$f":"'Hopington AB - Analysis'!I87","v":151159.35493499998},{"$f":"'Hopington AB - Analysis'!J87","v":153300.1056675},{"$f":"'Hopington AB - Analysis'!K87","v":136155.18554399998},{"$f":"'Hopington AB - Analysis'!L87","v":133682.57546099997},{"$f":"'Hopington AB - Analysis'!M87","v":135445.04092349997},{"$f":"'Hopington AB - Analysis'!N87","v":1719480.2194784998}]
[{"$f":"'Hopington AB - Analysis'!A113","v":"GW outflow from pumping - Private minor users (m3)"},{"$f":"'Hopington AB - Analysis'!B113","v":131450.69236799999},{"$f":"'Hopington AB - Analysis'!C113","v":128377.9842885},{"$f":"'Hopington AB - Analysis'!D113","v":126947.3781765},{"$f":"'Hopington AB - Analysis'!E113","v":135319.51899300001},{"$f":"'Hopington AB - Analysis'!F113","v":157395.90345449996},{"$f":"'Hopington AB - Analysis'!G113","v":163193.9849565},{"$f":"'Hopington AB - Analysis'!H113","v":167052.4947105},{"$f":"'Hopington AB - Analysis'!I113","v":151159.35493499998},{"$f":"'Hopington AB - Analysis'!J113","v":153300.1056675},{"$f":"'Hopington AB - Analysis'!K113","v":136155.18554399998},{"$f":"'Hopington AB - Analysis'!L113","v":133682.57546099997},{"$f":"'Hopington AB - Analysis'!M113","v":135445.04092349997},{"$f":"'Hopington AB - Analysis'!N113","v":1719480.2194784998}]
[{"$f":"'Fort Langley - Analysis'!A61","v":"GW outflow to Salmon River (m3)"},{"$f":"'Fort Langley - Analysis'!B61","v":59875.9},{"$f":"'Fort Langley - Analysis'!C61","v":52635.143976070998},{"$f":"'Fort Langley - Analysis'!D61","v":51410.117326927917},{"$f":"'Fort Langley - Analysis'!E61","v":48824.935327975596},{"$f":"'Fort Langley - Analysis'!F61","v":45200.093359192659},{"$f":"'Fort Langley - Analysis'!G61","v":43187.579211852935},{"$f":"'Fort Langley - Analysis'!H61","v":44495.400180673787},{"$f":"'Fort Langley - Analysis'!I61","v":44393.338003122946},{"$f":"'Fort Langley - Analysis'!J61","v":43705.240594860501},{"$f":"'Fort Langley - Analysis'!K61","v":46096.038526289114},{"$f":"'Fort Langley - Analysis'!L61","v":51559.650513301865},{"$f":"'Fort Langley - Analysis'!M61","v":58547.731315401499},{"$f":"'Fort Langley - Analysis'!N61","v":589931.16833566991}]
[{"$f":"'Fort Langley - Analysis'!A87","v":"GW outflow to Salmon River (m3)"},{"$f":"'Fort Langley - Analysis'!B87","v":71875.899999999994},{"$f":"'Fort Langley - Analysis'!C87","v":43573.584083683651},{"$f":"'Fort Langley - Analysis'!D87","v":48544.233051916068},{"$f":"'Fort Langley - Analysis'!E87","v":44888.243528984181},{"$f":"'Fort Langley - Analysis'!F87","v":43951.611355878958},{"$f":"'Fort Langley - Analysis'!G87","v":41810.322958842764},{"$f":"'Fort Langley - Analysis'!H87","v":43224.456516851817},{"$f":"'Fort Langley - Analysis'!I87","v":43082.530263599547},{"$f":"'Fort Langley - Analysis'!J87","v":42362.445805975112},{"$f":"'Fort Langley - Analysis'!K87","v":43617.64767194372},{"$f":"'Fort Langley - Analysis'!L87","v":43034.269862014073},{"$f":"'Fort Langley - Analysis'!M87","v":44502.99549512149},{"$f":"'Fort Langley - Analysis'!N87","v":554468.24059481139}]
[{"$f":"'Fort Langley - Analysis'!A113","v":"GW outflow to Salmon River (m3)"},{"$f":"'Fort Langley - Analysis'!B113","v":71875.899999999994},{"$f":"'Fort Langley - Analysis'!C113","v":62804.879200320531},{"$f":"'Fort Langley - Analysis'!D113","v":49579.027361096538},{"$f":"'Fort Langley - Analysis'!E113","v":52773.550152045798},{"$f":"'Fort Langley - Analysis'!F113","v":41980.284700113552},{"$f":"'Fort Langley - Analysis'!G113","v":42303.154622784117},{"$f":"'Fort Langley - Analysis'!H113","v":43101.248600866471},{"$f":"'Fort Langley - Analysis'!I113","v":43113.332242595883},{"$f":"'Fort Langley - Analysis'!J113","v":42354.745311226034},{"$f":"'Fort Langley - Analysis'!K113","v":46038.654872979831},{"$f":"'Fort Langley - Analysis'!L113","v":55459.088280680291},{"$f":"'Fort Langley - Analysis'!M113","v":65726.450948950223},{"$f":"'Fort Langley - Analysis'!N113","v":617110.31629365939}]
[{"$f":"'Beaver River - Analysis'!A61","v":"GW outflow to Nathan Creek (m3)"},{"$f":"'Beaver River - Analysis'!B61","v":413341},{"$f":"'Beaver River - Analysis'!C61","v":373416.84126589162},{"$f":"'Beaver River - Analysis'!D61","v":412862.81541005056},{"$f":"'Beaver River - Analysis'!E61","v":399772.55378629162},{"$f":"'Beaver River - Analysis'!F61","v":412728.50676052034},{"$f":"'Beaver River - Analysis'!G61","v":399465.06760745472},{"$f":"'Beaver River - Analysis'!H61","v":411930.98108612851},{"$f":"'Beaver River - Analysis'!I61","v":411223.58853326907},{"$f":"'Beaver River - Analysis'!J61","v":398625.04039326566},{"$f":"'Beaver River - Analysis'!K61","v":412378.22005034814},{"$f":"'Beaver River - Analysis'!L61","v":399724.11739584361},{"$f":"'Beaver River - Analysis'!M61","v":413062.52740562911},{"$f":"'Beaver River - Analysis'!N61","v":4858531.2596946927}]
[{"$f":"'Beaver River - Analysis'!A87","v":"GW outflow to Nathan Creek (m3)"},{"$f":"'Beaver River - Analysis'!B87","v":413341},{"$f":"'Beaver River - Analysis'!C87","v":373416.84126589162},{"$f":"'Beaver River - Analysis'!D87","v":412862.81541005056},{"$f":"'Beaver River - Analysis'!E87","v":399772.55378629162},{"$f":"'Beaver River - Analysis'!F87","v":412728.50676052034},{"$f":"'Beaver River - Analysis'!G87","v":399465.06760745472},{"$f":"'Beaver River - Analysis'!H87","v":411930.98108612851},{"$f":"'Beaver River - Analysis'!I87","v":411223.58853326907},{"$f":"'Beaver River - Analysis'!J87","v":398625.04039326566},{"$f":"'Beaver River - Analysis'!K87","v":412378.22005034814},{"$f":"'Beaver River - Analysis'!L87","v":399724.11739584361},{"$f":"'Beaver River - Analysis'!M87","v":413062.52740562911},{"$f":"'Beaver River - Analysis'!N87","v":4858531.2596946927}]
[{"$f":"'Beaver River - Analysis'!A113","v":"GW outflow to Nathan Creek (m3)"},{"$f":"'Beaver River - Analysis'!B113","v":413341},{"$f":"'Beaver River - Analysis'!C113","v":373416.84126589162},{"$f":"'Beaver River - Analysis'!D113","v":412862.81541005056},{"$f":"'Beaver River - Analysis'!E113","v":399772.55378629162},{"$f":"'Beaver River - Analysis'!F113","v":412728.50676052034},{"$f":"'Beaver River - Analysis'!G113","v":399465.06760745472},{"$f":"'Beaver River - Analysis'!H113","v":411930.98108612851},{"$f":"'Beaver River - Analysis'!I113","v":411223.58853326907},{"$f":"'Beaver River - Analysis'!J113","v":398625.04039326566},{"$f":"'Beaver River - Analysis'!K113","v":412378.22005034814},{"$f":"'Beaver River - Analysis'!L113","v":399724.11739584361},{"$f":"'Beaver River - Analysis'!M113","v":413062.52740562911},{"$f":"'Beaver River - Analysis'!N113","v":4858531.2596946927}]
[{"$f":"'West of Aldergrove - Analysis'!A61","v":"GW outflow to South of Hopington (m3)"},{"$f":"'West of Aldergrove - Analysis'!B61","v":1829},{"$f":"'West of Aldergrove - Analysis'!C61","v":1652},{"$f":"'West of Aldergrove - Analysis'!D61","v":1829},{"$f":"'West of Aldergrove - Analysis'!E61","v":1770},{"$f":"'West of Aldergrove - Analysis'!F61","v":1829},{"$f":"'West of Aldergrove - Analysis'!G61","v":1770},{"$f":"'West of Aldergrove - Analysis'!H61","v":1829},{"$f":"'West of Aldergrove - Analysis'!I61","v":1829},{"$f":"'West of Aldergrove - Analysis'!J61","v":1770},{"$f":"'West of Aldergrove - Analysis'!K61","v":1829},{"$f":"'West of Aldergrove - Analysis'!L61","v":1770},{"$f":"'West of Aldergrove - Analysis'!M61","v":1829},{"$f":"'West of Aldergrove - Analysis'!N61","v":21535}]
[{"$f":"'West of Aldergrove - Analysis'!A92","v":"GW outflow to South of Hopington (m3)"},{"$f":"'West of Aldergrove - Analysis'!B92","v":1829},{"$f":"'West of Aldergrove - Analysis'!C92","v":1652},{"$f":"'West of Aldergrove - Analysis'!D92","v":1829},{"$f":"'West of Aldergrove - Analysis'!E92","v":1770},{"$f":"'West of Aldergrove - Analysis'!F92","v":1829},{"$f":"'West of Aldergrove - Analysis'!G92","v":1770},{"$f":"'West of Aldergrove - Analysis'!H92","v":1829},{"$f":"'West of Aldergrove - Analysis'!I92","v":1829},{"$f":"'West of Aldergrove - Analysis'!J92","v":1770},{"$f":"'West of Aldergrove - Analysis'!K92","v":1829},{"$f":"'West of Aldergrove - Analysis'!L92","v":1770},{"$f":"'West of Aldergrove - Analysis'!M92","v":1829},{"$f":"'West of Aldergrove - Analysis'!N92","v":21535}]
[{"$f":"'West of Aldergrove - Analysis'!A123","v":"GW outflow to South of Hopington (m3)"},{"$f":"'West of Aldergrove - Analysis'!B123","v":1829},{"$f":"'West of Aldergrove - Analysis'!C123","v":1652},{"$f":"'West of Aldergrove - Analysis'!D123","v":1829},{"$f":"'West of Aldergrove - Analysis'!E123","v":1770},{"$f":"'West of Aldergrove - Analysis'!F123","v":1829},{"$f":"'West of Aldergrove - Analysis'!G123","v":1770},{"$f":"'West of Aldergrove - Analysis'!H123","v":1829},{"$f":"'West of Aldergrove - Analysis'!I123","v":1829},{"$f":"'West of Aldergrove - Analysis'!J123","v":1770},{"$f":"'West of Aldergrove - Analysis'!K123","v":1829},{"$f":"'West of Aldergrove - Analysis'!L123","v":1770},{"$f":"'West of Aldergrove - Analysis'!M123","v":1829},{"$f":"'West of Aldergrove - Analysis'!N123","v":21535}]
[{"$f":"'S of Murrayville AC - Analysis'!A61","v":"GW outflow from pumping - Muni - Murrayville 1 (m3) "},{"$f":"'S of Murrayville AC - Analysis'!B61","v":8223.0887382576584},{"$f":"'S of Murrayville AC - Analysis'!C61","v":9613.4337886834164},{"$f":"'S of Murrayville AC - Analysis'!D61","v":9427.6576358964212},{"$f":"'S of Murrayville AC - Analysis'!E61","v":11694.940943704665},{"$f":"'S of Murrayville AC - Analysis'!F61","v":16098.2428866599},{"$f":"'S of Murrayville AC - Analysis'!G61","v":19685.621744055075},{"$f":"'S of Murrayville AC - Analysis'!H61","v":21452.453659812945},{"$f":"'S of Murrayville AC - Analysis'!I61","v":18683.662606386068},{"$f":"'S of Murrayville AC - Analysis'!J61","v":15001.885028124792},{"$f":"'S of Murrayville AC - Analysis'!K61","v":11779.750864434878},{"$f":"'S of Murrayville AC - Analysis'!L61","v":9606.2341592328485},{"$f":"'S of Murrayville AC - Analysis'!M61","v":10063.027944751298},{"$f":"'S of Murrayville AC - Analysis'!N61","v":161329.99999999994}]
[{"$f":"'S of Murrayville AC - Analysis'!A87","v":"GW outflow from pumping - Muni - Murrayville 1 (m3) "},{"$f":"'S of Murrayville AC - Analysis'!B87","v":8223.0887382576584},{"$f":"'S of Murrayville AC - Analysis'!C87","v":9613.4337886834164},{"$f":"'S of Murrayville AC - Analysis'!D87","v":9427.6576358964212},{"$f":"'S of Murrayville AC - Analysis'!E87","v":11694.940943704665},{"$f":"'S of Murrayville AC - Analysis'!F87","v":16098.2428866599},{"$f":"'S of Murrayville AC - Analysis'!G87","v":19685.621744055075},{"$f":"'S of Murrayville AC - Analysis'!H87","v":21452.453659812945},{"$f":"'S of Murrayville AC - Analysis'!I87","v":18683.662606386068},{"$f":"'S of Murrayville AC - Analysis'!J87","v":15001.885028124792},{"$f":"'S of Murrayville AC - Analysis'!K87","v":11779.750864434878},{"$f":"'S of Murrayville AC - Analysis'!L87","v":9606.2341592328485},{"$f":"'S of Murrayville AC - Analysis'!M87","v":10063.027944751298},{"$f":"'S of Murrayville AC - Analysis'!N87","v":161329.99999999994}]
[{"$f":"'S of Murrayville AC - Analysis'!A113","v":"GW outflow from pumping - Muni - Murrayville 1 (m3) "},{"$f":"'S of Murrayville AC - Analysis'!B113","v":8223.0887382576584},{"$f":"'S of Murrayville AC - Analysis'!C113","v":9613.4337886834164},{"$f":"'S of Murrayville AC - Analysis'!D113","v":9427.6576358964212},{"$f":"'S of Murrayville AC - Analysis'!E113","v":11694.940943704665},{"$f":"'S of Murrayville AC - Analysis'!F113","v":16098.2428866599},{"$f":"'S of Murrayville AC - Analysis'!G113","v":19685.621744055075},{"$f":"'S of Murrayville AC - Analysis'!H113","v":21452.453659812945},{"$f":"'S of Murrayville AC - Analysis'!I113","v":18683.662606386068},{"$f":"'S of Murrayville AC - Analysis'!J113","v":15001.885028124792},{"$f":"'S of Murrayville AC - Analysis'!K113","v":11779.750864434878},{"$f":"'S of Murrayville AC - Analysis'!L113","v":9606.2341592328485},{"$f":"'S of Murrayville AC - Analysis'!M113","v":10063.027944751298},{"$f":"'S of Murrayville AC - Analysis'!N113","v":161329.99999999994}]
["","","","","","","","","","","","","",""]
["","","","","","","","","","","","","",""]
["","","","","","","","","","","","","",""]
["","","","","","","","","","","","","",""]
["","","","","","","","","","","","","",""]
["","","","","","","","","","","","","",""]
[]
[]
[]
[]
[]
[]
[]
[]
[]
["ROW 5 OUTFLOW"]
[{"$f":"'Hopington AB - Analysis'!A62","v":"GW outflow to SW (m3) - Nicomekl R. / Bertrand Ck."},{"$f":"'Hopington AB - Analysis'!B62","v":108979},{"$f":"'Hopington AB - Analysis'!C62","v":90405.815353876867},{"$f":"'Hopington AB - Analysis'!D62","v":89296.152690548668},{"$f":"'Hopington AB - Analysis'!E62","v":80593.337999264491},{"$f":"'Hopington AB - Analysis'!F62","v":73018.432042230066},{"$f":"'Hopington AB - Analysis'!G62","v":69774.825754212245},{"$f":"'Hopington AB - Analysis'!H62","v":72763.353620357098},{"$f":"'Hopington AB - Analysis'!I62","v":72223.043275743083},{"$f":"'Hopington AB - Analysis'!J62","v":69953.676872642871},{"$f":"'Hopington AB - Analysis'!K62","v":75653.035626182158},{"$f":"'Hopington AB - Analysis'!L62","v":86852.787852389272},{"$f":"'Hopington AB - Analysis'!M62","v":104129.2696453104},{"$f":"'Hopington AB - Analysis'!N62","v":993642.73073275725}]
[{"$f":"'Hopington AB - Analysis'!A88","v":"GW outflow to SW (m3) - Nicomekl R. / Bertrand Ck."},{"$f":"'Hopington AB - Analysis'!B88","v":104979},{"$f":"'Hopington AB - Analysis'!C88","v":71623.858834379862},{"$f":"'Hopington AB - Analysis'!D88","v":80461.740818031263},{"$f":"'Hopington AB - Analysis'!E88","v":73112.666699541267},{"$f":"'Hopington AB - Analysis'!F88","v":72477.065431684314},{"$f":"'Hopington AB - Analysis'!G88","v":69555.736528248104},{"$f":"'Hopington AB - Analysis'!H88","v":72550.676268980533},{"$f":"'Hopington AB - Analysis'!I88","v":72094.361146929674},{"$f":"'Hopington AB - Analysis'!J88","v":69716.045221533044},{"$f":"'Hopington AB - Analysis'!K88","v":72689.878973256287},{"$f":"'Hopington AB - Analysis'!L88","v":69874.286342535561},{"$f":"'Hopington AB - Analysis'!M88","v":72989.832053513164},{"$f":"'Hopington AB - Analysis'!N88","v":902125.14831863309}]
[{"$f":"'Hopington AB - Analysis'!A114","v":"GW outflow to SW (m3) - Nicomekl R. / Bertrand Ck."},{"$f":"'Hopington AB - Analysis'!B114","v":131479},{"$f":"'Hopington AB - Analysis'!C114","v":116837.371491527},{"$f":"'Hopington AB - Analysis'!D114","v":89466.302110936565},{"$f":"'Hopington AB - Analysis'!E114","v":91421.216038155282},{"$f":"'Hopington AB - Analysis'!F114","v":69730.783030892213},{"$f":"'Hopington AB - Analysis'!G114","v":69967.678888366921},{"$f":"'Hopington AB - Analysis'!H114","v":72488.884914962706},{"$f":"'Hopington AB - Analysis'!I114","v":72103.629850032346},{"$f":"'Hopington AB - Analysis'!J114","v":69714.654916067651},{"$f":"'Hopington AB - Analysis'!K114","v":78078.303840989727},{"$f":"'Hopington AB - Analysis'!L114","v":98088.947335226621},{"$f":"'Hopington AB - Analysis'!M114","v":122949.04404410429},{"$f":"'Hopington AB - Analysis'!N114","v":1082325.8164612614}]
["","","","","","","","","","","","","",""]
["","","","","","","","","","","","","",""]
["","","","","","","","","","","","","",""]
[{"$f":"'Beaver River - Analysis'!A62","v":"GW outflow from pumping - ICI - W. Creek Springs (m3)"},{"$f":"'Beaver River - Analysis'!B62","v":83349.774682167816},{"$f":"'Beaver River - Analysis'!C62","v":83575.650533096763},{"$f":"'Beaver River - Analysis'!D62","v":89153.708864117492},{"$f":"'Beaver River - Analysis'!E62","v":92865.311003301613},{"$f":"'Beaver River - Analysis'!F62","v":95437.741090385825},{"$f":"'Beaver River - Analysis'!G62","v":109123.31066997482},{"$f":"'Beaver River - Analysis'!H62","v":127284.8482484908},{"$f":"'Beaver River - Analysis'!I62","v":113743.20360141757},{"$f":"'Beaver River - Analysis'!J62","v":101018.5585997715},{"$f":"'Beaver River - Analysis'!K62","v":90607.032032780044},{"$f":"'Beaver River - Analysis'!L62","v":86233.334491573682},{"$f":"'Beaver River - Analysis'!M62","v":83927.526182921996},{"$f":"'Beaver River - Analysis'!N62","v":1156320}]
[{"$f":"'Beaver River - Analysis'!A88","v":"GW outflow from pumping - ICI - W. Creek Springs (m3)"},{"$f":"'Beaver River - Analysis'!B88","v":83349.774682167816},{"$f":"'Beaver River - Analysis'!C88","v":83575.650533096763},{"$f":"'Beaver River - Analysis'!D88","v":89153.708864117492},{"$f":"'Beaver River - Analysis'!E88","v":92865.311003301613},{"$f":"'Beaver River - Analysis'!F88","v":95437.741090385825},{"$f":"'Beaver River - Analysis'!G88","v":109123.31066997482},{"$f":"'Beaver River - Analysis'!H88","v":127284.8482484908},{"$f":"'Beaver River - Analysis'!I88","v":113743.20360141757},{"$f":"'Beaver River - Analysis'!J88","v":101018.5585997715},{"$f":"'Beaver River - Analysis'!K88","v":90607.032032780044},{"$f":"'Beaver River - Analysis'!L88","v":86233.334491573682},{"$f":"'Beaver River - Analysis'!M88","v":83927.526182921996},{"$f":"'Beaver River - Analysis'!N88","v":1156320}]
[{"$f":"'Beaver River - Analysis'!A114","v":"GW outflow from pumping - ICI - W. Creek Springs (m3)"},{"$f":"'Beaver River - Analysis'!B114","v":83349.774682167816},{"$f":"'Beaver River - Analysis'!C114","v":83575.650533096763},{"$f":"'Beaver River - Analysis'!D114","v":89153.708864117492},{"$f":"'Beaver River - Analysis'!E114","v":92865.311003301613},{"$f":"'Beaver River - Analysis'!F114","v":95437.741090385825},{"$f":"'Beaver River - Analysis'!G114","v":109123.31066997482},{"$f":"'Beaver River - Analysis'!H114","v":127284.8482484908},{"$f":"'Beaver River - Analysis'!I114","v":113743.20360141757},{"$f":"'Beaver River - Analysis'!J114","v":101018.5585997715},{"$f":"'Beaver River - Analysis'!K114","v":90607.032032780044},{"$f":"'Beaver River - Analysis'!L114","v":86233.334491573682},{"$f":"'Beaver River - Analysis'!M114","v":83927.526182921996},{"$f":"'Beaver River - Analysis'!N114","v":1156320}]
[{"$f":"'West of Aldergrove - Analysis'!A62","v":"GW outflow to Langley Upland Intertill (m3)"},{"$f":"'West of Aldergrove - Analysis'!B62","v":3379},{"$f":"'West of Aldergrove - Analysis'!C62","v":3052},{"$f":"'West of Aldergrove - Analysis'!D62","v":3379},{"$f":"'West of Aldergrove - Analysis'!E62","v":3270},{"$f":"'West of Aldergrove - Analysis'!F62","v":3379},{"$f":"'West of Aldergrove - Analysis'!G62","v":3270},{"$f":"'West of Aldergrove - Analysis'!H62","v":3379},{"$f":"'West of Aldergrove - Analysis'!I62","v":3379},{"$f":"'West of Aldergrove - Analysis'!J62","v":3270},{"$f":"'West of Aldergrove - Analysis'!K62","v":3379},{"$f":"'West of Aldergrove - Analysis'!L62","v":3270},{"$f":"'West of Aldergrove - Analysis'!M62","v":3379},{"$f":"'West of Aldergrove - Analysis'!N62","v":39785}]
[{"$f":"'West of Aldergrove - Analysis'!A93","v":"GW outflow to Langley Upland Intertill (m3)"},{"$f":"'West of Aldergrove - Analysis'!B93","v":3379},{"$f":"'West of Aldergrove - Analysis'!C93","v":3052},{"$f":"'West of Aldergrove - Analysis'!D93","v":3379},{"$f":"'West of Aldergrove - Analysis'!E93","v":3270},{"$f":"'West of Aldergrove - Analysis'!F93","v":3379},{"$f":"'West of Aldergrove - Analysis'!G93","v":3270},{"$f":"'West of Aldergrove - Analysis'!H93","v":3379},{"$f":"'West of Aldergrove - Analysis'!I93","v":3379},{"$f":"'West of Aldergrove - Analysis'!J93","v":3270},{"$f":"'West of Aldergrove - Analysis'!K93","v":3379},{"$f":"'West of Aldergrove - Analysis'!L93","v":3270},{"$f":"'West of Aldergrove - Analysis'!M93","v":3379},{"$f":"'West of Aldergrove - Analysis'!N93","v":39785}]
[{"$f":"'West of Aldergrove - Analysis'!A124","v":"GW outflow to Langley Upland Intertill (m3)"},{"$f":"'West of Aldergrove - Analysis'!B124","v":3379},{"$f":"'West of Aldergrove - Analysis'!C124","v":3052},{"$f":"'West of Aldergrove - Analysis'!D124","v":3379},{"$f":"'West of Aldergrove - Analysis'!E124","v":3270},{"$f":"'West of Aldergrove - Analysis'!F124","v":3379},{"$f":"'West of Aldergrove - Analysis'!G124","v":3270},{"$f":"'West of Aldergrove - Analysis'!H124","v":3379},{"$f":"'West of Aldergrove - Analysis'!I124","v":3379},{"$f":"'West of Aldergrove - Analysis'!J124","v":3270},{"$f":"'West of Aldergrove - Analysis'!K124","v":3379},{"$f":"'West of Aldergrove - Analysis'!L124","v":3270},{"$f":"'West of Aldergrove - Analysis'!M124","v":3379},{"$f":"'West of Aldergrove - Analysis'!N124","v":39785}]
["","","","","","","","","","","","","",""]
["","","","","","","","","","","","","",""]
["","","","","","","","","","","","","",""]
["","","","","","","","","","","","","",""]
["","","","","","","","","","","","","",""]
["","","","","","","","","","","","","",""]
["","","","","","","","","","","","","",""]
["","","","","","","","","","","","","",""]
["","","","","","","","","","","","","",""]
[]
[]
[]
[]
[]
[]
[]
[]
[]
["ROW 6 OUTFLOW"]
[{"$f":"'Hopington AB - Analysis'!A63","v":"GW outflow to Salmon River System (m3)"},{"$f":"'Hopington AB - Analysis'!B63","v":987707},{"$f":"'Hopington AB - Analysis'!C63","v":784069.5969540946},{"$f":"'Hopington AB - Analysis'!D63","v":780727.599041712},{"$f":"'Hopington AB - Analysis'!E63","v":708435.18926677632},{"$f":"'Hopington AB - Analysis'!F63","v":649026.04106895241},{"$f":"'Hopington AB - Analysis'!G63","v":620903.59019317187},{"$f":"'Hopington AB - Analysis'!H63","v":646962.22474652564},{"$f":"'Hopington AB - Analysis'!I63","v":642590.62286737585},{"$f":"'Hopington AB - Analysis'!J63","v":622350.65833320143},{"$f":"'Hopington AB - Analysis'!K63","v":670342.37915729196},{"$f":"'Hopington AB - Analysis'!L63","v":759079.8289875132},{"$f":"'Hopington AB - Analysis'!M63","v":900740.99985751137},{"$f":"'Hopington AB - Analysis'!N63","v":8772935.7304741256}]
[{"$f":"'Hopington AB - Analysis'!A89","v":"GW outflow to Salmon River System (m3)"},{"$f":"'Hopington AB - Analysis'!B89","v":952707},{"$f":"'Hopington AB - Analysis'!C89","v":632106.49420543713},{"$f":"'Hopington AB - Analysis'!D89","v":709249.17570952571},{"$f":"'Hopington AB - Analysis'!E89","v":647909.75784174295},{"$f":"'Hopington AB - Analysis'!F89","v":644645.89303817297},{"$f":"'Hopington AB - Analysis'!G89","v":619130.95918309828},{"$f":"'Hopington AB - Analysis'!H89","v":645241.47163084254},{"$f":"'Hopington AB - Analysis'!I89","v":641549.46746152185},{"$f":"'Hopington AB - Analysis'!J89","v":620428.00224694924},{"$f":"'Hopington AB - Analysis'!K89","v":646367.74805634632},{"$f":"'Hopington AB - Analysis'!L89","v":621708.31677142403},{"$f":"'Hopington AB - Analysis'!M89","v":648794.64116024296},{"$f":"'Hopington AB - Analysis'!N89","v":8029838.9273053044}]
[{"$f":"'Hopington AB - Analysis'!A115","v":"GW outflow to Salmon River System (m3)"},{"$f":"'Hopington AB - Analysis'!B115","v":1212707},{"$f":"'Hopington AB - Analysis'!C115","v":997924.91479508206},{"$f":"'Hopington AB - Analysis'!D115","v":782104.26253394131},{"$f":"'Hopington AB - Analysis'!E115","v":796042.56612689269},{"$f":"'Hopington AB - Analysis'!F115","v":622425.9717954006},{"$f":"'Hopington AB - Analysis'!G115","v":622463.94736951415},{"$f":"'Hopington AB - Analysis'!H115","v":644741.52340288018},{"$f":"'Hopington AB - Analysis'!I115","v":641624.45969571627},{"$f":"'Hopington AB - Analysis'!J115","v":620416.75341182004},{"$f":"'Hopington AB - Analysis'!K115","v":689965.00380437134},{"$f":"'Hopington AB - Analysis'!L115","v":849990.57389410632},{"$f":"'Hopington AB - Analysis'!M115","v":1053010.0836295711},{"$f":"'Hopington AB - Analysis'!N115","v":9533417.0604592972}]
["","","","","","","","","","","","","",""]
["","","","","","","","","","","","","",""]
["","","","","","","","","","","","","",""]
["","","","","","","","","","","","","",""]
["","","","","","","","","","","","","",""]
["","","","","","","","","","","","","",""]
[{"$f":"'West of Aldergrove - Analysis'!A63","v":"GW outflow to South of Murrayville B (m3)"},{"$f":"'West of Aldergrove - Analysis'!B63","v":8339},{"$f":"'West of Aldergrove - Analysis'!C63","v":7532},{"$f":"'West of Aldergrove - Analysis'!D63","v":8339},{"$f":"'West of Aldergrove - Analysis'!E63","v":8070},{"$f":"'West of Aldergrove - Analysis'!F63","v":8339},{"$f":"'West of Aldergrove - Analysis'!G63","v":8070},{"$f":"'West of Aldergrove - Analysis'!H63","v":8339},{"$f":"'West of Aldergrove - Analysis'!I63","v":8339},{"$f":"'West of Aldergrove - Analysis'!J63","v":8070},{"$f":"'West of Aldergrove - Analysis'!K63","v":8339},{"$f":"'West of Aldergrove - Analysis'!L63","v":8070},{"$f":"'West of Aldergrove - Analysis'!M63","v":8339},{"$f":"'West of Aldergrove - Analysis'!N63","v":98185}]
[{"$f":"'West of Aldergrove - Analysis'!A94","v":"GW outflow to South of Murrayville B (m3)"},{"$f":"'West of Aldergrove - Analysis'!B94","v":8339},{"$f":"'West of Aldergrove - Analysis'!C94","v":7532},{"$f":"'West of Aldergrove - Analysis'!D94","v":8339},{"$f":"'West of Aldergrove - Analysis'!E94","v":8070},{"$f":"'West of Aldergrove - Analysis'!F94","v":8339},{"$f":"'West of Aldergrove - Analysis'!G94","v":8070},{"$f":"'West of Aldergrove - Analysis'!H94","v":8339},{"$f":"'West of Aldergrove - Analysis'!I94","v":8339},{"$f":"'West of Aldergrove - Analysis'!J94","v":8070},{"$f":"'West of Aldergrove - Analysis'!K94","v":8339},{"$f":"'West of Aldergrove - Analysis'!L94","v":8070},{"$f":"'West of Aldergrove - Analysis'!M94","v":8339},{"$f":"'West of Aldergrove - Analysis'!N94","v":98185}]
[{"$f":"'West of Aldergrove - Analysis'!A125","v":"GW outflow to South of Murrayville B (m3)"},{"$f":"'West of Aldergrove - Analysis'!B125","v":8339},{"$f":"'West of Aldergrove - Analysis'!C125","v":7532},{"$f":"'West of Aldergrove - Analysis'!D125","v":8339},{"$f":"'West of Aldergrove - Analysis'!E125","v":8070},{"$f":"'West of Aldergrove - Analysis'!F125","v":8339},{"$f":"'West of Aldergrove - Analysis'!G125","v":8070},{"$f":"'West of Aldergrove - Analysis'!H125","v":8339},{"$f":"'West of Aldergrove - Analysis'!I125","v":8339},{"$f":"'West of Aldergrove - Analysis'!J125","v":8070},{"$f":"'West of Aldergrove - Analysis'!K125","v":8339},{"$f":"'West of Aldergrove - Analysis'!L125","v":8070},{"$f":"'West of Aldergrove - Analysis'!M125","v":8339},{"$f":"'West of Aldergrove - Analysis'!N125","v":98185}]
["","","","","","","","","","","","","",""]
["","","","","","","","","","","","","",""]
["","","","","","","","","","","","","",""]
["","","","","","","","","","","","","",""]
["","","","","","","","","","","","","",""]
["","","","","","","","","","","","","",""]
["","","","","","","","","","","","","",""]
["","","","","","","","","","","","","",""]
[]
[]
[]
[]
[]
[]
[]
[]
[]
[]
["ROW 7 OUTFLOW"]
["","","","","","","","","","","","","",""]
["","","","","","","","","","","","","",""]
["","","","","","","","","","","","","",""]
["","","","","","","","","","","","","",""]
["","","","","","","","","","","","","",""]
["","","","","","","","","","","","","",""]
["","","","","","","","","","","","","",""]
["","","","","","","","","","","","","",""]
["","","","","","","","","","","","","",""]
[{"$f":"'West of Aldergrove - Analysis'!A64","v":"GW outflow from pumping - Muni - Murrayville 2 (m3)"},{"$f":"'West of Aldergrove - Analysis'!B64","v":22919.76967331559},{"$f":"'West of Aldergrove - Analysis'!C64","v":25928.543174004852},{"$f":"'West of Aldergrove - Analysis'!D64","v":28329.800990124702},{"$f":"'West of Aldergrove - Analysis'!E64","v":35525.415379266233},{"$f":"'West of Aldergrove - Analysis'!F64","v":41986.544348512885},{"$f":"'West of Aldergrove - Analysis'!G64","v":49579.875650037866},{"$f":"'West of Aldergrove - Analysis'!H64","v":59978.230655945066},{"$f":"'West of Aldergrove - Analysis'!I64","v":58955.943563159817},{"$f":"'West of Aldergrove - Analysis'!J64","v":48683.876552972448},{"$f":"'West of Aldergrove - Analysis'!K64","v":32984.286125635554},{"$f":"'West of Aldergrove - Analysis'!L64","v":25192.976347697666},{"$f":"'West of Aldergrove - Analysis'!M64","v":24359.737539327252},{"$f":"'West of Aldergrove - Analysis'!N64","v":454424.99999999994}]
[{"$f":"'West of Aldergrove - Analysis'!A95","v":"GW outflow from pumping - Muni - Murrayville 2 (m3)"},{"$f":"'West of Aldergrove - Analysis'!B95","v":22919.76967331559},{"$f":"'West of Aldergrove - Analysis'!C95","v":25928.543174004852},{"$f":"'West of Aldergrove - Analysis'!D95","v":28329.800990124702},{"$f":"'West of Aldergrove - Analysis'!E95","v":35525.415379266233},{"$f":"'West of Aldergrove - Analysis'!F95","v":41986.544348512885},{"$f":"'West of Aldergrove - Analysis'!G95","v":49579.875650037866},{"$f":"'West of Aldergrove - Analysis'!H95","v":59978.230655945066},{"$f":"'West of Aldergrove - Analysis'!I95","v":58955.943563159817},{"$f":"'West of Aldergrove - Analysis'!J95","v":48683.876552972448},{"$f":"'West of Aldergrove - Analysis'!K95","v":32984.286125635554},{"$f":"'West of Aldergrove - Analysis'!L95","v":25192.976347697666},{"$f":"'West of Aldergrove - Analysis'!M95","v":24359.737539327252},{"$f":"'West of Aldergrove - Analysis'!N95","v":454424.99999999994}]
[{"$f":"'West of Aldergrove - Analysis'!A126","v":"GW outflow from pumping - Muni - Murrayville 2 (m3)"},{"$f":"'West of Aldergrove - Analysis'!B126","v":22919.76967331559},{"$f":"'West of Aldergrove - Analysis'!C126","v":25928.543174004852},{"$f":"'West of Aldergrove - Analysis'!D126","v":28329.800990124702},{"$f":"'West of Aldergrove - Analysis'!E126","v":35525.415379266233},{"$f":"'West of Aldergrove - Analysis'!F126","v":41986.544348512885},{"$f":"'West of Aldergrove - Analysis'!G126","v":49579.875650037866},{"$f":"'West of Aldergrove - Analysis'!H126","v":59978.230655945066},{"$f":"'West of Aldergrove - Analysis'!I126","v":58955.943563159817},{"$f":"'West of Aldergrove - Analysis'!J126","v":48683.876552972448},{"$f":"'West of Aldergrove - Analysis'!K126","v":32984.286125635554},{"$f":"'West of Aldergrove - Analysis'!L126","v":25192.976347697666},{"$f":"'West of Aldergrove - Analysis'!M126","v":24359.737539327252},{"$f":"'West of Aldergrove - Analysis'!N126","v":454424.99999999994}]
["","","","","","","","","","","","","",""]
["","","","","","","","","","","","","",""]
["","","","","","","","","","","","","",""]
["","","","","","","","","","","","","",""]
["","","","","","","","","","","","","",""]
["","","","","","","","","","","","","",""]
["","","","","","","","","","","","","",""]
["","","","","","","","","","","","","",""]
["","","","","","","","","","","","","",""]
[]
[]
[]
[]
[]
[]
[]
[]
[]
["ROW 8 OUTFLOW"]
["","","","","","","","","","","","","",""]
["","","","","","","","","","","","","",""]
["","","","","","","","","","","","","",""]
["","","","","","","","","","","","","",""]
["","","","","","","","","","","","","",""]
["","","","","","","","","","","","","",""]
["","","","","","","","","","","","","",""]
["","","","","","","","","","","","","",""]
["","","","","","","","","","","","","",""]
[{"$f":"'West of Aldergrove - Analysis'!A65","v":"GW outflow from pumping - Muni - Tall Timbers (m3)"},{"$f":"'West of Aldergrove - Analysis'!B65","v":2021.9944396672759},{"$f":"'West of Aldergrove - Analysis'!C65","v":1546.0162721452007},{"$f":"'West of Aldergrove - Analysis'!D65","v":1609.0413924927132},{"$f":"'West of Aldergrove - Analysis'!E65","v":1696.6464198974147},{"$f":"'West of Aldergrove - Analysis'!F65","v":2012.6669443283777},{"$f":"'West of Aldergrove - Analysis'!G65","v":3278.3805568451357},{"$f":"'West of Aldergrove - Analysis'!H65","v":3245.5588938687838},{"$f":"'West of Aldergrove - Analysis'!I65","v":1741.2939344367803},{"$f":"'West of Aldergrove - Analysis'!J65","v":1708.8863292119981},{"$f":"'West of Aldergrove - Analysis'!K65","v":1108.5711096317011},{"$f":"'West of Aldergrove - Analysis'!L65","v":1551.4318147233655},{"$f":"'West of Aldergrove - Analysis'!M65","v":1474.5118927512549},{"$f":"'West of Aldergrove - Analysis'!N65","v":22995}]
[{"$f":"'West of Aldergrove - Analysis'!A96","v":"GW outflow from pumping - Muni - Tall Timbers (m3)"},{"$f":"'West of Aldergrove - Analysis'!B96","v":2021.9944396672759},{"$f":"'West of Aldergrove - Analysis'!C96","v":1546.0162721452007},{"$f":"'West of Aldergrove - Analysis'!D96","v":1609.0413924927132},{"$f":"'West of Aldergrove - Analysis'!E96","v":1696.6464198974147},{"$f":"'West of Aldergrove - Analysis'!F96","v":2012.6669443283777},{"$f":"'West of Aldergrove - Analysis'!G96","v":3278.3805568451357},{"$f":"'West of Aldergrove - Analysis'!H96","v":3245.5588938687838},{"$f":"'West of Aldergrove - Analysis'!I96","v":1741.2939344367803},{"$f":"'West of Aldergrove - Analysis'!J96","v":1708.8863292119981},{"$f":"'West of Aldergrove - Analysis'!K96","v":1108.5711096317011},{"$f":"'West of Aldergrove - Analysis'!L96","v":1551.4318147233655},{"$f":"'West of Aldergrove - Analysis'!M96","v":1474.5118927512549},{"$f":"'West of Aldergrove - Analysis'!N96","v":22995}]
[{"$f":"'West of Aldergrove - Analysis'!A127","v":"GW outflow from pumping - Muni - Tall Timbers (m3)"},{"$f":"'West of Aldergrove - Analysis'!B127","v":2021.9944396672759},{"$f":"'West of Aldergrove - Analysis'!C127","v":1546.0162721452007},{"$f":"'West of Aldergrove - Analysis'!D127","v":1609.0413924927132},{"$f":"'West of Aldergrove - Analysis'!E127","v":1696.6464198974147},{"$f":"'West of Aldergrove - Analysis'!F127","v":2012.6669443283777},{"$f":"'West of Aldergrove - Analysis'!G127","v":3278.3805568451357},{"$f":"'West of Aldergrove - Analysis'!H127","v":3245.5588938687838},{"$f":"'West of Aldergrove - Analysis'!I127","v":1741.2939344367803},{"$f":"'West of Aldergrove - Analysis'!J127","v":1708.8863292119981},{"$f":"'West of Aldergrove - Analysis'!K127","v":1108.5711096317011},{"$f":"'West of Aldergrove - Analysis'!L127","v":1551.4318147233655},{"$f":"'West of Aldergrove - Analysis'!M127","v":1474.5118927512549},{"$f":"'West of Aldergrove - Analysis'!N127","v":22995}]
["","","","","","","","","","","","","",""]
["","","","","","","","","","","","","",""]
["","","","","","","","","","","","","",""]
["","","","","","","","","","","","","",""]
["","","","","","","","","","","","","",""]
["","","","","","","","","","","","","",""]
["","","","","","","","","","","","","",""]
["","","","","","","","","","","","","",""]
["","","","","","","","","","","","","",""]
[]
[]
[]
[]
[]
[]
[]
[]
[]
["ROW 9 OUTFLOW"]
["","","","","","","","","","","","","",""]
["","","","","","","","","","","","","",""]
["","","","","","","","","","","","","",""]
["","","","","","","","","","","","","",""]
["","","","","","","","","","","","","",""]
["","","","","","","","","","","","","",""]
["","","","","","","","","","","","","",""]
["","","","","","","","","","","","","",""]
["","","","","","","","","","","","","",""]
[{"$f":"'West of Aldergrove - Analysis'!A66","v":"GW outflow from pumping - Muni - Acadia 1 (m3)"},{"$f":"'West of Aldergrove - Analysis'!B66","v":501.0647907833071},{"$f":"'West of Aldergrove - Analysis'!C66","v":524.61636024997961},{"$f":"'West of Aldergrove - Analysis'!D66","v":491.81490648861734},{"$f":"'West of Aldergrove - Analysis'!E66","v":596.23082715900398},{"$f":"'West of Aldergrove - Analysis'!F66","v":718.89911746333019},{"$f":"'West of Aldergrove - Analysis'!G66","v":1130.9214113640455},{"$f":"'West of Aldergrove - Analysis'!H66","v":1536.5391062977233},{"$f":"'West of Aldergrove - Analysis'!I66","v":1237.8581042175128},{"$f":"'West of Aldergrove - Analysis'!J66","v":742.81987540957857},{"$f":"'West of Aldergrove - Analysis'!K66","v":567.02236189013092},{"$f":"'West of Aldergrove - Analysis'!L66","v":550.840107941067},{"$f":"'West of Aldergrove - Analysis'!M66","v":526.37303073570445},{"$f":"'West of Aldergrove - Analysis'!N66","v":9125}]
[{"$f":"'West of Aldergrove - Analysis'!A97","v":"GW outflow from pumping - Muni - Acadia 1 (m3)"},{"$f":"'West of Aldergrove - Analysis'!B97","v":501.0647907833071},{"$f":"'West of Aldergrove - Analysis'!C97","v":524.61636024997961},{"$f":"'West of Aldergrove - Analysis'!D97","v":491.81490648861734},{"$f":"'West of Aldergrove - Analysis'!E97","v":596.23082715900398},{"$f":"'West of Aldergrove - Analysis'!F97","v":718.89911746333019},{"$f":"'West of Aldergrove - Analysis'!G97","v":1130.9214113640455},{"$f":"'West of Aldergrove - Analysis'!H97","v":1536.5391062977233},{"$f":"'West of Aldergrove - Analysis'!I97","v":1237.8581042175128},{"$f":"'West of Aldergrove - Analysis'!J97","v":742.81987540957857},{"$f":"'West of Aldergrove - Analysis'!K97","v":567.02236189013092},{"$f":"'West of Aldergrove - Analysis'!L97","v":550.840107941067},{"$f":"'West of Aldergrove - Analysis'!M97","v":526.37303073570445},{"$f":"'West of Aldergrove - Analysis'!N97","v":9125}]
[{"$f":"'West of Aldergrove - Analysis'!A128","v":"GW outflow from pumping - Muni - Acadia 1 (m3)"},{"$f":"'West of Aldergrove - Analysis'!B128","v":501.0647907833071},{"$f":"'West of Aldergrove - Analysis'!C128","v":524.61636024997961},{"$f":"'West of Aldergrove - Analysis'!D128","v":491.81490648861734},{"$f":"'West of Aldergrove - Analysis'!E128","v":596.23082715900398},{"$f":"'West of Aldergrove - Analysis'!F128","v":718.89911746333019},{"$f":"'West of Aldergrove - Analysis'!G128","v":1130.9214113640455},{"$f":"'West of Aldergrove - Analysis'!H128","v":1536.5391062977233},{"$f":"'West of Aldergrove - Analysis'!I128","v":1237.8581042175128},{"$f":"'West of Aldergrove - Analysis'!J128","v":742.81987540957857},{"$f":"'West of Aldergrove - Analysis'!K128","v":567.02236189013092},{"$f":"'West of Aldergrove - Analysis'!L128","v":550.840107941067},{"$f":"'West of Aldergrove - Analysis'!M128","v":526.37303073570445},{"$f":"'West of Aldergrove - Analysis'!N128","v":9125}]
["","","","","","","","","","","","","",""]
["","","","","","","","","","","","","",""]
["","","","","","","","","","","","","",""]
["","","","","","","","","","","","","",""]
["","","","","","","","","","","","","",""]
["","","","","","","","","","","","","",""]
["","","","","","","","","","","","","",""]
["","","","","","","","","","","","","",""]
["","","","","","","","","","","","","",""]
[]
[]
[]
[]
[]
[]
[]
[]
[]
["ROW 10 OUTFLOW"]
["","","","","","","","","","","","","",""]
["","","","","","","","","","","","","",""]
["","","","","","","","","","","","","",""]
["","","","","","","","","","","","","",""]
["","","","","","","","","","","","","",""]
["","","","","","","","","","","","","",""]
["","","","","","","","","","","","","",""]
["","","","","","","","","","","","","",""]
["","","","","","","","","","","","","",""]
[{"$f":"'West of Aldergrove - Analysis'!A67","v":"GW outflow - ICI - Britco, Poppy Est., Spring Valley (m3)"},{"$f":"'West of Aldergrove - Analysis'!B67","v":71378.768533055962},{"$f":"'West of Aldergrove - Analysis'!C67","v":71572.203250092018},{"$f":"'West of Aldergrove - Analysis'!D67","v":76349.119996322843},{"$f":"'West of Aldergrove - Analysis'!E67","v":79527.647964632983},{"$f":"'West of Aldergrove - Analysis'!F67","v":81730.616028477511},{"$f":"'West of Aldergrove - Analysis'!G67","v":93450.612956957601},{"$f":"'West of Aldergrove - Analysis'!H67","v":109003.72263199354},{"$f":"'West of Aldergrove - Analysis'!I67","v":97406.979599320024},{"$f":"'West of Aldergrove - Analysis'!J67","v":86509.895669564416},{"$f":"'West of Aldergrove - Analysis'!K67","v":77593.711459890226},{"$f":"'West of Aldergrove - Analysis'!L67","v":73848.180705694249},{"$f":"'West of Aldergrove - Analysis'!M67","v":71873.541203998539},{"$f":"'West of Aldergrove - Analysis'!N67","v":990244.99999999977}]
[{"$f":"'West of Aldergrove - Analysis'!A98","v":"GW outflow - ICI - Britco, Poppy Est., Spring Valley (m3)"},{"$f":"'West of Aldergrove - Analysis'!B98","v":71378.768533055962},{"$f":"'West of Aldergrove - Analysis'!C98","v":71572.203250092018},{"$f":"'West of Aldergrove - Analysis'!D98","v":76349.119996322843},{"$f":"'West of Aldergrove - Analysis'!E98","v":79527.647964632983},{"$f":"'West of Aldergrove - Analysis'!F98","v":81730.616028477511},{"$f":"'West of Aldergrove - Analysis'!G98","v":93450.612956957601},{"$f":"'West of Aldergrove - Analysis'!H98","v":109003.72263199354},{"$f":"'West of Aldergrove - Analysis'!I98","v":97406.979599320024},{"$f":"'West of Aldergrove - Analysis'!J98","v":86509.895669564416},{"$f":"'West of Aldergrove - Analysis'!K98","v":77593.711459890226},{"$f":"'West of Aldergrove - Analysis'!L98","v":73848.180705694249},{"$f":"'West of Aldergrove - Analysis'!M98","v":71873.541203998539},{"$f":"'West of Aldergrove - Analysis'!N98","v":990244.99999999977}]
[{"$f":"'West of Aldergrove - Analysis'!A129","v":"GW outflow - ICI - Britco, Poppy Est., Spring Valley (m3)"},{"$f":"'West of Aldergrove - Analysis'!B129","v":71378.768533055962},{"$f":"'West of Aldergrove - Analysis'!C129","v":71572.203250092018},{"$f":"'West of Aldergrove - Analysis'!D129","v":76349.119996322843},{"$f":"'West of Aldergrove - Analysis'!E129","v":79527.647964632983},{"$f":"'West of Aldergrove - Analysis'!F129","v":81730.616028477511},{"$f":"'West of Aldergrove - Analysis'!G129","v":93450.612956957601},{"$f":"'West of Aldergrove - Analysis'!H129","v":109003.72263199354},{"$f":"'West of Aldergrove - Analysis'!I129","v":97406.979599320024},{"$f":"'West of Aldergrove - Analysis'!J129","v":86509.895669564416},{"$f":"'West of Aldergrove - Analysis'!K129","v":77593.711459890226},{"$f":"'West of Aldergrove - Analysis'!L129","v":73848.180705694249},{"$f":"'West of Aldergrove - Analysis'!M129","v":71873.541203998539},{"$f":"'West of Aldergrove - Analysis'!N129","v":990244.99999999977}]
["","","","","","","","","","","","","",""]
["","","","","","","","","","","","","",""]
["","","","","","","","","","","","","",""]
["","","","","","","","","","","","","",""]
["","","","","","","","","","","","","",""]
["","","","","","","","","","","","","",""]
["","","","","","","","","","","","","",""]
["","","","","","","","","","","","","",""]
["","","","","","","","","","","","","",""]
[]
[]
[]
[]
[]
[]
[]
[]
[]
["ROW 11 OUTFLOW"]
["","","","","","","","","","","","","",""]
["","","","","","","","","","","","","",""]
["","","","","","","","","","","","","",""]
["","","","","","","","","","","","","",""]
["","","","","","","","","","","","","",""]
["","","","","","","","","","","","","",""]
["","","","","","","","","","","","","",""]
["","","","","","","","","","","","","",""]
["","","","","","","","","","","","","",""]
["","","","","","","","","","","","","",""]
["","","","","","","","","","","","","",""]
["","","","","","","","","","","","","",""]
["","","","","","","","","","","","","",""]
["","","","","","","","","","","","","",""]
["","","","","","","","","","","","","",""]
["","","","","","","","","","","","","",""]
["","","","","","","","","","","","","",""]
["","","","","","","","","","","","","",""]
["","","","","","","","","","","","","",""]
["","","","","","","","","","","","","",""]
["","","","","","","","","","","","","",""]

{"sheet":"Equivalent GW Change","index":18,"n_rows":61,"n_cols":30,"rows_kept":61,"cut":false,"hidden":true,"merged":[]}
[]
[]
[]
[]
[]
[]
[]
[]
[]
[null,null,null,null,null,null,null,null,null,null,null,null,null,null,null,null,"RESULT"]
["GROUNDWATER LEVEL CHANGE ROW 1",null,null,null,null,null,null,null,null,null,null,null,null,null,null,"col number",1,2,3,4,5,6,7,8,9,10,11,12,13,14]
["INFLOW SOURCE / TYPE","JAN","FEB","MAR","APR","MAY","JUN","JUL","AUG","SEP","OCT","NOV","DEC","ANNUAL",null,null,"EQ. GWL CHANGE","JAN","FEB","MAR","APR","MAY","JUN","JUL","AUG","SEP","OCT","NOV","DEC","ANNUAL"]
[{"$f":"'Hopington AB - Analysis'!A68","v":"Equivalent GWL Change Across Aquifer (m) "},{"$f":"'Hopington AB - Analysis'!B68","v":0.36983203999432984},{"$f":"'Hopington AB - Analysis'!C68","v":0.13511600763734635},{"$f":"'Hopington AB - Analysis'!D68","v":-1.7194892338110793E-2},{"$f":"'Hopington AB - Analysis'!E68","v":-0.27852278655155144},{"$f":"'Hopington AB - Analysis'!F68","v":-0.2921078519989263},{"$f":"'Hopington AB - Analysis'!G68","v":-0.2850046726292586},{"$f":"'Hopington AB - Analysis'!H68","v":-0.29873468583335028},{"$f":"'Hopington AB - Analysis'!I68","v":-0.28756300431629817},{"$f":"'Hopington AB - Analysis'!J68","v":-0.21157396286939456},{"$f":"'Hopington AB - Analysis'!K68","v":0.14186615468875624},{"$f":"'Hopington AB - Analysis'!L68","v":0.51204547729649696},{"$f":"'Hopington AB - Analysis'!M68","v":0.47309954350889821},{"$f":"'Hopington AB - Analysis'!N68","v":-3.8742633411061773E-2},null,null,{"$f":"INDEX($A13:$N30,'Form Control Selectors'!$B$34,Q$11)","v":"Equivalent GWL Change Across Aquifer (m) "},{"$f":"INDEX($A13:$N30,'Form Control Selectors'!$B$34,R$11)","v":0.36983203999432984},{"$f":"INDEX($A13:$N30,'Form Control Selectors'!$B$34,S$11)","v":0.13511600763734635},{"$f":"INDEX($A13:$N30,'Form Control Selectors'!$B$34,T$11)","v":-1.7194892338110793E-2},{"$f":"INDEX($A13:$N30,'Form Control Selectors'!$B$34,U$11)","v":-0.27852278655155144},{"$f":"INDEX($A13:$N30,'Form Control Selectors'!$B$34,V$11)","v":-0.2921078519989263},{"$f":"INDEX($A13:$N30,'Form Control Selectors'!$B$34,W$11)","v":-0.2850046726292586},{"$f":"INDEX($A13:$N30,'Form Control Selectors'!$B$34,X$11)","v":-0.29873468583335028},{"$f":"INDEX($A13:$N30,'Form Control Selectors'!$B$34,Y$11)","v":-0.28756300431629817},{"$f":"INDEX($A13:$N30,'Form Control Selectors'!$B$34,Z$11)","v":-0.21157396286939456},{"$f":"INDEX($A13:$N30,'Form Control Selectors'!$B$34,AA$11)","v":0.14186615468875624},{"$f":"INDEX($A13:$N30,'Form Control Selectors'!$B$34,AB$11)","v":0.51204547729649696},{"$f":"INDEX($A13:$N30,'Form Control Selectors'!$B$34,AC$11)","v":0.47309954350889821},{"$f":"INDEX($A13:$N30,'Form Control Selectors'!$B$34,AD$11)","v":-3.8742633411061773E-2}]
[{"$f":"'Hopington AB - Analysis'!A94","v":"Equivalent GWL Change Across Aquifer (m) "},{"$f":"'Hopington AB - Analysis'!B94","v":-0.10744275879855501},{"$f":"'Hopington AB - Analysis'!C94","v":-8.9378290628771492E-2},{"$f":"'Hopington AB - Analysis'!D94","v":-0.20728882028991125},{"$f":"'Hopington AB - Analysis'!E94","v":-0.29227964089487812},{"$f":"'Hopington AB - Analysis'!F94","v":-0.29767520416115606},{"$f":"'Hopington AB - Analysis'!G94","v":-0.29040909042676999},{"$f":"'Hopington AB - Analysis'!H94","v":-0.30200467195401387},{"$f":"'Hopington AB - Analysis'!I94","v":-0.29360154446266312},{"$f":"'Hopington AB - Analysis'!J94","v":-0.28687176232116657},{"$f":"'Hopington AB - Analysis'!K94","v":-0.2895804245591625},{"$f":"'Hopington AB - Analysis'!L94","v":-0.27924955076518221},{"$f":"'Hopington AB - Analysis'!M94","v":0.34215626865324189},{"$f":"'Hopington AB - Analysis'!N94","v":-2.3936254906089887},null,null,{"$f":"INDEX($A$41:$N$61,'Form Control Selectors'!$B$34,Q$11)","v":"Cumulative GWL Change Across Aquifer (m) "},{"$f":"INDEX($A$41:$N$61,'Form Control Selectors'!$B$34,R$11)","v":0.36983203999432984},{"$f":"INDEX($A$41:$N$61,'Form Control Selectors'!$B$34,S$11)","v":0.50494804763167622},{"$f":"INDEX($A$41:$N$61,'Form Control Selectors'!$B$34,T$11)","v":0.48775315529356544},{"$f":"INDEX($A$41:$N$61,'Form Control Selectors'!$B$34,U$11)","v":0.20923036874201401},{"$f":"INDEX($A$41:$N$61,'Form Control Selectors'!$B$34,V$11)","v":-8.2877483256912299E-2},{"$f":"INDEX($A$41:$N$61,'Form Control Selectors'!$B$34,W$11)","v":-0.3678821558861709},{"$f":"INDEX($A$41:$N$61,'Form Control Selectors'!$B$34,X$11)","v":-0.66661684171952118},{"$f":"INDEX($A$41:$N$61,'Form Control Selectors'!$B$34,Y$11)","v":-0.95417984603581929},{"$f":"INDEX($A$41:$N$61,'Form Control Selectors'!$B$34,Z$11)","v":-1.165753808905214},{"$f":"INDEX($A$41:$N$61,'Form Control Selectors'!$B$34,AA$11)","v":-1.0238876542164577},{"$f":"INDEX($A$41:$N$61,'Form Control Selectors'!$B$34,AB$11)","v":-0.5118421769199607},{"$f":"INDEX($A$41:$N$61,'Form Control Selectors'!$B$34,AC$11)","v":-3.8742633411062488E-2},""]
[{"$f":"'Hopington AB - Analysis'!A120","v":"Equivalent GWL Change Across Aquifer (m) "},{"$f":"'Hopington AB - Analysis'!B120","v":1.0414934627158883},{"$f":"'Hopington AB - Analysis'!C120","v":0.13943973345877825},{"$f":"'Hopington AB - Analysis'!D120","v":0.25795606475205579},{"$f":"'Hopington AB - Analysis'!E120","v":-0.36206637365117317},{"$f":"'Hopington AB - Analysis'!F120","v":-0.28720719424771185},{"$f":"'Hopington AB - Analysis'!G120","v":-0.29197929191378663},{"$f":"'Hopington AB - Analysis'!H120","v":-0.30176914173096137},{"$f":"'Hopington AB - Analysis'!I120","v":-0.29363687399612098},{"$f":"'Hopington AB - Analysis'!J120","v":-0.14994463271736938},{"$f":"'Hopington AB - Analysis'!K120","v":0.42739209288422902},{"$f":"'Hopington AB - Analysis'!L120","v":0.99028127931146159},{"$f":"'Hopington AB - Analysis'!M120","v":0.89031945106801902},{"$f":"'Hopington AB - Analysis'!N120","v":2.0602785759333089}]
[{"$f":"'Fort Langley - Analysis'!A68","v":"Equivalent GWL Change Across Aquifer (m) "},{"$f":"'Fort Langley - Analysis'!B68","v":0.33409056872319265},{"$f":"'Fort Langley - Analysis'!C68","v":6.7568062842958021E-2},{"$f":"'Fort Langley - Analysis'!D68","v":2.4571883423092584E-2},{"$f":"'Fort Langley - Analysis'!E68","v":-0.20592597372121535},{"$f":"'Fort Langley - Analysis'!F68","v":-0.22370143850909169},{"$f":"'Fort Langley - Analysis'!G68","v":-0.23696118114291068},{"$f":"'Fort Langley - Analysis'!H68","v":-0.2414560747317171},{"$f":"'Fort Langley - Analysis'!I68","v":-0.20090324933176998},{"$f":"'Fort Langley - Analysis'!J68","v":-0.1664678876393455},{"$f":"'Fort Langley - Analysis'!K68","v":0.14501075753600304},{"$f":"'Fort Langley - Analysis'!L68","v":0.38191384818723889},{"$f":"'Fort Langley - Analysis'!M68","v":0.3412411399163337},{"$f":"'Fort Langley - Analysis'!N68","v":1.8980455552769976E-2}]
[{"$f":"'Fort Langley - Analysis'!A94","v":"Equivalent GWL Change Across Aquifer (m) "},{"$f":"'Fort Langley - Analysis'!B94","v":-6.4987213490398182E-2},{"$f":"'Fort Langley - Analysis'!C94","v":-5.8647594740828347E-2},{"$f":"'Fort Langley - Analysis'!D94","v":-0.14880292743257115},{"$f":"'Fort Langley - Analysis'!E94","v":-0.26091004213029639},{"$f":"'Fort Langley - Analysis'!F94","v":-0.28435681986929745},{"$f":"'Fort Langley - Analysis'!G94","v":-0.2929344776503468},{"$f":"'Fort Langley - Analysis'!H94","v":-0.29918501454006952},{"$f":"'Fort Langley - Analysis'!I94","v":-0.26004092239030607},{"$f":"'Fort Langley - Analysis'!J94","v":-0.27561804912992138},{"$f":"'Fort Langley - Analysis'!K94","v":-0.2304532953695978},{"$f":"'Fort Langley - Analysis'!L94","v":-0.2366266778917045},{"$f":"'Fort Langley - Analysis'!M94","v":0.42956636649813607},{"$f":"'Fort Langley - Analysis'!N94","v":-1.982996668137202}]
[{"$f":"'Fort Langley - Analysis'!A120","v":"Equivalent GWL Change Across Aquifer (m) "},{"$f":"'Fort Langley - Analysis'!B120","v":0.78197321003338394},{"$f":"'Fort Langley - Analysis'!C120","v":-1.307449001501629E-2},{"$f":"'Fort Langley - Analysis'!D120","v":0.19847179309863133},{"$f":"'Fort Langley - Analysis'!E120","v":-0.34772872226309709},{"$f":"'Fort Langley - Analysis'!F120","v":-0.26265214983609736},{"$f":"'Fort Langley - Analysis'!G120","v":-0.29836064515864708},{"$f":"'Fort Langley - Analysis'!H120","v":-0.29782847266299445},{"$f":"'Fort Langley - Analysis'!I120","v":-0.26038005785957458},{"$f":"'Fort Langley - Analysis'!J120","v":-0.16899510606199478},{"$f":"'Fort Langley - Analysis'!K120","v":0.31674487335778873},{"$f":"'Fort Langley - Analysis'!L120","v":0.69806995646353809},{"$f":"'Fort Langley - Analysis'!M120","v":0.59470808415033016},{"$f":"'Fort Langley - Analysis'!N120","v":0.94094827324625208}]
[{"$f":"'Beaver River - Analysis'!A68","v":"Equivalent GWL Change Across Aquifer (m) "},{"$f":"'Beaver River - Analysis'!B68","v":0.39644366101320405},{"$f":"'Beaver River - Analysis'!C68","v":0.12405783559875569},{"$f":"'Beaver River - Analysis'!D68","v":0.24751330329507892},{"$f":"'Beaver River - Analysis'!E68","v":4.8941141230613355E-2},{"$f":"'Beaver River - Analysis'!F68","v":7.5541167480256965E-2},{"$f":"'Beaver River - Analysis'!G68","v":-0.39710230082297571},{"$f":"'Beaver River - Analysis'!H68","v":-0.79273571964817946},{"$f":"'Beaver River - Analysis'!I68","v":-0.39427271070151787},{"$f":"'Beaver River - Analysis'!J68","v":-0.14696865193056849},{"$f":"'Beaver River - Analysis'!K68","v":0.22042359946509435},{"$f":"'Beaver River - Analysis'!L68","v":0.23575358256662887},{"$f":"'Beaver River - Analysis'!M68","v":0.38807456407855395},{"$f":"'Beaver River - Analysis'!N68","v":5.6694716249511348E-3}]
[{"$f":"'Beaver River - Analysis'!A94","v":"Equivalent GWL Change Across Aquifer (m) "},{"$f":"'Beaver River - Analysis'!B94","v":0.39644366101320405},{"$f":"'Beaver River - Analysis'!C94","v":0.12405783559875569},{"$f":"'Beaver River - Analysis'!D94","v":0.24751330329507892},{"$f":"'Beaver River - Analysis'!E94","v":4.8941141230613355E-2},{"$f":"'Beaver River - Analysis'!F94","v":7.5541167480256965E-2},{"$f":"'Beaver River - Analysis'!G94","v":-0.39710230082297571},{"$f":"'Beaver River - Analysis'!H94","v":-0.79273571964817946},{"$f":"'Beaver River - Analysis'!I94","v":-0.39427271070151787},{"$f":"'Beaver River - Analysis'!J94","v":-0.14696865193056849},{"$f":"'Beaver River - Analysis'!K94","v":0.22042359946509435},{"$f":"'Beaver River - Analysis'!L94","v":0.23575358256662887},{"$f":"'Beaver River - Analysis'!M94","v":0.38807456407855395},{"$f":"'Beaver River - Analysis'!N94","v":5.6694716249511348E-3}]
[{"$f":"'Beaver River - Analysis'!A120","v":"Equivalent GWL Change Across Aquifer (m) "},{"$f":"'Beaver River - Analysis'!B120","v":0.39644366101320405},{"$f":"'Beaver River - Analysis'!C120","v":0.12405783559875569},{"$f":"'Beaver River - Analysis'!D120","v":0.24751330329507892},{"$f":"'Beaver River - Analysis'!E120","v":4.8941141230613355E-2},{"$f":"'Beaver River - Analysis'!F120","v":7.5541167480256965E-2},{"$f":"'Beaver River - Analysis'!G120","v":-0.39710230082297571},{"$f":"'Beaver River - Analysis'!H120","v":-0.79273571964817946},{"$f":"'Beaver River - Analysis'!I120","v":-0.39427271070151787},{"$f":"'Beaver River - Analysis'!J120","v":-0.14696865193056849},{"$f":"'Beaver River - Analysis'!K120","v":0.22042359946509435},{"$f":"'Beaver River - Analysis'!L120","v":0.23575358256662887},{"$f":"'Beaver River - Analysis'!M120","v":0.38807456407855395},{"$f":"'Beaver River - Analysis'!N120","v":5.6694716249511348E-3}]
[{"$f":"'West of Aldergrove - Analysis'!A73","v":"Equivalent GWL Change Across Aquifer (m) "},{"$f":"'West of Aldergrove - Analysis'!B73","v":0.20600867024641323},{"$f":"'West of Aldergrove - Analysis'!C73","v":9.8692292310801094E-2},{"$f":"'West of Aldergrove - Analysis'!D73","v":0.13421213204449375},{"$f":"'West of Aldergrove - Analysis'!E73","v":2.8868488890012135E-2},{"$f":"'West of Aldergrove - Analysis'!F73","v":-7.5971625002286391E-3},{"$f":"'West of Aldergrove - Analysis'!G73","v":-0.18810231128481913},{"$f":"'West of Aldergrove - Analysis'!H73","v":-0.34873144403824863},{"$f":"'West of Aldergrove - Analysis'!I73","v":-0.24475180390147225},{"$f":"'West of Aldergrove - Analysis'!J73","v":-0.11748722730467678},{"$f":"'West of Aldergrove - Analysis'!K73","v":9.4747000309680987E-2},{"$f":"'West of Aldergrove - Analysis'!L73","v":0.14568544357565852},{"$f":"'West of Aldergrove - Analysis'!M73","v":0.19582434270502738},{"$f":"'West of Aldergrove - Analysis'!N73","v":-2.6315789473684214E-3}]
[{"$f":"'West of Aldergrove - Analysis'!A104","v":"Equivalent GWL Change Across Aquifer (m) "},{"$f":"'West of Aldergrove - Analysis'!B104","v":0.20600867024641323},{"$f":"'West of Aldergrove - Analysis'!C104","v":9.8692292310801094E-2},{"$f":"'West of Aldergrove - Analysis'!D104","v":0.13421213204449375},{"$f":"'West of Aldergrove - Analysis'!E104","v":2.8868488890012135E-2},{"$f":"'West of Aldergrove - Analysis'!F104","v":-7.5971625002286391E-3},{"$f":"'West of Aldergrove - Analysis'!G104","v":-0.18810231128481913},{"$f":"'West of Aldergrove - Analysis'!H104","v":-0.34873144403824863},{"$f":"'West of Aldergrove - Analysis'!I104","v":-0.24475180390147225},{"$f":"'West of Aldergrove - Analysis'!J104","v":-0.11748722730467678},{"$f":"'West of Aldergrove - Analysis'!K104","v":9.4747000309680987E-2},{"$f":"'West of Aldergrove - Analysis'!L104","v":0.14568544357565852},{"$f":"'West of Aldergrove - Analysis'!M104","v":0.19582434270502738},{"$f":"'West of Aldergrove - Analysis'!N104","v":-2.6315789473684214E-3}]
[{"$f":"'West of Aldergrove - Analysis'!A135","v":"Equivalent GWL Change Across Aquifer (m) "},{"$f":"'West of Aldergrove - Analysis'!B135","v":0.20600867024641323},{"$f":"'West of Aldergrove - Analysis'!C135","v":9.8692292310801094E-2},{"$f":"'West of Aldergrove - Analysis'!D135","v":0.13421213204449375},{"$f":"'West of Aldergrove - Analysis'!E135","v":2.8868488890012135E-2},{"$f":"'West of Aldergrove - Analysis'!F135","v":-7.5971625002286391E-3},{"$f":"'West of Aldergrove - Analysis'!G135","v":-0.18810231128481913},{"$f":"'West of Aldergrove - Analysis'!H135","v":-0.34873144403824863},{"$f":"'West of Aldergrove - Analysis'!I135","v":-0.24475180390147225},{"$f":"'West of Aldergrove - Analysis'!J135","v":-0.11748722730467678},{"$f":"'West of Aldergrove - Analysis'!K135","v":9.4747000309680987E-2},{"$f":"'West of Aldergrove - Analysis'!L135","v":0.14568544357565852},{"$f":"'West of Aldergrove - Analysis'!M135","v":0.19582434270502738},{"$f":"'West of Aldergrove - Analysis'!N135","v":-2.6315789473684214E-3}]
[{"$f":"'S of Murrayville AC - Analysis'!A68","v":"Equivalent GWL Change Across Aquifer (m) "},{"$f":"'S of Murrayville AC - Analysis'!B68","v":7.4784418970222352E-2},{"$f":"'S of Murrayville AC - Analysis'!C68","v":3.7791836277616737E-2},{"$f":"'S of Murrayville AC - Analysis'!D68","v":5.838903449167733E-2},{"$f":"'S of Murrayville AC - Analysis'!E68","v":2.1506180159184905E-2},{"$f":"'S of Murrayville AC - Analysis'!F68","v":-3.2404285921599593E-2},{"$f":"'S of Murrayville AC - Analysis'!G68","v":-8.7254957724990714E-2},{"$f":"'S of Murrayville AC - Analysis'!H68","v":-0.10528043636603947},{"$f":"'S of Murrayville AC - Analysis'!I68","v":-6.7594427744467153E-2},{"$f":"'S of Murrayville AC - Analysis'!J68","v":-2.3504628122019696E-2},{"$f":"'S of Murrayville AC - Analysis'!K68","v":2.6374699000476558E-2},{"$f":"'S of Murrayville AC - Analysis'!L68","v":4.9935563369636372E-2},{"$f":"'S of Murrayville AC - Analysis'!M68","v":4.9741010688018013E-2},{"$f":"'S of Murrayville AC - Analysis'!N68","v":2.4840070777187966E-3}]
[{"$f":"'S of Murrayville AC - Analysis'!A94","v":"Equivalent GWL Change Across Aquifer (m) "},{"$f":"'S of Murrayville AC - Analysis'!B94","v":7.4784418970222352E-2},{"$f":"'S of Murrayville AC - Analysis'!C94","v":3.7791836277616737E-2},{"$f":"'S of Murrayville AC - Analysis'!D94","v":5.838903449167733E-2},{"$f":"'S of Murrayville AC - Analysis'!E94","v":2.1506180159184905E-2},{"$f":"'S of Murrayville AC - Analysis'!F94","v":-3.2404285921599593E-2},{"$f":"'S of Murrayville AC - Analysis'!G94","v":-8.7254957724990714E-2},{"$f":"'S of Murrayville AC - Analysis'!H94","v":-0.10528043636603947},{"$f":"'S of Murrayville AC - Analysis'!I94","v":-6.7594427744467153E-2},{"$f":"'S of Murrayville AC - Analysis'!J94","v":-2.3504628122019696E-2},{"$f":"'S of Murrayville AC - Analysis'!K94","v":2.6374699000476558E-2},{"$f":"'S of Murrayville AC - Analysis'!L94","v":4.9935563369636372E-2},{"$f":"'S of Murrayville AC - Analysis'!M94","v":4.9741010688018013E-2},{"$f":"'S of Murrayville AC - Analysis'!N94","v":2.4840070777187966E-3}]
[{"$f":"'S of Murrayville AC - Analysis'!A120","v":"Equivalent GWL Change Across Aquifer (m) "},{"$f":"'S of Murrayville AC - Analysis'!B120","v":7.4784418970222352E-2},{"$f":"'S of Murrayville AC - Analysis'!C120","v":3.7791836277616737E-2},{"$f":"'S of Murrayville AC - Analysis'!D120","v":5.838903449167733E-2},{"$f":"'S of Murrayville AC - Analysis'!E120","v":2.1506180159184905E-2},{"$f":"'S of Murrayville AC - Analysis'!F120","v":-3.2404285921599593E-2},{"$f":"'S of Murrayville AC - Analysis'!G120","v":-8.7254957724990714E-2},{"$f":"'S of Murrayville AC - Analysis'!H120","v":-0.10528043636603947},{"$f":"'S of Murrayville AC - Analysis'!I120","v":-6.7594427744467153E-2},{"$f":"'S of Murrayville AC - Analysis'!J120","v":-2.3504628122019696E-2},{"$f":"'S of Murrayville AC - Analysis'!K120","v":2.6374699000476558E-2},{"$f":"'S of Murrayville AC - Analysis'!L120","v":4.9935563369636372E-2},{"$f":"'S of Murrayville AC - Analysis'!M120","v":4.9741010688018013E-2},{"$f":"'S of Murrayville AC - Analysis'!N120","v":2.4840070777187966E-3}]
[{"$f":"'Salmon River - Analysis'!A68","v":"Equivalent GWL Change Across Aquifer (m) "},{"$f":"'Salmon River - Analysis'!B68","v":0},{"$f":"'Salmon River - Analysis'!C68","v":0},{"$f":"'Salmon River - Analysis'!D68","v":0},{"$f":"'Salmon River - Analysis'!E68","v":0},{"$f":"'Salmon River - Analysis'!F68","v":0},{"$f":"'Salmon River - Analysis'!G68","v":0},{"$f":"'Salmon River - Analysis'!H68","v":0},{"$f":"'Salmon River - Analysis'!I68","v":0},{"$f":"'Salmon River - Analysis'!J68","v":0},{"$f":"'Salmon River - Analysis'!K68","v":0},{"$f":"'Salmon River - Analysis'!L68","v":0},{"$f":"'Salmon River - Analysis'!M68","v":0},{"$f":"'Salmon River - Analysis'!N68","v":0}]
[{"$f":"'Salmon River - Analysis'!A94","v":"Equivalent GWL Change Across Aquifer (m) "},{"$f":"'Salmon River - Analysis'!B94","v":0},{"$f":"'Salmon River - Analysis'!C94","v":0},{"$f":"'Salmon River - Analysis'!D94","v":0},{"$f":"'Salmon River - Analysis'!E94","v":0},{"$f":"'Salmon River - Analysis'!F94","v":0},{"$f":"'Salmon River - Analysis'!G94","v":0},{"$f":"'Salmon River - Analysis'!H94","v":0},{"$f":"'Salmon River - Analysis'!I94","v":0},{"$f":"'Salmon River - Analysis'!J94","v":0},{"$f":"'Salmon River - Analysis'!K94","v":0},{"$f":"'Salmon River - Analysis'!L94","v":0},{"$f":"'Salmon River - Analysis'!M94","v":0},{"$f":"'Salmon River - Analysis'!N94","v":0}]
[{"$f":"'Salmon River - Analysis'!A120","v":"Equivalent GWL Change Across Aquifer (m) "},{"$f":"'Salmon River - Analysis'!B120","v":0},{"$f":"'Salmon River - Analysis'!C120","v":0},{"$f":"'Salmon River - Analysis'!D120","v":0},{"$f":"'Salmon River - Analysis'!E120","v":0},{"$f":"'Salmon River - Analysis'!F120","v":0},{"$f":"'Salmon River - Analysis'!G120","v":0},{"$f":"'Salmon River - Analysis'!H120","v":0},{"$f":"'Salmon River - Analysis'!I120","v":0},{"$f":"'Salmon River - Analysis'!J120","v":0},{"$f":"'Salmon River - Analysis'!K120","v":0},{"$f":"'Salmon River - Analysis'!L120","v":0},{"$f":"'Salmon River - Analysis'!M120","v":0},{"$f":"'Salmon River - Analysis'!N120","v":0}]
[{"$f":"'Nicomekl Serpentine - Analysis'!A68","v":"Equivalent GWL Change Across Aquifer (m) "},{"$f":"'Nicomekl Serpentine - Analysis'!B68","v":2.9542053260129018E-2},{"$f":"'Nicomekl Serpentine - Analysis'!C68","v":1.0196505292323689E-2},{"$f":"'Nicomekl Serpentine - Analysis'!D68","v":1.8002308165833106E-2},{"$f":"'Nicomekl Serpentine - Analysis'!E68","v":4.3238527341197888E-3},{"$f":"'Nicomekl Serpentine - Analysis'!F68","v":5.5080020999508693E-3},{"$f":"'Nicomekl Serpentine - Analysis'!G68","v":-2.8001319470641252E-2},{"$f":"'Nicomekl Serpentine - Analysis'!H68","v":-5.7812409033988522E-2},{"$f":"'Nicomekl Serpentine - Analysis'!I68","v":-3.0888063842268804E-2},{"$f":"'Nicomekl Serpentine - Analysis'!J68","v":-1.1886944288112652E-2},{"$f":"'Nicomekl Serpentine - Analysis'!K68","v":1.5112720107066973E-2},{"$f":"'Nicomekl Serpentine - Analysis'!L68","v":1.7509963399322096E-2},{"$f":"'Nicomekl Serpentine - Analysis'!M68","v":2.8393331576259812E-2},{"$f":"'Nicomekl Serpentine - Analysis'!N68","v":0}]
[{"$f":"'Nicomekl Serpentine - Analysis'!A94","v":"Equivalent GWL Change Across Aquifer (m) "},{"$f":"'Nicomekl Serpentine - Analysis'!B94","v":2.9542053260129018E-2},{"$f":"'Nicomekl Serpentine - Analysis'!C94","v":1.0196505292323689E-2},{"$f":"'Nicomekl Serpentine - Analysis'!D94","v":1.8002308165833106E-2},{"$f":"'Nicomekl Serpentine - Analysis'!E94","v":4.3238527341197888E-3},{"$f":"'Nicomekl Serpentine - Analysis'!F94","v":5.5080020999508693E-3},{"$f":"'Nicomekl Serpentine - Analysis'!G94","v":-2.8001319470641252E-2},{"$f":"'Nicomekl Serpentine - Analysis'!H94","v":-5.7812409033988522E-2},{"$f":"'Nicomekl Serpentine - Analysis'!I94","v":-3.0888063842268804E-2},{"$f":"'Nicomekl Serpentine - Analysis'!J94","v":-1.1886944288112652E-2},{"$f":"'Nicomekl Serpentine - Analysis'!K94","v":1.5112720107066973E-2},{"$f":"'Nicomekl Serpentine - Analysis'!L94","v":1.7509963399322096E-2},{"$f":"'Nicomekl Serpentine - Analysis'!M94","v":2.8393331576259812E-2},{"$f":"'Nicomekl Serpentine - Analysis'!N94","v":0}]
[{"$f":"'Nicomekl Serpentine - Analysis'!A120","v":"Equivalent GWL Change Across Aquifer (m) "},{"$f":"'Nicomekl Serpentine - Analysis'!B120","v":2.9542053260129018E-2},{"$f":"'Nicomekl Serpentine - Analysis'!C120","v":1.0196505292323689E-2},{"$f":"'Nicomekl Serpentine - Analysis'!D120","v":1.8002308165833106E-2},{"$f":"'Nicomekl Serpentine - Analysis'!E120","v":4.3238527341197888E-3},{"$f":"'Nicomekl Serpentine - Analysis'!F120","v":5.5080020999508693E-3},{"$f":"'Nicomekl Serpentine - Analysis'!G120","v":-2.8001319470641252E-2},{"$f":"'Nicomekl Serpentine - Analysis'!H120","v":-5.7812409033988522E-2},{"$f":"'Nicomekl Serpentine - Analysis'!I120","v":-3.0888063842268804E-2},{"$f":"'Nicomekl Serpentine - Analysis'!J120","v":-1.1886944288112652E-2},{"$f":"'Nicomekl Serpentine - Analysis'!K120","v":1.5112720107066973E-2},{"$f":"'Nicomekl Serpentine - Analysis'!L120","v":1.7509963399322096E-2},{"$f":"'Nicomekl Serpentine - Analysis'!M120","v":2.8393331576259812E-2},{"$f":"'Nicomekl Serpentine - Analysis'!N120","v":0}]
[]
[]
[]
[]
[]
[]
["GROUNDWATER LEVEL CHANGE ROW 2"]
[{"$f":"'Hopington AB - Analysis'!A69","v":"Cumulative GWL Change Across Aquifer (m) "},{"$f":"'Hopington AB - Analysis'!B69","v":0.36983203999432984},{"$f":"'Hopington AB - Analysis'!C69","v":0.50494804763167622},{"$f":"'Hopington AB - Analysis'!D69","v":0.48775315529356544},{"$f":"'Hopington AB - Analysis'!E69","v":0.20923036874201401},{"$f":"'Hopington AB - Analysis'!F69","v":-8.2877483256912299E-2},{"$f":"'Hopington AB - Analysis'!G69","v":-0.3678821558861709},{"$f":"'Hopington AB - Analysis'!H69","v":-0.66661684171952118},{"$f":"'Hopington AB - Analysis'!I69","v":-0.95417984603581929},{"$f":"'Hopington AB - Analysis'!J69","v":-1.165753808905214},{"$f":"'Hopington AB - Analysis'!K69","v":-1.0238876542164577},{"$f":"'Hopington AB - Analysis'!L69","v":-0.5118421769199607},{"$f":"'Hopington AB - Analysis'!M69","v":-3.8742633411062488E-2}]
[{"$f":"'Hopington AB - Analysis'!A95","v":"Cumulative GWL Change Across Aquifer (m) "},{"$f":"'Hopington AB - Analysis'!B95","v":-0.10744275879855501},{"$f":"'Hopington AB - Analysis'!C95","v":-0.19682104942732651},{"$f":"'Hopington AB - Analysis'!D95","v":-0.40410986971723772},{"$f":"'Hopington AB - Analysis'!E95","v":-0.69638951061211585},{"$f":"'Hopington AB - Analysis'!F95","v":-0.99406471477327196},{"$f":"'Hopington AB - Analysis'!G95","v":-1.284473805200042},{"$f":"'Hopington AB - Analysis'!H95","v":-1.5864784771540559},{"$f":"'Hopington AB - Analysis'!I95","v":-1.8800800216167191},{"$f":"'Hopington AB - Analysis'!J95","v":-2.1669517839378858},{"$f":"'Hopington AB - Analysis'!K95","v":-2.4565322084970482},{"$f":"'Hopington AB - Analysis'!L95","v":-2.7357817592622302},{"$f":"'Hopington AB - Analysis'!M95","v":-2.3936254906089882}]
[{"$f":"'Hopington AB - Analysis'!A121","v":"Cumulative GWL Change Across Aquifer (m) "},{"$f":"'Hopington AB - Analysis'!B121","v":1.0414934627158883},{"$f":"'Hopington AB - Analysis'!C121","v":1.1809331961746665},{"$f":"'Hopington AB - Analysis'!D121","v":1.4388892609267223},{"$f":"'Hopington AB - Analysis'!E121","v":1.0768228872755492},{"$f":"'Hopington AB - Analysis'!F121","v":0.7896156930278373},{"$f":"'Hopington AB - Analysis'!G121","v":0.49763640111405066},{"$f":"'Hopington AB - Analysis'!H121","v":0.1958672593830893},{"$f":"'Hopington AB - Analysis'!I121","v":-9.7769614613031686E-2},{"$f":"'Hopington AB - Analysis'!J121","v":-0.24771424733040107},{"$f":"'Hopington AB - Analysis'!K121","v":0.17967784555382796},{"$f":"'Hopington AB - Analysis'!L121","v":1.1699591248652896},{"$f":"'Hopington AB - Analysis'!M121","v":2.0602785759333084}]
[{"$f":"'Fort Langley - Analysis'!A69","v":"Cumulative GWL Change Across Aquifer (m) "},{"$f":"'Fort Langley - Analysis'!B69","v":0.33409056872319265},{"$f":"'Fort Langley - Analysis'!C69","v":0.40165863156615067},{"$f":"'Fort Langley - Analysis'!D69","v":0.42623051498924325},{"$f":"'Fort Langley - Analysis'!E69","v":0.2203045412680279},{"$f":"'Fort Langley - Analysis'!F69","v":-3.3968972410637899E-3},{"$f":"'Fort Langley - Analysis'!G69","v":-0.24035807838397447},{"$f":"'Fort Langley - Analysis'!H69","v":-0.48181415311569153},{"$f":"'Fort Langley - Analysis'!I69","v":-0.68271740244746149},{"$f":"'Fort Langley - Analysis'!J69","v":-0.84918529008680699},{"$f":"'Fort Langley - Analysis'!K69","v":-0.70417453255080398},{"$f":"'Fort Langley - Analysis'!L69","v":-0.32226068436356509},{"$f":"'Fort Langley - Analysis'!M69","v":1.8980455552768616E-2}]
[{"$f":"'Fort Langley - Analysis'!A95","v":"Cumulative GWL Change Across Aquifer (m) "},{"$f":"'Fort Langley - Analysis'!B95","v":-6.4987213490398182E-2},{"$f":"'Fort Langley - Analysis'!C95","v":-0.12363480823122652},{"$f":"'Fort Langley - Analysis'!D95","v":-0.2724377356637977},{"$f":"'Fort Langley - Analysis'!E95","v":-0.53334777779409404},{"$f":"'Fort Langley - Analysis'!F95","v":-0.81770459766339143},{"$f":"'Fort Langley - Analysis'!G95","v":-1.1106390753137383},{"$f":"'Fort Langley - Analysis'!H95","v":-1.4098240898538079},{"$f":"'Fort Langley - Analysis'!I95","v":-1.6698650122441139},{"$f":"'Fort Langley - Analysis'!J95","v":-1.9454830613740353},{"$f":"'Fort Langley - Analysis'!K95","v":-2.1759363567436329},{"$f":"'Fort Langley - Analysis'!L95","v":-2.4125630346353373},{"$f":"'Fort Langley - Analysis'!M95","v":-1.9829966681372011}]
[{"$f":"'Fort Langley - Analysis'!A121","v":"Cumulative GWL Change Across Aquifer (m) "},{"$f":"'Fort Langley - Analysis'!B121","v":0.78197321003338394},{"$f":"'Fort Langley - Analysis'!C121","v":0.76889872001836768},{"$f":"'Fort Langley - Analysis'!D121","v":0.96737051311699895},{"$f":"'Fort Langley - Analysis'!E121","v":0.61964179085390181},{"$f":"'Fort Langley - Analysis'!F121","v":0.35698964101780445},{"$f":"'Fort Langley - Analysis'!G121","v":5.8628995859157373E-2},{"$f":"'Fort Langley - Analysis'!H121","v":-0.23919947680383707},{"$f":"'Fort Langley - Analysis'!I121","v":-0.49957953466341165},{"$f":"'Fort Langley - Analysis'!J121","v":-0.6685746407254064},{"$f":"'Fort Langley - Analysis'!K121","v":-0.35182976736761767},{"$f":"'Fort Langley - Analysis'!L121","v":0.34624018909592041},{"$f":"'Fort Langley - Analysis'!M121","v":0.94094827324625063}]
[{"$f":"'Beaver River - Analysis'!A69","v":"Cumulative GWL Change Across Aquifer (m) "},{"$f":"'Beaver River - Analysis'!B69","v":0.39644366101320405},{"$f":"'Beaver River - Analysis'!C69","v":0.52050149661195977},{"$f":"'Beaver River - Analysis'!D69","v":0.76801479990703869},{"$f":"'Beaver River - Analysis'!E69","v":0.81695594113765202},{"$f":"'Beaver River - Analysis'!F69","v":0.89249710861790899},{"$f":"'Beaver River - Analysis'!G69","v":0.49539480779493328},{"$f":"'Beaver River - Analysis'!H69","v":-0.29734091185324618},{"$f":"'Beaver River - Analysis'!I69","v":-0.691613622554764},{"$f":"'Beaver River - Analysis'!J69","v":-0.83858227448533251},{"$f":"'Beaver River - Analysis'!K69","v":-0.61815867502023814},{"$f":"'Beaver River - Analysis'!L69","v":-0.38240509245360926},{"$f":"'Beaver River - Analysis'!M69","v":5.6694716249446886E-3}]
[{"$f":"'Beaver River - Analysis'!A95","v":"Cumulative GWL Change Across Aquifer (m) "},{"$f":"'Beaver River - Analysis'!B95","v":0.39644366101320405},{"$f":"'Beaver River - Analysis'!C95","v":0.52050149661195977},{"$f":"'Beaver River - Analysis'!D95","v":0.76801479990703869},{"$f":"'Beaver River - Analysis'!E95","v":0.81695594113765202},{"$f":"'Beaver River - Analysis'!F95","v":0.89249710861790899},{"$f":"'Beaver River - Analysis'!G95","v":0.49539480779493328},{"$f":"'Beaver River - Analysis'!H95","v":-0.29734091185324618},{"$f":"'Beaver River - Analysis'!I95","v":-0.691613622554764},{"$f":"'Beaver River - Analysis'!J95","v":-0.83858227448533251},{"$f":"'Beaver River - Analysis'!K95","v":-0.61815867502023814},{"$f":"'Beaver River - Analysis'!L95","v":-0.38240509245360926},{"$f":"'Beaver River - Analysis'!M95","v":5.6694716249446886E-3}]
[{"$f":"'Beaver River - Analysis'!A121","v":"Cumulative GWL Change Across Aquifer (m) "},{"$f":"'Beaver River - Analysis'!B121","v":0.39644366101320405},{"$f":"'Beaver River - Analysis'!C121","v":0.52050149661195977},{"$f":"'Beaver River - Analysis'!D121","v":0.76801479990703869},{"$f":"'Beaver River - Analysis'!E121","v":0.81695594113765202},{"$f":"'Beaver River - Analysis'!F121","v":0.89249710861790899},{"$f":"'Beaver River - Analysis'!G121","v":0.49539480779493328},{"$f":"'Beaver River - Analysis'!H121","v":-0.29734091185324618},{"$f":"'Beaver River - Analysis'!I121","v":-0.691613622554764},{"$f":"'Beaver River - Analysis'!J121","v":-0.83858227448533251},{"$f":"'Beaver River - Analysis'!K121","v":-0.61815867502023814},{"$f":"'Beaver River - Analysis'!L121","v":-0.38240509245360926},{"$f":"'Beaver River - Analysis'!M121","v":5.6694716249446886E-3}]
[{"$f":"'West of Aldergrove - Analysis'!A74","v":"Cumulative GWL Change Across Aquifer (m) "},{"$f":"'West of Aldergrove - Analysis'!B74","v":0.20600867024641323},{"$f":"'West of Aldergrove - Analysis'!C74","v":0.30470096255721435},{"$f":"'West of Aldergrove - Analysis'!D74","v":0.43891309460170813},{"$f":"'West of Aldergrove - Analysis'!E74","v":0.46778158349172028},{"$f":"'West of Aldergrove - Analysis'!F74","v":0.46018442099149165},{"$f":"'West of Aldergrove - Analysis'!G74","v":0.27208210970667251},{"$f":"'West of Aldergrove - Analysis'!H74","v":-7.6649334331576113E-2},{"$f":"'West of Aldergrove - Analysis'!I74","v":-0.32140113823304839},{"$f":"'West of Aldergrove - Analysis'!J74","v":-0.43888836553772514},{"$f":"'West of Aldergrove - Analysis'!K74","v":-0.34414136522804417},{"$f":"'West of Aldergrove - Analysis'!L74","v":-0.19845592165238565},{"$f":"'West of Aldergrove - Analysis'!M74","v":-2.6315789473582707E-3}]
[{"$f":"'West of Aldergrove - Analysis'!A105","v":"Cumulative GWL Change Across Aquifer (m) "},{"$f":"'West of Aldergrove - Analysis'!B105","v":0.20600867024641323},{"$f":"'West of Aldergrove - Analysis'!C105","v":0.30470096255721435},{"$f":"'West of Aldergrove - Analysis'!D105","v":0.43891309460170813},{"$f":"'West of Aldergrove - Analysis'!E105","v":0.46778158349172028},{"$f":"'West of Aldergrove - Analysis'!F105","v":0.46018442099149165},{"$f":"'West of Aldergrove - Analysis'!G105","v":0.27208210970667251},{"$f":"'West of Aldergrove - Analysis'!H105","v":-7.6649334331576113E-2},{"$f":"'West of Aldergrove - Analysis'!I105","v":-0.32140113823304839},{"$f":"'West of Aldergrove - Analysis'!J105","v":-0.43888836553772514},{"$f":"'West of Aldergrove - Analysis'!K105","v":-0.34414136522804417},{"$f":"'West of Aldergrove - Analysis'!L105","v":-0.19845592165238565},{"$f":"'West of Aldergrove - Analysis'!M105","v":-2.6315789473582707E-3}]
[{"$f":"'West of Aldergrove - Analysis'!A136","v":"Cumulative GWL Change Across Aquifer (m) "},{"$f":"'West of Aldergrove - Analysis'!B136","v":0.20600867024641323},{"$f":"'West of Aldergrove - Analysis'!C136","v":0.30470096255721435},{"$f":"'West of Aldergrove - Analysis'!D136","v":0.43891309460170813},{"$f":"'West of Aldergrove - Analysis'!E136","v":0.46778158349172028},{"$f":"'West of Aldergrove - Analysis'!F136","v":0.46018442099149165},{"$f":"'West of Aldergrove - Analysis'!G136","v":0.27208210970667251},{"$f":"'West of Aldergrove - Analysis'!H136","v":-7.6649334331576113E-2},{"$f":"'West of Aldergrove - Analysis'!I136","v":-0.32140113823304839},{"$f":"'West of Aldergrove - Analysis'!J136","v":-0.43888836553772514},{"$f":"'West of Aldergrove - Analysis'!K136","v":-0.34414136522804417},{"$f":"'West of Aldergrove - Analysis'!L136","v":-0.19845592165238565},{"$f":"'West of Aldergrove - Analysis'!M136","v":-2.6315789473582707E-3}]
[{"$f":"'S of Murrayville AC - Analysis'!A69","v":"Cumulative GWL Change Across Aquifer (m) "},{"$f":"'S of Murrayville AC - Analysis'!B69","v":7.4784418970222352E-2},{"$f":"'S of Murrayville AC - Analysis'!C69","v":0.1125762552478391},{"$f":"'S of Murrayville AC - Analysis'!D69","v":0.17096528973951641},{"$f":"'S of Murrayville AC - Analysis'!E69","v":0.19247146989870131},{"$f":"'S of Murrayville AC - Analysis'!F69","v":0.16006718397710173},{"$f":"'S of Murrayville AC - Analysis'!G69","v":7.281222625211102E-2},{"$f":"'S of Murrayville AC - Analysis'!H69","v":-3.2468210113928447E-2},{"$f":"'S of Murrayville AC - Analysis'!I69","v":-0.1000626378583956},{"$f":"'S of Murrayville AC - Analysis'!J69","v":-0.1235672659804153},{"$f":"'S of Murrayville AC - Analysis'!K69","v":-9.7192566979938749E-2},{"$f":"'S of Murrayville AC - Analysis'!L69","v":-4.7257003610302377E-2},{"$f":"'S of Murrayville AC - Analysis'!M69","v":2.4840070777156359E-3}]
[{"$f":"'S of Murrayville AC - Analysis'!A95","v":"Cumulative GWL Change Across Aquifer (m) "},{"$f":"'S of Murrayville AC - Analysis'!B95","v":7.4784418970222352E-2},{"$f":"'S of Murrayville AC - Analysis'!C95","v":0.1125762552478391},{"$f":"'S of Murrayville AC - Analysis'!D95","v":0.17096528973951641},{"$f":"'S of Murrayville AC - Analysis'!E95","v":0.19247146989870131},{"$f":"'S of Murrayville AC - Analysis'!F95","v":0.16006718397710173},{"$f":"'S of Murrayville AC - Analysis'!G95","v":7.281222625211102E-2},{"$f":"'S of Murrayville AC - Analysis'!H95","v":-3.2468210113928447E-2},{"$f":"'S of Murrayville AC - Analysis'!I95","v":-0.1000626378583956},{"$f":"'S of Murrayville AC - Analysis'!J95","v":-0.1235672659804153},{"$f":"'S of Murrayville AC - Analysis'!K95","v":-9.7192566979938749E-2},{"$f":"'S of Murrayville AC - Analysis'!L95","v":-4.7257003610302377E-2},{"$f":"'S of Murrayville AC - Analysis'!M95","v":2.4840070777156359E-3}]
[{"$f":"'S of Murrayville AC - Analysis'!A121","v":"Cumulative GWL Change Across Aquifer (m) "},{"$f":"'S of Murrayville AC - Analysis'!B121","v":7.4784418970222352E-2},{"$f":"'S of Murrayville AC - Analysis'!C121","v":0.1125762552478391},{"$f":"'S of Murrayville AC - Analysis'!D121","v":0.17096528973951641},{"$f":"'S of Murrayville AC - Analysis'!E121","v":0.19247146989870131},{"$f":"'S of Murrayville AC - Analysis'!F121","v":0.16006718397710173},{"$f":"'S of Murrayville AC - Analysis'!G121","v":7.281222625211102E-2},{"$f":"'S of Murrayville AC - Analysis'!H121","v":-3.2468210113928447E-2},{"$f":"'S of Murrayville AC - Analysis'!I121","v":-0.1000626378583956},{"$f":"'S of Murrayville AC - Analysis'!J121","v":-0.1235672659804153},{"$f":"'S of Murrayville AC - Analysis'!K121","v":-9.7192566979938749E-2},{"$f":"'S of Murrayville AC - Analysis'!L121","v":-4.7257003610302377E-2},{"$f":"'S of Murrayville AC - Analysis'!M121","v":2.4840070777156359E-3}]
[{"$f":"'Salmon River - Analysis'!A69","v":"Cumulative GWL Change Across Aquifer (m) "},{"$f":"'Salmon River - Analysis'!B69","v":0},{"$f":"'Salmon River - Analysis'!C69","v":0},{"$f":"'Salmon River - Analysis'!D69","v":0},{"$f":"'Salmon River - Analysis'!E69","v":0},{"$f":"'Salmon River - Analysis'!F69","v":0},{"$f":"'Salmon River - Analysis'!G69","v":0},{"$f":"'Salmon River - Analysis'!H69","v":0},{"$f":"'Salmon River - Analysis'!I69","v":0},{"$f":"'Salmon River - Analysis'!J69","v":0},{"$f":"'Salmon River - Analysis'!K69","v":0},{"$f":"'Salmon River - Analysis'!L69","v":0},{"$f":"'Salmon River - Analysis'!M69","v":0}]
[{"$f":"'Salmon River - Analysis'!A95","v":"Cumulative GWL Change Across Aquifer (m) "},{"$f":"'Salmon River - Analysis'!B95","v":0},{"$f":"'Salmon River - Analysis'!C95","v":0},{"$f":"'Salmon River - Analysis'!D95","v":0},{"$f":"'Salmon River - Analysis'!E95","v":0},{"$f":"'Salmon River - Analysis'!F95","v":0},{"$f":"'Salmon River - Analysis'!G95","v":0},{"$f":"'Salmon River - Analysis'!H95","v":0},{"$f":"'Salmon River - Analysis'!I95","v":0},{"$f":"'Salmon River - Analysis'!J95","v":0},{"$f":"'Salmon River - Analysis'!K95","v":0},{"$f":"'Salmon River - Analysis'!L95","v":0},{"$f":"'Salmon River - Analysis'!M95","v":0}]
[{"$f":"'Salmon River - Analysis'!A121","v":"Cumulative GWL Change Across Aquifer (m) "},{"$f":"'Salmon River - Analysis'!B121","v":0},{"$f":"'Salmon River - Analysis'!C121","v":0},{"$f":"'Salmon River - Analysis'!D121","v":0},{"$f":"'Salmon River - Analysis'!E121","v":0},{"$f":"'Salmon River - Analysis'!F121","v":0},{"$f":"'Salmon River - Analysis'!G121","v":0},{"$f":"'Salmon River - Analysis'!H121","v":0},{"$f":"'Salmon River - Analysis'!I121","v":0},{"$f":"'Salmon River - Analysis'!J121","v":0},{"$f":"'Salmon River - Analysis'!K121","v":0},{"$f":"'Salmon River - Analysis'!L121","v":0},{"$f":"'Salmon River - Analysis'!M121","v":0}]
[{"$f":"'Nicomekl Serpentine - Analysis'!A69","v":"Cumulative GWL Change Across Aquifer (m) "},{"$f":"'Nicomekl Serpentine - Analysis'!B69","v":2.9542053260129018E-2},{"$f":"'Nicomekl Serpentine - Analysis'!C69","v":3.9738558552452709E-2},{"$f":"'Nicomekl Serpentine - Analysis'!D69","v":5.7740866718285815E-2},{"$f":"'Nicomekl Serpentine - Analysis'!E69","v":6.2064719452405603E-2},{"$f":"'Nicomekl Serpentine - Analysis'!F69","v":6.7572721552356468E-2},{"$f":"'Nicomekl Serpentine - Analysis'!G69","v":3.9571402081715217E-2},{"$f":"'Nicomekl Serpentine - Analysis'!H69","v":-1.8241006952273306E-2},{"$f":"'Nicomekl Serpentine - Analysis'!I69","v":-4.912907079454211E-2},{"$f":"'Nicomekl Serpentine - Analysis'!J69","v":-6.1016015082654765E-2},{"$f":"'Nicomekl Serpentine - Analysis'!K69","v":-4.5903294975587788E-2},{"$f":"'Nicomekl Serpentine - Analysis'!L69","v":-2.8393331576265692E-2},{"$f":"'Nicomekl Serpentine - Analysis'!M69","v":-5.8807125835613761E-15}]
[{"$f":"'Nicomekl Serpentine - Analysis'!A95","v":"Cumulative GWL Change Across Aquifer (m) "},{"$f":"'Nicomekl Serpentine - Analysis'!B95","v":2.9542053260129018E-2},{"$f":"'Nicomekl Serpentine - Analysis'!C95","v":3.9738558552452709E-2},{"$f":"'Nicomekl Serpentine - Analysis'!D95","v":5.7740866718285815E-2},{"$f":"'Nicomekl Serpentine - Analysis'!E95","v":6.2064719452405603E-2},{"$f":"'Nicomekl Serpentine - Analysis'!F95","v":6.7572721552356468E-2},{"$f":"'Nicomekl Serpentine - Analysis'!G95","v":3.9571402081715217E-2},{"$f":"'Nicomekl Serpentine - Analysis'!H95","v":-1.8241006952273306E-2},{"$f":"'Nicomekl Serpentine - Analysis'!I95","v":-4.912907079454211E-2},{"$f":"'Nicomekl Serpentine - Analysis'!J95","v":-6.1016015082654765E-2},{"$f":"'Nicomekl Serpentine - Analysis'!K95","v":-4.5903294975587788E-2},{"$f":"'Nicomekl Serpentine - Analysis'!L95","v":-2.8393331576265692E-2},{"$f":"'Nicomekl Serpentine - Analysis'!M95","v":-5.8807125835613761E-15}]
[{"$f":"'Nicomekl Serpentine - Analysis'!A121","v":"Cumulative GWL Change Across Aquifer (m) "},{"$f":"'Nicomekl Serpentine - Analysis'!B121","v":2.9542053260129018E-2},{"$f":"'Nicomekl Serpentine - Analysis'!C121","v":3.9738558552452709E-2},{"$f":"'Nicomekl Serpentine - Analysis'!D121","v":5.7740866718285815E-2},{"$f":"'Nicomekl Serpentine - Analysis'!E121","v":6.2064719452405603E-2},{"$f":"'Nicomekl Serpentine - Analysis'!F121","v":6.7572721552356468E-2},{"$f":"'Nicomekl Serpentine - Analysis'!G121","v":3.9571402081715217E-2},{"$f":"'Nicomekl Serpentine - Analysis'!H121","v":-1.8241006952273306E-2},{"$f":"'Nicomekl Serpentine - Analysis'!I121","v":-4.912907079454211E-2},{"$f":"'Nicomekl Serpentine - Analysis'!J121","v":-6.1016015082654765E-2},{"$f":"'Nicomekl Serpentine - Analysis'!K121","v":-4.5903294975587788E-2},{"$f":"'Nicomekl Serpentine - Analysis'!L121","v":-2.8393331576265692E-2},{"$f":"'Nicomekl Serpentine - Analysis'!M121","v":-5.8807125835613761E-15}]