{"text_format":"1","workbook":"xlsx","n_sheets":17,"sheets":["Cover Sheet","Aquifer Dashboard","Climate Dashboard","Aquifer Summary","Summary Graphs","Monthly Factors","Bedrock 198","Bedrock 200","Bedrock 202","Bedrock 203","Bedrock 204","Bedrock 207","Surficial AQ 197","Surficial AQ 199","Surficial AQ 201","Surficial AQ 205","Surficial AQ 206"],"not_rendered":{"charts":11,"images":3,"macros":1,"external_links":0,"defined_names":8,"comments":4,"pivot_tables":0},"unopened":[],"bounds":{"document_bytes":16777216,"sheet_cells":100000,"rows_first":2000,"rows_last":500,"rows_between":2000,"halvings":0,"cell_chars":16384,"cell_head_chars":4096},"cells_cut":0,"cells_raw":0,"read":"whole","date_system":"1900"}

{"sheet":"Cover Sheet","index":0,"n_rows":9,"n_cols":12,"rows_kept":9,"cut":false,"hidden":false,"merged":[[0,0,2,14],[3,0,4,14],[6,0,6,14],[8,1,8,3],[8,6,8,8],[8,11,8,13]]}
["Cobble Hill / Mill Bay Area   \n Preliminary Groundwater Budgets"]
[]
[]
["This spreadsheet was developed to assist the BCMOE in assessing applications for groundwater licenses.  This study was undertaken to understand the water resources under eleven aquifer areas on Vancouver Island in the Cobble Hill and Mill Bay area by calculating water budgets for each. "]
[]
[]
["Please use the buttons below to navigate to each of the Summary and Aquifer Detail sheets."]
[]
[null,"Summary Sheet Links",null,null,null,null,"Bedrock Aquifer Links",null,null,null,null,"Surficial Aquifer Links"]

{"sheet":"Aquifer Dashboard","index":1,"n_rows":82,"n_cols":32,"rows_kept":82,"cut":false,"hidden":false,"merged":[[0,2,2,14],[3,2,4,14],[6,2,6,14]]}
[null,null,"Aquifer Dashboard"]
[]
[]
[null,null,"This sheet shows the net total volume of groundwater gain or loss on a monthly basis. The water balance details are provided in the tables below the graph."]
[]
[]
[null,"Summary Sheet Links","Please use the Aquifer Selection box and Condition check boxes to display the desired information."]
[null,null,null,null,null,null,"Aquifer Selection",null,null,"Condition",null,null,null,null,null,null,"Worksheet",null,"Data Set",null,"Jan","Feb","Mar","Apr","May","Jun","Jul","Aug","Sep","Oct","Nov","Dec"]
[null,null,null,null,null,null,null,null,null,null,null,null,null,null,null,null,"3 Yr Avg Hot Cold",null,"AverageNet",true,{"$f":"IF($T$9=TRUE,VLOOKUP(\"Average YearNet Total (Gain - Loss)\",$A$38:$N$79,COLUMN(C49),FALSE),#N/A)","v":106411.12826972952},26421.274920317926,-32284.87790447587,-117385.39684108659,-185662.29979576371,-205102.28285826324,-210878.90028112617,-185143.19754377843,-157534.17884707768,-60797.311492067645,114445.02886263528,118033.98929624032]
[null,null,null,null,null,null,null,null,null,null,null,null,null,null,null,null,"Bedrock 198",null,"HotDryNet",true,{"$f":"IF($T$10=TRUE,VLOOKUP(\"Hot/Dry (1989)Net Total (Gain - Loss)\",$A$38:$N$79,COLUMN(C49),FALSE),#N/A)","v":63998.321011556895},-12841.315894728148,31139.530370001303,-129786.04477199359,-190623.75502447685,-204010.59030936882,-206079.63187963181,-182689.50106729163,-163479.20207320605,-112566.91857584685,-11058.552558306401,29749.226692142227]
[null,null,null,null,null,null,null,null,null,null,null,null,null,null,null,null,"Bedrock 200",null,"ColdWetNet",true,{"$f":"IF($T$11=TRUE,VLOOKUP(\"Cold/Wet (1999)Net Total (Gain - Loss)\",$A$38:$N$79,COLUMN(C68),FALSE),#N/A)","v":302889.14659443498},308240.57989943872,19773.499171961419,-162498.84649501115,-170064.67749090705,-196703.56315564812,-215678.16868262048,-185143.19754377843,-159933.81304782486,11571.94619563804,116799.7452243366,143395.62041463732]
[null,null,null,null,null,null,null,null,null,null,null,null,null,null,null,null,"Bedrock 202"]
[null,null,null,null,null,null,null,null,null,null,null,null,null,null,null,null,"Bedrock 203"]
[null,null,null,null,null,null,null,null,null,null,null,null,null,null,null,null,"Bedrock 204",null,null,null,{"$f":"C79","v":" "},{"$f":"D79","v":" "}," "," "," "," "," "," "," "," "," "," "]
[null,null,null,null,null,null,null,null,null,null,null,null,null,null,null,null,"Bedrock 207"]
[null,null,null,null,null,null,null,null,null,null,null,null,null,null,null,null,"Surficial AQ 197"]
[null,null,null,null,null,null,null,null,null,null,null,null,null,null,null,null,"Surficial AQ 199"]
[null,null,null,null,null,null,null,null,null,null,null,null,null,null,null,null,"Surficial AQ 201",null,null,null,{"$f":"VLOOKUP(\"Cold/Wet (1999)Net Total (Gain - Loss)\",$A$38:$N$79,COLUMN(C79))","v":" "}]
[null,null,null,null,null,null,null,null,null,null,null,null,null,null,null,null,"Surficial AQ 205"]
[null,null,null,null,null,null,null,null,null,null,null,null,null,null,null,null,"Surficial AQ 206"]
[]
[null,null,null,null,null,null,null,null,null,null,null,null,null,null,null,"Aquifer",{"$f":"INDEX(WorksheetList,Q23)","v":"Surficial AQ 206"}]
[null,null,null,null,null,null,null,null,null,null,null,null,null,null,null,null,11]
[]
[]
[]
[]
[]
[]
[]
[]
[]
[]
[]
[]
[null,"Monthly Gains and Loses (m3)","Average Year"]
[null,"Source","Jan","Feb","Mar","Apr","May","Jun","Jul","Aug","Sep","Oct","Nov","Dec","Total"]
[{"$f":"$C$36&B38","v":"Average YearDirect Recharge to 206"},{"$f":"INDIRECT(\"'\"&$Q$22&\"'\"&\"!\"&\"B9\")","v":"Direct Recharge to 206"},{"$f":"IFERROR(VLOOKUP($C$36&$B38,INDIRECT(\"'\"&$Q$22&\"'\"&\"!\"&\"A9:O50\"),COLUMN(C38),FALSE),\" \")","v":229577.03401795548},149537.63949793697,107916.98858753691,25916.376047947142,-31195.244609713282,-49192.5011153171,-47992.684014943516,-21596.707806724578,-7198.9026022415264,78927.678669403685,242168.00869443579,236078.51505300775,{"$f":"IF(COUNT(C38:N38)<>0,SUM(C38:N38),\" \")","v":912946.20041928382}]
[{"$f":"$C$36&B39","v":"Average YearLeakage down to 207"},{"$f":"IF(OFFSET(INDIRECT(\"'\"&$Q$22&\"'\"&\"!\"&\"B9\"),ROW(B30)+1,0)>0,OFFSET(INDIRECT(\"'\"&$Q$22&\"'\"&\"!\"&\"B9\"),ROW(B30)+1,0),\" \")","v":"Leakage down to 207"},-62536.311195353999,-60220.151521451997,-67168.630543157997,-66396.577318523996,-69484.790217059999,-66396.577318523996,-67168.630543157997,-65624.52409389001,-62536.311195353999,-63308.364419988,-60220.151521451997,-60992.204746085998,{"$f":"IF(COUNT(C39:N39)<>0,SUM(C39:N39),\" \")","v":-772053.22463399998}]
["Average YearLateral Groundwater",{"$f":"IF(OFFSET(INDIRECT(\"'\"&$Q$22&\"'\"&\"!\"&\"B9\"),ROW(B31)+1,0)>0,OFFSET(INDIRECT(\"'\"&$Q$22&\"'\"&\"!\"&\"B9\"),ROW(B31)+1,0),\" \")","v":"Lateral Groundwater"},-30269.829600000005,-29148.724800000004,-32512.039199999999,-32138.337599999999,-33633.144,-32138.337599999999,-32512.039199999999,-31764.636000000006,-30269.829600000005,-30643.531200000005,-29148.724800000004,-29522.426400000004,-373701.60000000009]
["Average YearLateral Groundwater","Lateral Groundwater",-30269.829600000005,-29148.724800000004,-32512.039199999999,-32138.337599999999,-33633.144,-32138.337599999999,-32512.039199999999,-31764.636000000006,-30269.829600000005,-30643.531200000005,-29148.724800000004,-29522.426400000004,-373701.60000000009]
["Average YearSurface Water","Surface Water",-45931.985518408554,-40324.479182162439,-29128.585762597486,-14083.762324392983,-4993.7693411051869,-2025.4649313563098,-1202.8882467288922,-390.72392519802361,-328.51005569613972,-3015.1600436833501,-21309.161386166164,-45403.109282504505,-208137.60000000003]
["Average YearSurface Water","Surface Water",-45931.985518408554,-40324.479182162439,-29128.585762597486,-14083.762324392983,-4993.7693411051869,-2025.4649313563098,-1202.8882467288922,-390.72392519802361,-328.51005569613972,-3015.1600436833501,-21309.161386166164,-45403.109282504505,-208137.60000000003]
["Average YearWater Well Useage","Water Well Useage",-34535.4,-37413.35,-43169.25,-46047.200000000004,-51803.1,-57559,-63314.9,-66192.850000000006,-57559,-46047.200000000004,-40291.300000000003,-31657.45,-575590]
["Average YearNet Gain","Net Gain",279684.65458349208,193527.98042393237,139693.62760127962,41280.480401830398,5447.7483721147501,2209.598106934156,1312.2417237042459,426.24428203420757,358.37460621397059,82216.944171603711,265414.36657025345,285609.17972483084,1297181.4405682238]
["Average YearNet Loss","Net Loss",-173273.52631376256,-167106.70550361444,-171978.50550575549,-158665.87724291699,-191110.04816787847,-207311.8809651974,-212191.14200483041,-185569.44182581262,-157892.55345329165,-143014.25566367136,-150969.33770761816,-167575.19042859052,-2086658.4647829407]
["Average YearNet Total (Gain - Loss)","Net Total (Gain - Loss)",106411.12826972952,26421.274920317926,-32284.87790447587,-117385.39684108659,-185662.29979576371,-205102.28285826324,-210878.90028112617,-185143.19754377843,-157534.17884707768,-60797.311492067645,114445.02886263528,118033.98929624032,-789477.0242147164]
["Average Year "," "," "," "," "," "," "," "," "," "," "," "," "," "," "]
["Average Year "," "," "," "," "," "," "," "," "," "," "," "," "," "," "]
[]
[null,"Monthly Gains and Loses (m3)","Hot/Dry (1989)"]
[null,"Source","Jan","Feb","Mar","Apr","May","Jun","Jul","Aug","Sep","Oct","Nov","Dec","Total"]
[{"$f":"$C$51&B53","v":"Hot/Dry (1989)Direct Recharge to 206"},{"$f":"INDIRECT(\"'\"&$Q$22&\"'\"&\"!\"&\"B9\")","v":"Direct Recharge to 206"},{"$f":"IFERROR(VLOOKUP($C$51&$B53,INDIRECT(\"'\"&$Q$22&\"'\"&\"!\"&\"A9:O50\"),COLUMN(C53),FALSE),\" \")","v":188309.98158441685},107983.5390336229,167904.13238811208,10078.463643138139,-39593.964312328404,-50392.318215690684,-43193.415613449164,-17997.256505603818,-11998.171003735877,30595.336059526489,120101.69174739614,152376.77174744566,{"$f":"IF(COUNT(C53:N53)<>0,SUM(C53:N53),\" \")","v":614174.79055285035}]
[{"$f":"$C$51&B54","v":"Hot/Dry (1989)Leakage down to 207"},{"$f":"IF(OFFSET(INDIRECT(\"'\"&$Q$22&\"'\"&\"!\"&\"B9\"),ROW(B30)+1,0)>0,OFFSET(INDIRECT(\"'\"&$Q$22&\"'\"&\"!\"&\"B9\"),ROW(B30)+1,0),\" \")","v":"Leakage down to 207"},-63308.364419988,-58676.045072183995,-64852.470869256002,-64080.417644622001,-67168.630543157997,-64852.470869256002,-67168.630543157997,-66396.577318523996,-63308.364419988,-65624.52409389001,-62536.311195353999,-64080.417644622001,{"$f":"IF(COUNT(C54:N54)<>0,SUM(C54:N54),\" \")","v":-772053.22463399998}]
["Hot/Dry (1989)Lateral Groundwater",{"$f":"IF(OFFSET(INDIRECT(\"'\"&$Q$22&\"'\"&\"!\"&\"B9\"),ROW(B31)+1,0)>0,OFFSET(INDIRECT(\"'\"&$Q$22&\"'\"&\"!\"&\"B9\"),ROW(B31)+1,0),\" \")","v":"Lateral Groundwater"},-30643.531200000005,-28401.321600000003,-31390.934400000006,-31017.232800000005,-32512.039199999999,-31390.934400000006,-32512.039199999999,-32138.337599999999,-30643.531200000005,-31764.636000000006,-30269.829600000005,-31017.232800000005,-373701.60000000003]
["Hot/Dry (1989)Lateral Groundwater","Lateral Groundwater",-30643.531200000005,-28401.321600000003,-31390.934400000006,-31017.232800000005,-32512.039199999999,-31390.934400000006,-32512.039199999999,-32138.337599999999,-30643.531200000005,-31764.636000000006,-30269.829600000005,-31017.232800000005,-373701.60000000003]
["Hot/Dry (1989)Surface Water","Surface Water",-45931.985518408554,-40324.479182162439,-29128.585762597486,-14083.762324392983,-4993.7693411051869,-2025.4649313563098,-1202.8882467288922,-390.72392519802361,-328.51005569613972,-3015.1600436833501,-21309.161386166164,-45403.109282504505,-208137.60000000003]
["Hot/Dry (1989)Surface Water","Surface Water",-45931.985518408554,-40324.479182162439,-29128.585762597486,-14083.762324392983,-4993.7693411051869,-2025.4649313563098,-1202.8882467288922,-390.72392519802361,-328.51005569613972,-3015.1600436833501,-21309.161386166164,-45403.109282504505,-208137.60000000003]
["Hot/Dry (1989)Water Well Useage","Water Well Useage",-34535.4,-37413.35,-43169.25,-46047.200000000004,-51803.1,-57559,-63314.9,-66192.850000000006,-57559,-46047.200000000004,-40291.300000000003,-31657.45,-575590]
["Hot/Dry (1989)Net Gain","Net Gain",238417.60214995345,151973.87995961829,199680.77140185478,25442.56799702139,5447.7483721147501,2209.598106934156,1312.2417237042459,426.24428203420757,358.37460621397059,33884.601561726507,143348.04962321377,201907.43641926875,1004409.1162036582]
["Hot/Dry (1989)Net Loss","Net Loss",-174419.28113839656,-164815.19585434644,-168541.24103185348,-155228.61276901499,-196071.50339659161,-206220.18841630299,-207391.87360333605,-183115.74534932582,-163837.57667942002,-146451.52013757336,-154406.60218152017,-172158.20972712652,-2092657.5502848076]
["Hot/Dry (1989)Net Total (Gain - Loss)","Net Total (Gain - Loss)",63998.321011556895,-12841.315894728148,31139.530370001303,-129786.04477199359,-190623.75502447685,-204010.59030936882,-206079.63187963181,-182689.50106729163,-163479.20207320605,-112566.91857584685,-11058.552558306401,29749.226692142227,-1088248.4340811498]
["Hot/Dry (1989) "," "," "," "," "," "," "," "," "," "," "," "," "," "," "]
["Hot/Dry (1989) "," "," "," "," "," "," "," "," "," "," "," "," "," "," "]
[]
[null,"Monthly Gains and Loses (m3)","Cold/Wet (1999)"]
[null,"Source","Jan","Feb","Mar","Apr","May","Jun","Jul","Aug","Sep","Oct","Nov","Dec","Total"]
[{"$f":"$C$66&B68","v":"Cold/Wet (1999)Direct Recharge to 206"},{"$f":"INDIRECT(\"'\"&$Q$22&\"'\"&\"!\"&\"B9\")","v":"Direct Recharge to 206"},{"$f":"IFERROR(VLOOKUP($C$66&$B68,INDIRECT(\"'\"&$Q$22&\"'\"&\"!\"&\"A9:O50\"),COLUMN(C68),FALSE),\" \")","v":426055.05234266096},431356.94447705778,159975.3656639742,-19197.073605977403,-15597.622304856637,-40793.781412701974,-52791.952416437853,-21596.707806724575,-9598.5368029887013,151296.93635710937,244522.72505613713,261440.14617140475,{"$f":"IF(COUNT(C68:N68)<>0,SUM(C68:N68),\" \")","v":1515071.495718657}]
[{"$f":"$C$66&B69","v":"Cold/Wet (1999)Leakage down to 207"},{"$f":"IF(OFFSET(INDIRECT(\"'\"&$Q$22&\"'\"&\"!\"&\"B9\"),ROW(B30)+1,0)>0,OFFSET(INDIRECT(\"'\"&$Q$22&\"'\"&\"!\"&\"B9\"),ROW(B30)+1,0),\" \")","v":"Leakage down to 207"},-62536.311195353999,-60220.151521451997,-67168.630543157997,-66396.577318523996,-69484.790217059999,-66396.577318523996,-67168.630543157997,-65624.52409389001,-62536.311195353999,-63308.364419988,-60220.151521451997,-60992.204746085998,{"$f":"IF(COUNT(C69:N69)<>0,SUM(C69:N69),\" \")","v":-772053.22463399998}]
["Cold/Wet (1999)Lateral Groundwater",{"$f":"IF(OFFSET(INDIRECT(\"'\"&$Q$22&\"'\"&\"!\"&\"B9\"),ROW(B31)+1,0)>0,OFFSET(INDIRECT(\"'\"&$Q$22&\"'\"&\"!\"&\"B9\"),ROW(B31)+1,0),\" \")","v":"Lateral Groundwater"},-30269.829600000005,-29148.724800000004,-32512.039199999999,-32138.337599999999,-33633.144,-32138.337599999999,-32512.039199999999,-31764.636000000006,-30269.829600000005,-30643.531200000005,-29148.724800000004,-29522.426400000004,-373701.60000000009]
["Cold/Wet (1999)Lateral Groundwater","Lateral Groundwater",-30269.829600000005,-29148.724800000004,-32512.039199999999,-32138.337599999999,-33633.144,-32138.337599999999,-32512.039199999999,-31764.636000000006,-30269.829600000005,-30643.531200000005,-29148.724800000004,-29522.426400000004,-373701.60000000009]
["Cold/Wet (1999)Surface Water","Surface Water",-45931.985518408554,-40324.479182162439,-29128.585762597486,-14083.762324392983,-4993.7693411051869,-2025.4649313563098,-1202.8882467288922,-390.72392519802361,-328.51005569613972,-3015.1600436833501,-21309.161386166164,-45403.109282504505,-208137.60000000003]
["Cold/Wet (1999)Surface Water","Surface Water",-45931.985518408554,-40324.479182162439,-29128.585762597486,-14083.762324392983,-4993.7693411051869,-2025.4649313563098,-1202.8882467288922,-390.72392519802361,-328.51005569613972,-3015.1600436833501,-21309.161386166164,-45403.109282504505,-208137.60000000003]
["Cold/Wet (1999)Water Well Useage","Water Well Useage",-34535.4,-37413.35,-43169.25,-46047.200000000004,-51803.1,-57559,-63314.9,-66192.850000000006,-57559,-46047.200000000004,-40291.300000000003,-31657.45,-575590]
["Cold/Wet (1999)Net Gain","Net Gain",476162.67290819756,475347.28540305316,191752.0046777169,15364.104353883253,5447.7483721147501,2209.598106934156,1312.2417237042459,426.24428203420757,358.37460621397059,154586.2018593094,267769.08293195476,310970.81084322784,1901706.3700683443]
["Cold/Wet (1999)Net Loss","Net Loss",-173273.52631376256,-167106.70550361444,-171978.50550575549,-177862.9508488944,-175512.42586302181,-198913.16126258229,-216990.41040632472,-185569.44182581262,-160292.18765403883,-143014.25566367136,-150969.33770761816,-167575.19042859052,-2089058.0989836873]
["Cold/Wet (1999)Net Total (Gain - Loss)","Net Total (Gain - Loss)",302889.14659443498,308240.57989943872,19773.499171961419,-162498.84649501115,-170064.67749090705,-196703.56315564812,-215678.16868262048,-185143.19754377843,-159933.81304782486,11571.94619563804,116799.7452243366,143395.62041463732,-187351.728915343]
["Cold/Wet (1999) "," "," "," "," "," "," "," "," "," "," "," "," "," "," "]
["Cold/Wet (1999) "," "," "," "," "," "," "," "," "," "," "," "," "," "," "]
[]
[]
[{"$f":"A79","v":"Cold/Wet (1999) "}]

{"sheet":"Climate Dashboard","index":2,"n_rows":59,"n_cols":76,"rows_kept":59,"cut":false,"hidden":false,"merged":[[5,1,5,14],[3,1,3,14],[0,0,2,14],[43,0,48,0],[49,0,54,0],[37,0,42,0],[36,1,36,37]]}
["Climate Dashboard"]
[]
[]
["Summary Sheet Links","This page provides the climate information use to develop the groundwater models. The climate data is provided in the tables below the graph."]
[]
[null,"Please use the check boxes below to select which information you would like to show on the graph."]
[null,null,null,null,"Condition",null,null,null,"Data",null,null,null,null,null,null,null,null,null,null,null,null,null,null,null,null,null,null,null,null,null,null,null,null,null,null,null,null,null,null,"Hot/Dry",true,null,"Temp. (°C)",false]
[null,null,null,null,null,null,null,null,null,null,null,null,null,null,null,null,null,null,null,null,null,null,null,null,null,null,null,null,null,null,null,null,null,null,null,null,null,null,null," 30 Year Average",true,null,"Precipitation (mm)",false]
[null,null,null,null,null,null,null,null,null,null,null,null,null,null,null,null,null,null,null,null,null,null,null,null,null,null,null,null,null,null,null,null,null,null,null,null,null,null,null,"Cold/Wet",true,null,"Actual Evapotranspiration (mm)",false]
[null,null,null,null,null,null,null,null,null,null,null,null,null,null,null,null,null,null,null,null,null,null,null,null,null,null,null,null,null,null,null,null,null,null,null,null,null,null,null,null,null,null,"Sum of  Surplus Water (mm)",true]
[null,null,null,null,null,null,null,null,null,null,null,null,null,null,null,null,null,null,null,null,null,null,null,null,null,null,null,null,null,null,null,null,null,null,null,null,null,null,null,null,null,null,"Soil Moisture Storage (mm)",false]
[]
[]
[]
[]
[]
[]
[]
[]
[]
[]
[]
[]
[]
[]
[]
[]
[]
[]
[]
[]
[]
[]
[]
[]
[null,null,null,null,null,null,null,null,null,null,null,null,null,null,null,null,null,null,null,null,null,null,null,null,null,null,null,null,null,null,null,null,null,null,null,null,null,null,null,{"$f":"AN42","v":"Hot/Dry Sum of  Surplus Water (mm)"}]
[null,"Shawnigan Creek",null,null,null,null,null,null,null,null,null,null,null,null,null,null,null,null,null,null,null,null,null,null,null,null,null,null,null,null,null,null,null,null,null,null,null,null,null,null,1,{"$f":"AO37+1","v":2},{"$f":"AP37+1","v":3},4,5,6,7,8,9,10,11,12,13,14,15,16,17,18,19,20,21,22,23,24,25,26,27,28,29,30,31,32,33,34,35,36]
["Hot/Dry","Month-Year","1987-01-01","1987-02-01","1987-03-01","1987-04-01","1987-05-01","1987-06-01","1987-07-01","1987-08-01","1987-09-01","1987-10-01","1987-11-01","1987-12-01","1988-01-01","1988-02-01","1988-03-01","1988-04-01","1988-05-01","1988-06-01","1988-07-01","1988-08-01","1988-09-01","1988-10-01","1988-11-01","1988-12-01","1989-01-01","1989-02-01","1989-03-01","1989-04-01","1989-05-01","1989-06-01","1989-07-01","1989-08-01","1989-09-01","1989-10-01","1989-11-01","1989-12-01",null,null,{"$f":"IF(OR($AO$8=TRUE,AND($AO$7=TRUE,$AO$9=TRUE)),TEXT(AO37,\"d\"),IF(AND($AO$7=TRUE,$AO$9=FALSE),C38,C50))","v":"1"},{"$f":"IF(OR($AO$8=TRUE,AND($AO$7=TRUE,$AO$9=TRUE)),TEXT(AP37,\"d\"),IF(AND($AO$7=TRUE,$AO$9=FALSE),D38,D50))","v":"2"},"3","4","5","6","7","8","9","10","11","12","13","14","15","16","17","18","19","20","21","22","23","24","25","26","27","28","29","30","31",{"$f":"IF(OR($AO$8=TRUE,AND($AO$7=TRUE,$AO$9=TRUE)),TEXT(BT37,\"##\"),IF(AND($AO$7=TRUE,$AO$9=FALSE),AH38,AH50))","v":"32"},{"$f":"IF(OR($AO$8=TRUE,AND($AO$7=TRUE,$AO$9=TRUE)),TEXT(BU37,\"##\"),IF(AND($AO$7=TRUE,$AO$9=FALSE),AI38,AI50))","v":"33"},{"$f":"IF(OR($AO$8=TRUE,AND($AO$7=TRUE,$AO$9=TRUE)),TEXT(BV37,\"##\"),IF(AND($AO$7=TRUE,$AO$9=FALSE),AJ38,AJ50))","v":"34"},{"$f":"IF(OR($AO$8=TRUE,AND($AO$7=TRUE,$AO$9=TRUE)),TEXT(BW37,\"##\"),IF(AND($AO$7=TRUE,$AO$9=FALSE),AK38,AK50))","v":"35"},{"$f":"IF(OR($AO$8=TRUE,AND($AO$7=TRUE,$AO$9=TRUE)),TEXT(BX37,\"##\"),IF(AND($AO$7=TRUE,$AO$9=FALSE),AL38,AL50))","v":"36"}]
[null,"Temp. (°C)",3.5,5.6,6.6,9.5,12.4,15.8,17.3,17.8,16.3,11.6,7.4,2.8,2.7,5.0999999999999996,6,9.1999999999999993,11.9,14.1,17.399999999999999,17.600000000000001,14.4,11.3,6.2,4.0999999999999996,2.9,-0.7,3.9,10,12.3,15.9,16.7,16.8,16.2,10.1,6.6,5,null,{"$f":"$A$38&\" \"&B39","v":"Hot/Dry Temp. (°C)"},{"$f":"IF(AND($AO$7=TRUE,$AR7=TRUE),C39,#N/A)","v":{"$error":"#N/A"}},{"$error":"#N/A"},{"$error":"#N/A"},{"$error":"#N/A"},{"$error":"#N/A"},{"$error":"#N/A"},{"$error":"#N/A"},{"$error":"#N/A"},{"$error":"#N/A"},{"$error":"#N/A"},{"$f":"IF(AND($AO$7=TRUE,$AR7=TRUE),M39,#N/A)","v":{"$error":"#N/A"}},{"$error":"#N/A"},{"$error":"#N/A"},{"$error":"#N/A"},{"$error":"#N/A"},{"$error":"#N/A"},{"$error":"#N/A"},{"$error":"#N/A"},{"$error":"#N/A"},{"$error":"#N/A"},{"$f":"IF(AND($AO$7=TRUE,$AR7=TRUE),W39,#N/A)","v":{"$error":"#N/A"}},{"$error":"#N/A"},{"$error":"#N/A"},{"$error":"#N/A"},{"$error":"#N/A"},{"$error":"#N/A"},{"$error":"#N/A"},{"$error":"#N/A"},{"$error":"#N/A"},{"$error":"#N/A"},{"$f":"IF(AND($AO$7=TRUE,$AR7=TRUE),AG39,#N/A)","v":{"$error":"#N/A"}},{"$error":"#N/A"},{"$error":"#N/A"},{"$error":"#N/A"},{"$error":"#N/A"},{"$error":"#N/A"}]
[null,"Precipitation (mm)",214.2,70.400000000000006,120.2,65,56,6.8,14.2,18.399999999999999,5.6,13.8,156.80000000000001,211.2,144.19999999999999,52.4,148.80000000000001,96,60.6,38.4,23.8,16.8,80,88.4,233.4,139.4,166.1,90,157.19999999999999,62.6,42.2,28.2,28,30,2.6,69.599999999999994,123.4,142.80000000000001,null,{"$f":"$A$38&\" \"&B40","v":"Hot/Dry Precipitation (mm)"},{"$error":"#N/A"},{"$error":"#N/A"},{"$error":"#N/A"},{"$error":"#N/A"},{"$error":"#N/A"},{"$error":"#N/A"},{"$error":"#N/A"},{"$error":"#N/A"},{"$error":"#N/A"},{"$error":"#N/A"},{"$error":"#N/A"},{"$error":"#N/A"},{"$error":"#N/A"},{"$error":"#N/A"},{"$error":"#N/A"},{"$error":"#N/A"},{"$error":"#N/A"},{"$error":"#N/A"},{"$error":"#N/A"},{"$error":"#N/A"},{"$error":"#N/A"},{"$error":"#N/A"},{"$error":"#N/A"},{"$error":"#N/A"},{"$error":"#N/A"},{"$error":"#N/A"},{"$error":"#N/A"},{"$error":"#N/A"},{"$error":"#N/A"},{"$error":"#N/A"},{"$error":"#N/A"},{"$error":"#N/A"},{"$error":"#N/A"},{"$error":"#N/A"},{"$error":"#N/A"},{"$error":"#N/A"}]
[null,"Actual Evapotranspiration (mm)",10.3,18.3,28.606446854850301,48.7,75,68.8,48.2,34.4,13.6,15.8,24.7,7.4520051378124785,8.5,17.8,27.506996653986995,49.3,75.599999999999994,79.400000000000006,67.8,39.799999999999997,74.099999999999994,49.8,21.7,12.7,9.151093766055963,0,17.258560312374556,54.2,75.2,70.2,64,45,12.6,44.1,23.3,15.8,null,{"$f":"$A$38&\" \"&B41","v":"Hot/Dry Actual Evapotranspiration (mm)"},{"$error":"#N/A"},{"$error":"#N/A"},{"$error":"#N/A"},{"$error":"#N/A"},{"$error":"#N/A"},{"$error":"#N/A"},{"$error":"#N/A"},{"$error":"#N/A"},{"$error":"#N/A"},{"$error":"#N/A"},{"$error":"#N/A"},{"$error":"#N/A"},{"$error":"#N/A"},{"$error":"#N/A"},{"$error":"#N/A"},{"$error":"#N/A"},{"$error":"#N/A"},{"$error":"#N/A"},{"$error":"#N/A"},{"$error":"#N/A"},{"$error":"#N/A"},{"$error":"#N/A"},{"$error":"#N/A"},{"$error":"#N/A"},{"$error":"#N/A"},{"$error":"#N/A"},{"$error":"#N/A"},{"$error":"#N/A"},{"$error":"#N/A"},{"$error":"#N/A"},{"$error":"#N/A"},{"$error":"#N/A"},{"$error":"#N/A"},{"$error":"#N/A"},{"$error":"#N/A"},{"$error":"#N/A"}]
[null,"Sum of  Surplus Water (mm)",203.9,52.1,91.6,16.3,-19,-62,-34,-16,-8,-2,132.1,203.7,135.69999999999999,34.6,121.29300334601302,46.7,-15,-41,-44,-23,5.9,38.6,211.7,126.7,156.94890623394403,90,139.94143968762543,8.4,-33,-42,-36,-15,-10,25.5,100.1,127,null,{"$f":"$A$38&\" \"&B42","v":"Hot/Dry Sum of  Surplus Water (mm)"},203.9,52.1,91.6,16.3,-19,-62,-34,-16,-8,-2,132.1,203.7,135.69999999999999,34.6,121.29300334601302,46.7,-15,-41,-44,-23,5.9,38.6,211.7,126.7,156.94890623394403,90,139.94143968762543,8.4,-33,-42,-36,-15,-10,25.5,100.1,127]
[null,"Soil Moisture Storage (mm)",150,150,150,150,131,69,35,19,11,9,141,150,150,150,150,150,135,94,50,27,33,72,150,150,150,150,150,150,117,75,39,24,14,39,140,150,null,{"$f":"$A$38&\" \"&B43","v":"Hot/Dry Soil Moisture Storage (mm)"},{"$error":"#N/A"},{"$error":"#N/A"},{"$error":"#N/A"},{"$error":"#N/A"},{"$error":"#N/A"},{"$error":"#N/A"},{"$error":"#N/A"},{"$error":"#N/A"},{"$error":"#N/A"},{"$error":"#N/A"},{"$error":"#N/A"},{"$error":"#N/A"},{"$error":"#N/A"},{"$error":"#N/A"},{"$error":"#N/A"},{"$error":"#N/A"},{"$error":"#N/A"},{"$error":"#N/A"},{"$error":"#N/A"},{"$error":"#N/A"},{"$error":"#N/A"},{"$error":"#N/A"},{"$error":"#N/A"},{"$error":"#N/A"},{"$error":"#N/A"},{"$error":"#N/A"},{"$error":"#N/A"},{"$error":"#N/A"},{"$error":"#N/A"},{"$error":"#N/A"},{"$error":"#N/A"},{"$error":"#N/A"},{"$error":"#N/A"},{"$error":"#N/A"},{"$error":"#N/A"},{"$error":"#N/A"}]
[" 30 Year Average","Month-Year",1,2,3,4,5,6,7,8,9,10,11,12,13,14,15,16,17,18,19,20,21,22,23,24,25,26,27,28,29,30,31,32,33,34,35,36]
[null,"Temp. (°C)",3.1,4.2866666666666662,6,8.6999999999999993,12.1,15.1,17.600000000000001,17.8,14.8,10,5.5,3.1,3.1,4.2866666666666662,6,8.6999999999999993,12.1,15.1,17.600000000000001,17.8,14.8,10,5.5,3.1,3.1,4.2866666666666662,6,8.6999999999999993,12.1,15.1,17.600000000000001,17.8,14.8,10,5.5,3.1,null,{"$f":"$A$44&\" \"&B45","v":" 30 Year Average Temp. (°C)"},{"$f":"IF(AND($AO$8=TRUE,$AR7=TRUE),C45,#N/A)","v":{"$error":"#N/A"}},{"$error":"#N/A"},{"$error":"#N/A"},{"$error":"#N/A"},{"$error":"#N/A"},{"$error":"#N/A"},{"$error":"#N/A"},{"$error":"#N/A"},{"$error":"#N/A"},{"$error":"#N/A"},{"$f":"IF(AND($AO$8=TRUE,$AR7=TRUE),M45,#N/A)","v":{"$error":"#N/A"}},{"$error":"#N/A"},{"$error":"#N/A"},{"$error":"#N/A"},{"$error":"#N/A"},{"$error":"#N/A"},{"$error":"#N/A"},{"$error":"#N/A"},{"$error":"#N/A"},{"$error":"#N/A"},{"$f":"IF(AND($AO$8=TRUE,$AR7=TRUE),W45,#N/A)","v":{"$error":"#N/A"}},{"$error":"#N/A"},{"$error":"#N/A"},{"$error":"#N/A"},{"$error":"#N/A"},{"$error":"#N/A"},{"$error":"#N/A"},{"$error":"#N/A"},{"$error":"#N/A"},{"$error":"#N/A"},{"$f":"IF(AND($AO$8=TRUE,$AR7=TRUE),AG45,#N/A)","v":{"$error":"#N/A"}},{"$error":"#N/A"},{"$error":"#N/A"},{"$error":"#N/A"},{"$error":"#N/A"},{"$error":"#N/A"}]
[null,"Precipitation (mm)",201.41333333333336,138.71666666666667,117.91333333333333,68.483333333333334,48.850000000000009,39.460000000000008,23.25333333333333,28.336666666666666,37.373333333333342,109.71,220.85999999999999,206.15666666666664,201.41333333333336,138.71666666666667,117.91333333333333,68.483333333333334,48.850000000000009,39.460000000000008,23.25333333333333,28.336666666666666,37.373333333333342,109.71,220.85999999999999,206.15666666666664,201.41333333333336,138.71666666666667,117.91333333333333,68.483333333333334,48.850000000000009,39.460000000000008,23.25333333333333,28.336666666666666,37.373333333333342,109.71,220.85999999999999,206.15666666666664,null,{"$f":"$A$44&\" \"&B46","v":" 30 Year Average Precipitation (mm)"},{"$error":"#N/A"},{"$error":"#N/A"},{"$error":"#N/A"},{"$error":"#N/A"},{"$error":"#N/A"},{"$error":"#N/A"},{"$error":"#N/A"},{"$error":"#N/A"},{"$error":"#N/A"},{"$error":"#N/A"},{"$error":"#N/A"},{"$error":"#N/A"},{"$error":"#N/A"},{"$error":"#N/A"},{"$error":"#N/A"},{"$error":"#N/A"},{"$error":"#N/A"},{"$error":"#N/A"},{"$error":"#N/A"},{"$error":"#N/A"},{"$error":"#N/A"},{"$error":"#N/A"},{"$error":"#N/A"},{"$error":"#N/A"},{"$error":"#N/A"},{"$error":"#N/A"},{"$error":"#N/A"},{"$error":"#N/A"},{"$error":"#N/A"},{"$error":"#N/A"},{"$error":"#N/A"},{"$error":"#N/A"},{"$error":"#N/A"},{"$error":"#N/A"},{"$error":"#N/A"},{"$error":"#N/A"}]
[null,"Actual Evapotranspiration (mm)",10.069974460991984,14.082970871386422,27.968800492507221,46.883061058602841,74.850000000000009,80.460000000000008,63.25333333333333,46.336666666666666,43.373333333333342,43.926908023041229,19.022562761414374,9.3945810291975214,10.069974460991984,14.082970871386422,27.968800492507221,46.883061058602841,74.850000000000009,80.460000000000008,63.25333333333333,46.336666666666666,43.373333333333342,43.926908023041229,19.022562761414374,9.3945810291975214,10.069974460991984,14.082970871386422,27.968800492507221,46.883061058602841,74.850000000000009,80.460000000000008,63.25333333333333,46.336666666666666,43.373333333333342,43.926908023041229,19.022562761414374,9.3945810291975214,null,{"$f":"$A$44&\" \"&B47","v":" 30 Year Average Actual Evapotranspiration (mm)"},{"$error":"#N/A"},{"$error":"#N/A"},{"$error":"#N/A"},{"$error":"#N/A"},{"$error":"#N/A"},{"$error":"#N/A"},{"$error":"#N/A"},{"$error":"#N/A"},{"$error":"#N/A"},{"$error":"#N/A"},{"$error":"#N/A"},{"$error":"#N/A"},{"$error":"#N/A"},{"$error":"#N/A"},{"$error":"#N/A"},{"$error":"#N/A"},{"$error":"#N/A"},{"$error":"#N/A"},{"$error":"#N/A"},{"$error":"#N/A"},{"$error":"#N/A"},{"$error":"#N/A"},{"$error":"#N/A"},{"$error":"#N/A"},{"$error":"#N/A"},{"$error":"#N/A"},{"$error":"#N/A"},{"$error":"#N/A"},{"$error":"#N/A"},{"$error":"#N/A"},{"$error":"#N/A"},{"$error":"#N/A"},{"$error":"#N/A"},{"$error":"#N/A"},{"$error":"#N/A"},{"$error":"#N/A"}]
[null,"Sum of  Surplus Water (mm)",191.34335887234138,124.63369579528025,89.944532840826099,21.600272274730493,-26,-41,-40,-18,-6,65.783091976958758,201.83743723858561,196.76208563746911,191.34335887234138,124.63369579528025,89.944532840826099,21.600272274730493,-26,-41,-40,-18,-6,65.783091976958758,201.83743723858561,196.76208563746911,191.34335887234138,124.63369579528025,89.944532840826099,21.600272274730493,-26,-41,-40,-18,-6,65.783091976958758,201.83743723858561,196.76208563746911,null,{"$f":"$A$44&\" \"&B48","v":" 30 Year Average Sum of  Surplus Water (mm)"},191.34335887234138,124.63369579528025,89.944532840826099,21.600272274730493,-26,-41,-40,-18,-6,65.783091976958758,201.83743723858561,196.76208563746911,191.34335887234138,124.63369579528025,89.944532840826099,21.600272274730493,-26,-41,-40,-18,-6,65.783091976958758,201.83743723858561,196.76208563746911,191.34335887234138,124.63369579528025,89.944532840826099,21.600272274730493,-26,-41,-40,-18,-6,65.783091976958758,201.83743723858561,196.76208563746911]
[null,"Soil Moisture Storage (mm)",150,150,150,150,124,83,43,25,19,84.783091976958758,150,150,150,150,150,150,124,83,43,25,19,84.783091976958758,150,150,150,150,150,150,124,83,43,25,19,84.783091976958758,150,150,null,{"$f":"$A$44&\" \"&B49","v":" 30 Year Average Soil Moisture Storage (mm)"},{"$error":"#N/A"},{"$error":"#N/A"},{"$error":"#N/A"},{"$error":"#N/A"},{"$error":"#N/A"},{"$error":"#N/A"},{"$error":"#N/A"},{"$error":"#N/A"},{"$error":"#N/A"},{"$error":"#N/A"},{"$error":"#N/A"},{"$error":"#N/A"},{"$error":"#N/A"},{"$error":"#N/A"},{"$error":"#N/A"},{"$error":"#N/A"},{"$error":"#N/A"},{"$error":"#N/A"},{"$error":"#N/A"},{"$error":"#N/A"},{"$error":"#N/A"},{"$error":"#N/A"},{"$error":"#N/A"},{"$error":"#N/A"},{"$error":"#N/A"},{"$error":"#N/A"},{"$error":"#N/A"},{"$error":"#N/A"},{"$error":"#N/A"},{"$error":"#N/A"},{"$error":"#N/A"},{"$error":"#N/A"},{"$error":"#N/A"},{"$error":"#N/A"},{"$error":"#N/A"},{"$error":"#N/A"}]
["Cold/Wet","Month-Year","1997-01-01","1997-02-01","1997-03-01","1997-04-01","1997-05-01","1997-06-01","1997-07-01","1997-08-01","1997-09-01","1997-10-01","1997-11-01","1997-12-01","1998-01-01","1998-02-01","1998-03-01","1998-04-01","1998-05-01","1998-06-01","1998-07-01","1998-08-01","1998-09-01","1998-10-01","1998-11-01","1998-12-01","1999-01-01","1999-02-01","1999-03-01","1999-04-01","1999-05-01","1999-06-01","1999-07-01","1999-08-01","1999-09-01","1999-10-01","1999-11-01","1999-12-01"]
[null,"Temp. (°C)",2.7,4.7,5.4,8.3000000000000007,13.5,14.6,17.600000000000001,18.5,15.4,9.9,6.9,4.4000000000000004,3.1,5.5,6.7,8.9,13,16.100000000000001,18.899999999999999,18.8,16,10.1,7,2.9,3.9,3.7,4.7,7.7,9.9,13.7,16.5,18,14.5,9.3000000000000007,6.4,4.3,null,{"$f":"$A$50&\" \"&B51","v":"Cold/Wet Temp. (°C)"},{"$f":"IF(AND($AO$9=TRUE,$AR7=TRUE),C51,#N/A)","v":{"$error":"#N/A"}},{"$error":"#N/A"},{"$error":"#N/A"},{"$error":"#N/A"},{"$error":"#N/A"},{"$error":"#N/A"},{"$error":"#N/A"},{"$error":"#N/A"},{"$error":"#N/A"},{"$error":"#N/A"},{"$f":"IF(AND($AO$9=TRUE,$AR7=TRUE),M51,#N/A)","v":{"$error":"#N/A"}},{"$error":"#N/A"},{"$error":"#N/A"},{"$error":"#N/A"},{"$error":"#N/A"},{"$error":"#N/A"},{"$error":"#N/A"},{"$error":"#N/A"},{"$error":"#N/A"},{"$error":"#N/A"},{"$f":"IF(AND($AO$9=TRUE,$AR7=TRUE),W51,#N/A)","v":{"$error":"#N/A"}},{"$error":"#N/A"},{"$error":"#N/A"},{"$error":"#N/A"},{"$error":"#N/A"},{"$error":"#N/A"},{"$error":"#N/A"},{"$error":"#N/A"},{"$error":"#N/A"},{"$error":"#N/A"},{"$f":"IF(AND($AO$9=TRUE,$AR7=TRUE),AG51,#N/A)","v":{"$error":"#N/A"}},{"$error":"#N/A"},{"$error":"#N/A"},{"$error":"#N/A"},{"$error":"#N/A"},{"$error":"#N/A"}]
[null,"Precipitation (mm)",258.60000000000002,74.900000000000006,278,107,77,85.6,29.8,36.4,113.2,215,156.4,133.6,278.60000000000002,153.80000000000001,94.6,18.2,42.8,25.6,60.8,1.8,18.2,96.2,398,299.2,369,373.2,156.19999999999999,27.2,48.4,44.2,9.1999999999999993,30.4,23.8,168.4,227.8,232.4,null,{"$f":"$A$50&\" \"&B52","v":"Cold/Wet Precipitation (mm)"},{"$error":"#N/A"},{"$error":"#N/A"},{"$error":"#N/A"},{"$error":"#N/A"},{"$error":"#N/A"},{"$error":"#N/A"},{"$error":"#N/A"},{"$error":"#N/A"},{"$error":"#N/A"},{"$error":"#N/A"},{"$error":"#N/A"},{"$error":"#N/A"},{"$error":"#N/A"},{"$error":"#N/A"},{"$error":"#N/A"},{"$error":"#N/A"},{"$error":"#N/A"},{"$error":"#N/A"},{"$error":"#N/A"},{"$error":"#N/A"},{"$error":"#N/A"},{"$error":"#N/A"},{"$error":"#N/A"},{"$error":"#N/A"},{"$error":"#N/A"},{"$error":"#N/A"},{"$error":"#N/A"},{"$error":"#N/A"},{"$error":"#N/A"},{"$error":"#N/A"},{"$error":"#N/A"},{"$error":"#N/A"},{"$error":"#N/A"},{"$error":"#N/A"},{"$error":"#N/A"},{"$error":"#N/A"}]
[null,"Actual Evapotranspiration (mm)",8.0723591286265997,15.6734259690736,23.807359016597751,43.228106897795016,85,94.6,88.8,66.400000000000006,78.900000000000006,42.3,23.7,13.2,8.6659788515795366,17.570084440708268,28.698879603263538,43.2,70.8,64.599999999999994,81.8,21.8,24.2,41.7,22.9,7.5841011804517837,13.9,13.681083039451604,22.866873130777513,43.2,61.4,78.2,53.2,48.4,31.8,42.3,24,14.5,null,{"$f":"$A$50&\" \"&B53","v":"Cold/Wet Actual Evapotranspiration (mm)"},{"$error":"#N/A"},{"$error":"#N/A"},{"$error":"#N/A"},{"$error":"#N/A"},{"$error":"#N/A"},{"$error":"#N/A"},{"$error":"#N/A"},{"$error":"#N/A"},{"$error":"#N/A"},{"$error":"#N/A"},{"$error":"#N/A"},{"$error":"#N/A"},{"$error":"#N/A"},{"$error":"#N/A"},{"$error":"#N/A"},{"$error":"#N/A"},{"$error":"#N/A"},{"$error":"#N/A"},{"$error":"#N/A"},{"$error":"#N/A"},{"$error":"#N/A"},{"$error":"#N/A"},{"$error":"#N/A"},{"$error":"#N/A"},{"$error":"#N/A"},{"$error":"#N/A"},{"$error":"#N/A"},{"$error":"#N/A"},{"$error":"#N/A"},{"$error":"#N/A"},{"$error":"#N/A"},{"$error":"#N/A"},{"$error":"#N/A"},{"$error":"#N/A"},{"$error":"#N/A"},{"$error":"#N/A"}]
[null,"Sum of  Surplus Water (mm)",250.52764087137342,59.226574030926407,254.19264098340224,63.771893102204984,-8,-9,-59,-30,34.299999999999997,172.7,132.69999999999999,120.4,269.93402114842047,136.22991555929175,65.901120396736459,-25,-28,-39,-21,-20,-6,54.5,375.1,291.60000000000002,355.1,359.51891696054838,133.33312686922247,-16,-13,-34,-44,-18,-8,126.1,203.8,217.9,null,{"$f":"$A$50&\" \"&B54","v":"Cold/Wet Sum of  Surplus Water (mm)"},250.52764087137342,59.226574030926407,254.19264098340224,63.771893102204984,-8,-9,-59,-30,34.299999999999997,172.7,132.69999999999999,120.4,269.93402114842047,136.22991555929175,65.901120396736459,-25,-28,-39,-21,-20,-6,54.5,375.1,291.60000000000002,355.1,359.51891696054838,133.33312686922247,-16,-13,-34,-44,-18,-8,126.1,203.8,217.9]
[null,"Soil Moisture Storage (mm)",150,150,150,150,142,133,74,44,78,150,150,150,150,150,150,125,97,58,37,17,11,66,150,150,150,150,150,134,121,87,43,25,17,143,150,150,null,{"$f":"$A$50&\" \"&B55","v":"Cold/Wet Soil Moisture Storage (mm)"},{"$error":"#N/A"},{"$error":"#N/A"},{"$error":"#N/A"},{"$error":"#N/A"},{"$error":"#N/A"},{"$error":"#N/A"},{"$error":"#N/A"},{"$error":"#N/A"},{"$error":"#N/A"},{"$error":"#N/A"},{"$error":"#N/A"},{"$error":"#N/A"},{"$error":"#N/A"},{"$error":"#N/A"},{"$error":"#N/A"},{"$error":"#N/A"},{"$error":"#N/A"},{"$error":"#N/A"},{"$error":"#N/A"},{"$error":"#N/A"},{"$error":"#N/A"},{"$error":"#N/A"},{"$error":"#N/A"},{"$error":"#N/A"},{"$error":"#N/A"},{"$error":"#N/A"},{"$error":"#N/A"},{"$error":"#N/A"},{"$error":"#N/A"},{"$error":"#N/A"},{"$error":"#N/A"},{"$error":"#N/A"},{"$error":"#N/A"},{"$error":"#N/A"},{"$error":"#N/A"},{"$error":"#N/A"}]
[]
[]
[]
[null,null,null,null,null,{"$f":"SUM(C46:N46)","v":1240.5266666666666}]

{"sheet":"Aquifer Summary","index":3,"n_rows":75,"n_cols":15,"rows_kept":75,"cut":false,"hidden":false,"merged":[[43,0,44,0],[43,6,43,8],[43,9,44,9],[61,0,62,0],[61,6,61,8],[61,9,62,9],[0,0,2,9],[3,1,3,9],[7,8,8,8],[7,0,8,0],[7,1,7,3],[7,9,8,9],[7,7,8,7],[7,6,8,6],[7,5,8,5],[7,4,8,4],[7,11,8,11],[7,12,7,14],[25,6,25,8],[25,0,26,0],[25,9,26,9]]}
["Aquifer Summary"]
[]
[]
[null,"Please use the buttons below to navigate to the Cover Sheet or any of the Summary Sheets."]
[null,null,null,null,null,null,null,null,null,null,null,"Table L5"]
[null,null,null,null,null,null,null,null,null,null,null,"Comparison of Recharge Rate by Aquifer and Condition"]
[]
["Aquifer","Infiltration (m3/yr)",null,null,"Groundwater to/from Creek (m3/yr)","Groundwater to/from Ocean (m3/yr)","Groundwater Out to other Aquifer (m3/yr)","Groundwater In from other Aquifers (m3/yr)","Surface Water Contribution (m3/yr)","Water Useage (m3/yr)",null,"Aquifer","Infiltration Rate (m3/yr/m2)"]
[null,"Cold, Wet","30 yr Average","Hot, Dry",null,null,null,null,null,null,null,null,"Cold, Wet","30 yr Average","Hot, Dry"]
["Bedrock 198",{"$f":"SUM('Bedrock 198'!U39:U41)","v":618220.62827709992},{"$f":"SUM('Bedrock 198'!U9:U11)","v":618220.62827709992},{"$f":"SUM('Bedrock 198'!U24:U26)","v":618220.62827709992},{"$f":"SUMIF('Bedrock 198'!D82:D97,\"Koksilah River\",'Bedrock 198'!M82:M97)+SUMIF('Bedrock 198'!D82:D97,\"Inlet\",'Bedrock 198'!M82:M97)","v":-37179.079725782416},{"$f":"SUMIF('Bedrock 198'!D82:D97,\"Ocean\",'Bedrock 198'!M82:M97)","v":0},{"$f":"SUMIFS('Bedrock 198'!M82:M97,'Bedrock 198'!D82:D97,\"AQ*\",'Bedrock 198'!C82:C97,\"Out\")+SUMIFS('Bedrock 198'!M82:M97,'Bedrock 198'!D82:D97,\"Leakage*\",'Bedrock 198'!C82:C97,\"Out\")","v":-20236.021302052788},{"$f":"SUMIFS('Bedrock 198'!M82:M97,'Bedrock 198'!D82:D97,\"AQ*\",'Bedrock 198'!C82:C97,\"In\")+SUMIFS('Bedrock 198'!M82:M97,'Bedrock 198'!D82:D97,\"Leakage*\",'Bedrock 198'!C82:C97,\"In\")","v":788843.98809738969},0,{"$f":"SUM('Bedrock 198'!AB102:AB108)","v":238252},null,"Bedrock 198",{"$f":"SUM('Bedrock 198'!T39)","v":0.1},{"$f":"SUM('Bedrock 198'!T9)","v":0.1},{"$f":"SUM('Bedrock 198'!T24)","v":0.1}]
["Bedrock 200",{"$f":"'Bedrock 200'!$U$39","v":23859859.984642971},{"$f":"'Bedrock 200'!$U$9","v":14377386.530649167},{"$f":"'Bedrock 200'!$U$24","v":9672232.9936894532},{"$f":"SUMIFS('Bedrock 200'!M82:M118,'Bedrock 200'!D82:D118,\"*River\")+SUMIFS('Bedrock 200'!M82:M118,'Bedrock 200'!D82:D118,\"*Creek\")","v":-10990746.507011455},{"$f":"SUMIFS('Bedrock 200'!M82:M118,'Bedrock 200'!D82:D118,\"Ocean\",'Bedrock 200'!C82:C118,\"Out\")","v":0},{"$f":"SUMIFS('Bedrock 200'!M82:M118,'Bedrock 200'!D82:D118,\"N/A\",'Bedrock 200'!C82:C118,\"Out\")+SUMIFS('Bedrock 200'!M82:M118,'Bedrock 200'!D82:D118,\"AQ*\",'Bedrock 200'!C82:C118,\"Out\")","v":-4135103.5492078494},{"$f":"SUMIFS('Bedrock 200'!M82:M118,'Bedrock 200'!D82:D118,\"N/A\",'Bedrock 200'!C82:C118,\"In\")+SUMIFS('Bedrock 200'!M82:M118,'Bedrock 200'!D82:D118,\"AQ*\",'Bedrock 200'!C82:C118,\"In\")","v":674169.6},{"$f":"'Bedrock 200'!I128","v":-1986768},{"$f":"SUM('Bedrock 200'!AB103:AB109)","v":45230},null,"Bedrock 200",{"$f":"'Bedrock 200'!$T$39","v":0.88567021483646413},{"$f":"'Bedrock 200'!$T$9","v":0.53368389527779003},{"$f":"'Bedrock 200'!$T$24","v":0.35903013173517823}]
["Bedrock 202",{"$f":"'Bedrock 202'!$U$39","v":14606582.286023865},{"$f":"'Bedrock 202'!$U$9","v":8801580.5437695086},{"$f":"'Bedrock 202'!$U$24","v":5921169.1603744347},{"$f":"SUMIFS('Bedrock 202'!M82:M129,'Bedrock 202'!D82:D129,\"*River\")+SUMIFS('Bedrock 202'!M82:M129,'Bedrock 202'!D82:D129,\"*Creek\")","v":-680441.42254616064},{"$f":"SUMIFS('Bedrock 202'!M82:M129,'Bedrock 202'!D82:D129,\"Ocean\",'Bedrock 202'!C82:C129,\"Out\")","v":0},{"$f":"SUMIFS('Bedrock 202'!M82:M129,'Bedrock 202'!D82:D129,\"N/A\",'Bedrock 202'!C82:C129,\"Out\")+SUMIFS('Bedrock 202'!M82:M129,'Bedrock 202'!D82:D129,\"AQ*\",'Bedrock 202'!C82:C129,\"Out\")","v":-12571613.272408627},{"$f":"SUMIFS('Bedrock 202'!M82:M129,'Bedrock 202'!D82:D129,\"N/A\",'Bedrock 202'!C82:C129,\"In\")+SUMIFS('Bedrock 202'!M82:M129,'Bedrock 202'!D82:D129,\"AQ*\",'Bedrock 202'!C82:C129,\"In\")+SUMIFS('Bedrock 202'!M82:M129,'Bedrock 202'!D82:D129,\"Leakage*\",'Bedrock 202'!C82:C129,\"In\")","v":633789.9},{"$f":"'Bedrock 202'!I137","v":1173139.2},{"$f":"SUM('Bedrock 202'!AB104:AB110)","v":191855},null,"Bedrock 202",{"$f":"'Bedrock 202'!$T$39","v":0.7734727058327262},{"$f":"'Bedrock 202'!$T$9","v":0.4660763336340511},{"$f":"'Bedrock 202'!$T$24","v":0.31354786783697464}]
["Bedrock 203",{"$f":"'Bedrock 203'!$U$39","v":25782231.433713574},{"$f":"'Bedrock 203'!$U$9","v":15535762.036480358},{"$f":"'Bedrock 203'!$U$24","v":10451517.724102573},{"$f":"SUMIFS('Bedrock 203'!M82:M117,'Bedrock 203'!D82:D117,\"*river\")+SUMIFS('Bedrock 203'!M82:M117,'Bedrock 203'!D82:D117,\"*creek\")","v":0},{"$f":"SUMIFS('Bedrock 203'!M82:M117,'Bedrock 203'!D82:D117,\"ocean\")","v":0},{"$f":"SUMIFS('Bedrock 203'!M82:M117,'Bedrock 203'!D82:D117,\"N/A\",'Bedrock 203'!C82:C117,\"Out\")+SUMIFS('Bedrock 203'!M82:M117,'Bedrock 203'!D82:D117,\"AQ*\",'Bedrock 203'!C82:C117,\"Out\")","v":-5851.6137425454544},{"$f":"SUMIFS('Bedrock 203'!M82:M117,'Bedrock 203'!D82:D117,\"N/A\",'Bedrock 203'!C82:C117,\"In\")+SUMIFS('Bedrock 203'!M82:M117,'Bedrock 203'!D82:D117,\"AQ*\",'Bedrock 203'!C82:C117,\"In\")","v":37954.561736002586},{"$f":"'Bedrock 203'!I125","v":-16339122.344560001},{"$f":"SUM('Bedrock 203'!AB103:AB109)","v":492906},null,"Bedrock 203",{"$f":"'Bedrock 203'!$T$39","v":0.83123379174714462},{"$f":"'Bedrock 203'!$T$9","v":0.50088179599452332},{"$f":"'Bedrock 203'!$T$24","v":0.33696287032619088}]
["Bedrock 204",{"$f":"'Bedrock 204'!$U$39","v":6874387.9772776626},{"$f":"'Bedrock 204'!$U$9","v":4142343.3823409914},{"$f":"'Bedrock 204'!$U$24","v":2786717.1998512489},{"$f":"SUMIFS('Bedrock 204'!M82:M135,'Bedrock 204'!D82:D135,\"*River\")+SUMIFS('Bedrock 204'!M82:M135,'Bedrock 204'!D82:D135,\"*CREEK\")","v":-2953635.8536422085},{"$f":"SUMIFS('Bedrock 204'!M82:M135,'Bedrock 204'!D82:D135,\"OCEAN\")","v":-4465004.9051456461},{"$f":"SUMIFS('Bedrock 204'!M82:M135,'Bedrock 204'!D82:D135,\"N/A\",'Bedrock 204'!C82:C135,\"Out\")+SUMIFS('Bedrock 204'!M82:M135,'Bedrock 204'!D82:D135,\"AQ*\",'Bedrock 204'!C82:C135,\"Out\")+SUMIFS('Bedrock 204'!M82:M135,'Bedrock 204'!D82:D135,\"Leakage*\",'Bedrock 204'!C82:C135,\"Out\")+SUMIFS('Bedrock 204'!M82:M135,'Bedrock 204'!D82:D135,\"Under*\",'Bedrock 204'!C82:C135,\"Out\")","v":-5070479.5310835205},{"$f":"SUMIFS('Bedrock 204'!M82:M135,'Bedrock 204'!D82:D135,\"N/A\",'Bedrock 204'!C82:C135,\"In\")+SUMIFS('Bedrock 204'!M82:M135,'Bedrock 204'!D82:D135,\"AQ*\",'Bedrock 204'!C82:C135,\"In\")+SUMIFS('Bedrock 204'!M82:M135,'Bedrock 204'!D82:D135,\"Leakage*\",'Bedrock 204'!C82:C135,\"In\")+SUMIFS('Bedrock 204'!M82:M135,'Bedrock 204'!D82:D135,\"Under*\",'Bedrock 204'!C82:C135,\"In\")","v":11921102.057419427},{"$f":"'Bedrock 204'!I143","v":978246.72000000009},{"$f":"SUM('Bedrock 204'!AB103:AB109)","v":608120},null,"Bedrock 204",{"$f":"'Bedrock 204'!$T$39","v":0.60019958188768696},{"$f":"'Bedrock 204'!$T$9","v":0.36166605293943083},{"$f":"'Bedrock 204'!$T$24","v":0.2433069683757228}]
["Bedrock 207",{"$f":"'Bedrock 207'!$U$39","v":16022181.775905276},{"$f":"'Bedrock 207'!$U$9","v":9654587.2693628054},{"$f":"'Bedrock 207'!$U$24","v":6495020.31041025},{"$f":"SUMIFS('Bedrock 207'!M82:M126,'Bedrock 207'!D82:D126,\"*River\")+SUMIFS('Bedrock 207'!M82:M126,'Bedrock 207'!D82:D126,\"*creek\")","v":-2614056.7665204024},{"$f":"SUMIFS('Bedrock 207'!M82:M126,'Bedrock 207'!D82:D126,\"ocean\")","v":-6854892.2454667203},{"$f":"SUMIFS('Bedrock 207'!M82:M126,'Bedrock 207'!D82:D126,\"AQ*\",'Bedrock 207'!C82:C126,\"out\")+SUMIFS('Bedrock 207'!M82:M126,'Bedrock 207'!D82:D126,\"N/A*\",'Bedrock 207'!C82:C126,\"out\")+SUMIFS('Bedrock 207'!M82:M126,'Bedrock 207'!D82:D126,\"Leakage*\",'Bedrock 207'!C82:C126,\"out\")","v":-6623.1392208440357},{"$f":"SUMIFS('Bedrock 207'!M82:M126,'Bedrock 207'!D82:D126,\"AQ*\",'Bedrock 207'!C82:C126,\"in\")+SUMIFS('Bedrock 207'!M82:M126,'Bedrock 207'!D82:D126,\"N/A*\",'Bedrock 207'!C82:C126,\"in\")+SUMIFS('Bedrock 207'!M82:M126,'Bedrock 207'!D82:D126,\"Leakage*\",'Bedrock 207'!C82:C126,\"in\")","v":1348314.6875564684},{"$f":"'Bedrock 207'!I135","v":1793767.6800000002},{"$f":"SUM('Bedrock 207'!AB101:AB107)","v":413057},null,"Bedrock 207",{"$f":"'Bedrock 207'!$T$39","v":0.71114747997127603},{"$f":"'Bedrock 207'!$T$9","v":0.42852062863842977},{"$f":"'Bedrock 207'!$T$24","v":0.28828266903428817}]
["Surficial 197",{"$f":"'Surficial AQ 197'!$U$39","v":17836680.627186712},{"$f":"'Surficial AQ 197'!$U$9","v":10747961.30261711},{"$f":"'Surficial AQ 197'!$U$24","v":7230575.9954675753},{"$f":"SUMIF('Surficial AQ 197'!D83:D95,\"Shawnigan Creek\",'Surficial AQ 197'!M83:M95)","v":0},{"$f":"SUMIF('Surficial AQ 197'!D83:D95,\"Ocean\",'Surficial AQ 197'!M83:M95)","v":-3220260.3067669175},{"$f":"SUMIFS('Surficial AQ 197'!M83:M95,'Surficial AQ 197'!D83:D95,\"AQ*\",'Surficial AQ 197'!C83:C95,\"Out\")","v":-2661205.5529411761},{"$f":"SUMIFS('Surficial AQ 197'!M83:M95,'Surficial AQ 197'!D83:D95,\"AQ*\",'Surficial AQ 197'!C83:C95,\"In\")","v":271672.90406534134},{"$f":"'Surficial AQ 197'!I101","v":-741332.7},{"$f":"SUM('Surficial AQ 197'!AB106:AB112)","v":4576581},null,"Surficial 197",{"$f":"'Surficial AQ 197'!$T$39","v":0.60768987587391843},{"$f":"'Surficial AQ 197'!$T$9","v":0.36617952669567078},{"$f":"'Surficial AQ 197'!$T$24","v":0.24634335956463552}]
["Surficial 199",{"$f":"'Surficial AQ 199'!$U$39","v":2243461.8523595352},{"$f":"'Surficial AQ 199'!$U$9","v":1351856.9781591222},{"$f":"'Surficial AQ 199'!$U$24","v":909447.32125175756},{"$f":"SUMIFS('Surficial AQ 199'!M82:M88,'Surficial AQ 199'!D82:D88,\"*river\")+SUMIFS('Surficial AQ 199'!M82:M88,'Surficial AQ 199'!D82:D88,\"*creek\")","v":-2056385.2075471699},{"$f":"SUMIFS('Surficial AQ 199'!M82:M88,'Surficial AQ 199'!D82:D88,\"ocean*\")","v":0},{"$f":"SUMIFS('Surficial AQ 199'!M82:M88,'Surficial AQ 199'!D82:D88,\"AQ*\",'Surficial AQ 199'!C82:C88,\"out\")+SUMIFS('Surficial AQ 199'!M82:M88,'Surficial AQ 199'!D82:D88,\"leakage*\",'Surficial AQ 199'!C82:C88,\"out\")+SUMIFS('Surficial AQ 199'!M82:M88,'Surficial AQ 199'!D82:D88,\"n/a*\",'Surficial AQ 199'!C82:C88,\"out\")","v":-79659.7063585},{"$f":"SUMIFS('Surficial AQ 199'!M82:M88,'Surficial AQ 199'!D82:D88,\"AQ*\",'Surficial AQ 199'!C82:C88,\"in\")+SUMIFS('Surficial AQ 199'!M82:M88,'Surficial AQ 199'!D82:D88,\"leakage*\",'Surficial AQ 199'!C82:C88,\"in\")+SUMIFS('Surficial AQ 199'!M82:M88,'Surficial AQ 199'!D82:D88,\"n/a*\",'Surficial AQ 199'!C82:C88,\"in\")","v":1778226.3627886132},{"$f":"'Surficial AQ 199'!I94","v":0},{"$f":"SUM('Surficial AQ 199'!AB102:AB108)","v":295251},null,"Surficial 199",{"$f":"'Surficial AQ 199'!$T$39","v":0.68398227206083384},{"$f":"'Surficial AQ 199'!$T$9","v":0.41215151773143971},{"$f":"'Surficial AQ 199'!$T$24","v":0.2772705247718773}]
["Surficial 201",{"$f":"'Surficial AQ 201'!$U$39","v":1405296.6371976582},{"$f":"'Surficial AQ 201'!$U$9","v":846798.47057847306},{"$f":"'Surficial AQ 201'!$U$24","v":569674.61288425571},{"$f":"'Surficial AQ 201'!M82","v":-2759.4000000000005},0,{"$f":"'Surficial AQ 201'!M83","v":-633789.9},0,{"$f":"'Surficial AQ 201'!I89","v":157680},{"$f":"SUM('Surficial AQ 201'!AB102:AB108)","v":44135},null,"Surficial 201",{"$f":"'Surficial AQ 201'!$T$39","v":0.66518728280600403},{"$f":"'Surficial AQ 201'!$T$9","v":0.40082610234635313},{"$f":"'Surficial AQ 201'!$T$24","v":0.26965147271945078}]
["Surficial 205",{"$f":"'Surficial AQ 205'!$U$39","v":1710341.9441768844},{"$f":"'Surficial AQ 205'!$U$9","v":1030611.5478816797},{"$f":"'Surficial AQ 205'!$U$24","v":693332.89439276501},{"$f":"'Surficial AQ 205'!M83","v":-302745.60000000003},0,{"$f":"'Surficial AQ 205'!M82+'Surficial AQ 205'!M84","v":-656114.31903600006},0,{"$f":"'Surficial AQ 205'!I90","v":-170294.39999999999},{"$f":"SUM('Surficial AQ 205'!AB102:AB108)","v":132804},null,"Surficial 205",{"$f":"'Surficial AQ 205'!$T$39","v":0.62679928622129988},{"$f":"'Surficial AQ 205'!$T$9","v":0.3776944047843907},{"$f":"'Surficial AQ 205'!$T$24","v":0.25408987062425015}]
["Surficial 206",{"$f":"'Surficial AQ 206'!$U$39","v":1515071.4957186573},{"$f":"'Surficial AQ 206'!$U$9","v":912946.2004192837},{"$f":"'Surficial AQ 206'!$U$24","v":614174.79055285023},{"$f":"'Surficial AQ 206'!M83","v":-108799.20000000001},{"$f":"'Surficial AQ 206'!M82","v":-264902.40000000002},{"$f":"'Surficial AQ 206'!M84","v":-772053.22463399998},0,{"$f":"'Surficial AQ 206'!I91","v":18921.600000000006},{"$f":"SUM('Surficial AQ 206'!AB101:AB107)","v":575590},null,"Surficial 206",{"$f":"'Surficial AQ 206'!$T$39","v":0.58871776480315574},{"$f":"'Surficial AQ 206'!$T$9","v":0.35474738189925009},{"$f":"'Surficial AQ 206'!$T$24","v":0.23865250644241773}]
["Total",{"$f":"SUM(B10:B20)","v":112474316.64247991},{"$f":"SUM(C10:C20)","v":68020054.890535593},45962083.631254256,-19746749.036993179,-14805059.857379284,-26612729.829935115,17454074.06166324,-15115762.244560001,7613781]
[null,"Based on Leakage from AQ 197 and AQ 199",null,null,null,null,null,null,null,null,null,null,"Leakage from above"]
[]
[]
["Table L3","Summary of Water balance Gains/Losses by Aquifer for Average Annual Conditions (m3/year)"]
["Aquifer",null,null,null,null,null,"Average Year",null,null,"Total Useage"]
[null,null,"Ave. Recharge",null,null,"Spreadsheet Check","Gains","Losses","Water Balance","Total Useage"]
[{"$f":"A16","v":"Surficial 197"},null,{"$f":"C16","v":10747961.30261711},null,null,{"$f":"H28+G28","v":-4140184.2194996439},{"$f":"'Surficial AQ 197'!$U$18","v":11019634.206682451},{"$f":"'Surficial AQ 197'!$U$19","v":-15159818.426182095},{"$f":"'Surficial AQ 197'!$U$20","v":-4140184.2194996439},{"$f":"J16","v":4576581}]
[{"$f":"A10","v":"Bedrock 198"},null,{"$f":"C10","v":618220.62827709992},null,null,{"$f":"H29+G29","v":531739.50820815447},{"$f":"'Bedrock 198'!$U$17","v":827406.60923598963},{"$f":"'Bedrock 198'!$U$18","v":-295667.10102783522},{"$f":"'Bedrock 198'!$U$19","v":531739.50820815447},{"$f":"J10","v":238252}]
[{"$f":"A17","v":"Surficial 199"},null,{"$f":"C17","v":1351856.9781591222},null,null,450447.13340056501,{"$f":"'Surficial AQ 199'!$U$17","v":3130083.3409477351},{"$f":"'Surficial AQ 199'!$U$18","v":-2679636.2075471701},{"$f":"'Surficial AQ 199'!$U$19","v":450447.13340056501},{"$f":"J17","v":295251}]
[{"$f":"A11","v":"Bedrock 200"},null,{"$f":"C11","v":14377386.530649167},null,null,-2106291.9255701397,{"$f":"'Bedrock 200'!$U$15","v":15051556.130649166},{"$f":"'Bedrock 200'!$U$16","v":-17157848.056219306},{"$f":"'Bedrock 200'!$U$17","v":-2106291.9255701397},{"$f":"J11","v":45230}]
[{"$f":"A18","v":"Surficial 201"},null,{"$f":"C18","v":846798.47057847306},null,null,{"$f":"H32+G32","v":323794.17057847301},{"$f":"'Surficial AQ 201'!$U$16","v":1004478.4705784731},{"$f":"'Surficial AQ 201'!$U$17","v":-680684.3},{"$f":"'Surficial AQ 201'!$U$18","v":323794.17057847301},{"$f":"J18","v":44135}]
[{"$f":"A12","v":"Bedrock 202"},null,{"$f":"C12","v":8801580.5437695086},null,null,-2835400.0511852726,{"$f":"'Bedrock 202'!$U$16","v":14304227.192104917},{"$f":"'Bedrock 202'!$U$17","v":-17139627.24329019},{"$f":"'Bedrock 202'!$U$18","v":-2835400.0511852726},{"$f":"J12","v":191855}]
[{"$f":"A13","v":"Bedrock 203"},null,{"$f":"C13","v":15535762.036480358},null,null,-1264163.3600861859,{"$f":"'Bedrock 203'!$U$15","v":15573716.59821636},{"$f":"'Bedrock 203'!$U$16","v":-16837879.958302546},{"$f":"'Bedrock 203'!$U$17","v":-1264163.3600861859},{"$f":"J13","v":492906}]
[{"$f":"A14","v":"Bedrock 204"},null,{"$f":"C14","v":4142343.3823409914},null,null,3944451.8698890395,{"$f":"'Bedrock 204'!$U$16","v":17558812.008871146},{"$f":"'Bedrock 204'!$U$17","v":-13614360.138982106},{"$f":"'Bedrock 204'!$U$18","v":3944451.8698890395},{"$f":"J14","v":608120}]
[{"$f":"A19","v":"Surficial 205"},null,{"$f":"C19","v":1030611.5478816797},null,null,{"$f":"H36+G36","v":-231346.77115432022},{"$f":"'Surficial AQ 205'!$U$16","v":1030611.5478816797},{"$f":"'Surficial AQ 205'!$U$17","v":-1261958.3190359999},{"$f":"'Surficial AQ 205'!$U$18","v":-231346.77115432022},{"$f":"J19","v":132804}]
[{"$f":"A20","v":"Surficial 206"},null,{"$f":"C20","v":912946.2004192837},null,null,{"$f":"H37+G37","v":-789477.0242147164},{"$f":"'Surficial AQ 206'!$U$16","v":1140005.4004192837},{"$f":"'Surficial AQ 206'!$U$17","v":-1929482.4246340001},{"$f":"'Surficial AQ 206'!$U$18","v":-789477.0242147164},{"$f":"J20","v":575590}]
[{"$f":"A15","v":"Bedrock 207"},null,{"$f":"C15","v":9654587.2693628054},null,null,2908040.4857113082,{"$f":"'Bedrock 207'!$U$17","v":12796669.636919271},{"$f":"'Bedrock 207'!$U$18","v":-9888629.151207963},{"$f":"'Bedrock 207'!$U$19","v":2908040.4857113082},{"$f":"J15","v":413057}]
[null,null,{"$f":"SUM(C28:C38)","v":68020054.890535593},null,null,{"$f":"SUM(F28:F38)","v":-3208390.1839227378},{"$f":"SUM(G28:G38)","v":93437201.142506465},{"$f":"SUM(H28:H38)","v":-96645591.326429203},{"$f":"SUM(I28:I38)","v":-3208390.1839227378},{"$f":"SUM(J28:J38)","v":7613781}]
[]
[]
[]
["Table L2","Summary of Water balance Gains/Losses by Aquifer for Wet/Cold Conditions (m3/year)"]
["Aquifer",null,null,null,null,null,"Average Year",null,null,"Total Useage"]
[null,"Cold, Wet",null,null,null,"Spreadsheet Check","Gains","Losses","Water Balance","Total Useage"]
[{"$f":"A28","v":"Surficial 197"},{"$f":"B16","v":17836680.627186712},null,null,null,{"$f":"H46+G46","v":2948535.1050699577},{"$f":"'Surficial AQ 197'!$U$48","v":18108353.531252053},{"$f":"'Surficial AQ 197'!$U$49","v":-15159818.426182095},{"$f":"'Surficial AQ 197'!$U$50","v":2948535.1050699577},{"$f":"J16","v":4576581}]
[{"$f":"A29","v":"Bedrock 198"},{"$f":"B10","v":618220.62827709992},null,null,null,{"$f":"H47+G47","v":531739.50820815447},{"$f":"'Bedrock 198'!$U$47","v":827406.60923598963},{"$f":"'Bedrock 198'!$U$48","v":-295667.10102783522},{"$f":"'Bedrock 198'!$U$49","v":531739.50820815447},{"$f":"J10","v":238252}]
[{"$f":"A30","v":"Surficial 199"},{"$f":"B17","v":2243461.8523595352},null,null,null,1342052.007600978,{"$f":"'Surficial AQ 199'!$U$47","v":4021688.2151481481},{"$f":"'Surficial AQ 199'!$U$48","v":-2679636.2075471701},{"$f":"'Surficial AQ 199'!$U$49","v":1342052.007600978},{"$f":"J17","v":295251}]
[{"$f":"A31","v":"Bedrock 200"},{"$f":"B11","v":23859859.984642971},null,null,null,7376181.528423667,{"$f":"'Bedrock 200'!$U$45","v":24534029.584642973},{"$f":"'Bedrock 200'!$U$46","v":-17157848.056219306},{"$f":"'Bedrock 200'!$U$47","v":7376181.528423667},{"$f":"J11","v":45230}]
[{"$f":"A32","v":"Surficial 201"},{"$f":"B18","v":1405296.6371976582},null,null,null,{"$f":"H50+G50","v":882292.33719765814},{"$f":"'Surficial AQ 201'!$U$46","v":1562976.6371976582},{"$f":"'Surficial AQ 201'!$U$47","v":-680684.3},{"$f":"J38='Surficial AQ 201'!$U$48","v":false},{"$f":"J18","v":44135}]
["Bedrock 202",{"$f":"B12","v":14606582.286023865},null,null,null,{"$f":"H51+G51","v":2969601.6910690814},{"$f":"'Bedrock 202'!$U$46","v":20109228.934359271},{"$f":"'Bedrock 202'!$U$47","v":-17139627.24329019},{"$f":"'Bedrock 202'!$U$48","v":2969601.6910690814},{"$f":"J12","v":191855}]
["Bedrock 203",{"$f":"B13","v":25782231.433713574},null,null,null,8976847.4422379397,{"$f":"'Bedrock 203'!$U$45","v":25814334.381707031},{"$f":"'Bedrock 203'!$U$46","v":-16837486.939469092},{"$f":"'Bedrock 203'!$U$47","v":8976847.4422379397},{"$f":"J13","v":492906}]
["Bedrock 204",{"$f":"B14","v":6874387.9772776626},null,null,null,6676496.4648257084,{"$f":"'Bedrock 204'!$U$46","v":20290856.603807814},{"$f":"'Bedrock 204'!$U$47","v":-13614360.138982106},{"$f":"'Bedrock 204'!$U$48","v":6676496.4648257084},{"$f":"J14","v":608120}]
["Surficial 205",{"$f":"B19","v":1710341.9441768844},null,null,null,{"$f":"H54+G54","v":448383.62514088443},{"$f":"'Surficial AQ 205'!$U$46","v":1710341.9441768844},{"$f":"'Surficial AQ 205'!$U$47","v":-1261958.3190359999},{"$f":"'Surficial AQ 205'!$U$48","v":448383.62514088443},{"$f":"J19","v":132804}]
["Surficial 206",{"$f":"B20","v":1515071.4957186573},null,null,null,{"$f":"H55+G55","v":-187351.72891534283},{"$f":"'Surficial AQ 206'!$U$46","v":1742130.6957186572},{"$f":"'Surficial AQ 206'!$U$47","v":-1929482.4246340001},{"$f":"'Surficial AQ 206'!$U$48","v":-187351.72891534283},{"$f":"J20","v":575590}]
["Bedrock 207",{"$f":"B15","v":16022181.775905276},null,null,null,{"$f":"H56+G56","v":9275634.9922537822},{"$f":"'Bedrock 207'!$U$47","v":19164264.143461745},{"$f":"'Bedrock 207'!$U$48","v":-9888629.151207963},{"$f":"'Bedrock 207'!$U$49","v":9275634.9922537822},{"$f":"J15","v":413057}]
[null,{"$f":"SUM(B46:B56)","v":112474316.64247991},null,null,null,{"$f":"SUM(F46:F56)","v":41240412.973112471},{"$f":"SUM(G46:G56)","v":137885611.28070822},{"$f":"SUM(H46:H56)","v":-96645198.307595745},{"$f":"SUM(I46:I56)","v":40358120.63591481},{"$f":"SUM(J46:J56)","v":7613781}]
[]
[]
[]
["Table L4","Summary of Water balance Gains/Losses by Aquifer for Hot - Dry Conditions (m3/year)"]
["Aquifer",null,null,null,null,null,"Average Year",null,null,"Total Useage"]
[null,null,null,"Hot, Dry",null,"Spreadsheet Check","Gains","Losses","Water Balance","Total Useage"]
[{"$f":"A46","v":"Surficial 197"},null,null,{"$f":"D16","v":7230575.9954675753},null,{"$f":"H64+G64","v":-7657569.526649178},{"$f":"'Surficial AQ 197'!$U$33","v":7502248.899532917},{"$f":"'Surficial AQ 197'!$U$34","v":-15159818.426182095},{"$f":"'Surficial AQ 197'!$U$35","v":-7657569.526649178},{"$f":"J16","v":4576581}]
["Bedrock 198",null,null,{"$f":"D10","v":618220.62827709992},null,{"$f":"H65+G65","v":531739.50820815447},{"$f":"'Bedrock 198'!$U$32","v":827406.60923598963},{"$f":"'Bedrock 198'!$U$33","v":-295667.10102783522},{"$f":"'Bedrock 198'!$U$34","v":531739.50820815447},{"$f":"J10","v":238252}]
["Surficial 199",null,null,{"$f":"D17","v":909447.32125175756},null,8037.4764932007529,{"$f":"'Surficial AQ 199'!$U$32","v":2687673.6840403709},{"$f":"'Surficial AQ 199'!$U$33","v":-2679636.2075471701},{"$f":"'Surficial AQ 199'!$U$34","v":8037.4764932007529},{"$f":"J17","v":295251}]
["Bedrock 200",null,null,{"$f":"D11","v":9672232.9936894532},null,-6811445.462529853,{"$f":"'Bedrock 200'!$U$30","v":10346402.593689453},{"$f":"'Bedrock 200'!$U$31","v":-17157848.056219306},{"$f":"'Bedrock 200'!$U$32","v":-6811445.462529853},{"$f":"J11","v":45230}]
["Surficial 201",null,null,{"$f":"D18","v":569674.61288425571},null,{"$f":"H68+G68","v":46670.312884255662},{"$f":"'Surficial AQ 201'!$U$31","v":727354.61288425571},{"$f":"'Surficial AQ 201'!$U$32","v":-680684.3},{"$f":"'Surficial AQ 201'!$U$33","v":46670.312884255662},{"$f":"J18","v":44135}]
["Bedrock 202",null,null,{"$f":"D12","v":5921169.1603744347},null,{"$f":"H69+G69","v":-5715811.4345803466},{"$f":"'Bedrock 202'!$U$31","v":11423815.808709843},{"$f":"'Bedrock 202'!$U$32","v":-17139627.24329019},{"$f":"'Bedrock 202'!$U$33","v":-5715811.4345803466},{"$f":"J12","v":191855}]
["Bedrock 203",null,null,{"$f":"D13","v":10451517.724102573},null,-6328151.4239608031,{"$f":"'Bedrock 203'!$U$30","v":10509728.534341743},{"$f":"'Bedrock 203'!$U$31","v":-16837879.958302546},{"$f":"'Bedrock 203'!$U$32","v":-6328151.4239608031},{"$f":"J13","v":492906}]
["Bedrock 204",null,null,{"$f":"D14","v":2786717.1998512489},null,2588825.6873992998,{"$f":"'Bedrock 204'!$U$31","v":16203185.826381406},{"$f":"'Bedrock 204'!$U$32","v":-13614360.138982106},{"$f":"'Bedrock 204'!$U$33","v":2588825.6873992998},{"$f":"J14","v":608120}]
["Surficial 205",null,null,{"$f":"D19","v":693332.89439276501},null,{"$f":"H72+G72","v":-568625.42464323493},{"$f":"'Surficial AQ 205'!$U$31","v":693332.89439276501},{"$f":"'Surficial AQ 205'!$U$32","v":-1261958.3190359999},{"$f":"'Surficial AQ 205'!$U$33","v":-568625.42464323493},{"$f":"J19","v":132804}]
["Surficial 206",null,null,{"$f":"D20","v":614174.79055285023},null,{"$f":"H73+G73","v":-1088248.4340811498},{"$f":"'Surficial AQ 206'!$U$31","v":841233.9905528503},{"$f":"'Surficial AQ 206'!$U$32","v":-1929482.4246340001},{"$f":"'Surficial AQ 206'!$U$33","v":-1088248.4340811498},{"$f":"J20","v":575590}]
["Bedrock 207",null,null,{"$f":"D15","v":6495020.31041025},null,{"$f":"H74+G74","v":-251526.47324124351},{"$f":"'Bedrock 207'!$U$32","v":9637102.6779667195},{"$f":"'Bedrock 207'!$U$33","v":-9888629.151207963},{"$f":"'Bedrock 207'!$U$34","v":-251526.47324124351},{"$f":"J15","v":413057}]
[null,null,null,{"$f":"SUM(D64:D74)","v":45962083.631254271},null,{"$f":"SUM(F64:F74)","v":-25246105.194700897},{"$f":"SUM(G64:G74)","v":71399486.131728321},{"$f":"SUM(H64:H74)","v":-96645591.326429203},{"$f":"SUM(I64:I74)","v":-25246105.194700897},{"$f":"SUM(J64:J74)","v":7613781}]

{"sheet":"Summary Graphs","index":4,"n_rows":49,"n_cols":27,"rows_kept":49,"cut":false,"hidden":true,"merged":[]}
["Figure M-1: Temperature",null,null,null,null,null,null,null,null,null,null,null,null,"Figure M-4: Precipitation",null,null,null,null,null,null,null,null,null,null,null,null,"Figure M-6: Conditions during Cold/Wet Year"]
[]
[]
[]
[]
[]
[]
[]
[]
[]
[]
[]
[]
[]
[]
[]
[]
[null,null,null,null,null,null,null,null,null,"Sum of Surplus Water"]
[]
[]
[]
[null,null,null,null,null,null,null,null,null,null,null,null,null,null,null,null,null,"Average"]
[]
[]
["Figure M-2: Actual Evapotranspiration",null,null,null,null,null,null,null,null,null,null,null,null,"Figure M-5: Sum of Surplus Water",null,null,null,null,null,null,null,null,null,null,null,null,"Figure M-7: Conditions during the 30 Year Average"]
[]
[]
[]
[]
[]
[]
[]
[]
[]
[]
[]
[]
[]
[]
[]
[]
[]
[]
[]
[]
[]
[]
[]
["Figure M-3: Potential Soil Water",null,null,null,null,null,null,null,null,null,null,null,null,null,null,null,null,null,null,null,null,null,null,null,null,null,"Figure M-8: Conditions during Hot/Dry Year"]

{"sheet":"Monthly Factors","index":5,"n_rows":52,"n_cols":14,"rows_kept":52,"cut":false,"hidden":false,"merged":[[0,0,2,13],[3,0,3,13]]}
["Monthly Water Balance Factors"]
[]
[]
["Please use the buttons below to navigate to the Cover Sheet or any of the Summary Sheets."]
[]
[]
[]
["Surplus Water Monthly Factors - Hot/Dry (1989)"]
["Month","Jan","Feb","Mar","Apr","May","Jun","Jul","Aug","Sep","Oct","Nov","Dec","Sum"]
["Sum of Surplus Water (mm)",{"$f":"'Climate Dashboard'!AA42","v":156.94890623394403},{"$f":"'Climate Dashboard'!AB42","v":90},{"$f":"'Climate Dashboard'!AC42","v":139.94143968762543},{"$f":"'Climate Dashboard'!AD42","v":8.4},{"$f":"'Climate Dashboard'!AE42","v":-33},{"$f":"'Climate Dashboard'!AF42","v":-42},{"$f":"'Climate Dashboard'!AG42","v":-36},{"$f":"'Climate Dashboard'!AH42","v":-15},{"$f":"'Climate Dashboard'!AI42","v":-10},{"$f":"'Climate Dashboard'!AJ42","v":25.5},{"$f":"'Climate Dashboard'!AK42","v":100.1},{"$f":"'Climate Dashboard'!AL42","v":127},{"$f":"SUM(B10:M10)","v":511.89034592156941}]
["Factor",{"$f":"B10/$N$10","v":0.30660649782598431},0.17581890480464263,0.27338167402959174,1.6409764448433315E-2,-6.4466931761702304E-2,-8.2048822242166558E-2,-7.032756192185706E-2,-2.9303150800773774E-2,-1.9535433867182515E-2,4.9815356361315413E-2,0.19554969301049696,0.24810001011321794,{"$f":"SUM(B11:M11)","v":1.0000000000000002}]
[]
["Surplus Water Monthly Factors - Average Year"]
["Month","Jan","Feb","Mar","Apr","May","Jun","Jul","Aug","Sep","Oct","Nov","Dec","Sum"]
["Sum of Surplus Water (mm)",{"$f":"'Climate Dashboard'!AA48","v":191.34335887234138},{"$f":"'Climate Dashboard'!AB48","v":124.63369579528025},{"$f":"'Climate Dashboard'!AC48","v":89.944532840826099},{"$f":"'Climate Dashboard'!AD48","v":21.600272274730493},{"$f":"'Climate Dashboard'!AE48","v":-26},{"$f":"'Climate Dashboard'!AF48","v":-41},{"$f":"'Climate Dashboard'!AG48","v":-40},{"$f":"'Climate Dashboard'!AH48","v":-18},{"$f":"'Climate Dashboard'!AI48","v":-6},{"$f":"'Climate Dashboard'!AJ48","v":65.783091976958758},{"$f":"'Climate Dashboard'!AK48","v":201.83743723858561},{"$f":"'Climate Dashboard'!AL48","v":196.76208563746911},{"$f":"SUM(B15:M15)","v":760.90447463619171}]
["Factor",{"$f":"B15/$N$15","v":0.25146830548450599},0.16379677075085,0.1182073911233482,2.8387626824061124E-2,-3.4169860825738051E-2,-5.3883242071356162E-2,-5.2569016654981621E-2,-2.3656057494741728E-2,-7.8853524982472421E-3,8.6453811443823317E-2,0.26525988999485034,0.25858973392362583,{"$f":"SUM(B16:M16)","v":1}]
[]
["Surplus Water Monthly Factors - Cold/Wet (1999)"]
["Month","Jan","Feb","Mar","Apr","May","Jun","Jul","Aug","Sep","Oct","Nov","Dec","Sum"]
["Sum of Surplus Water (mm)",{"$f":"'Climate Dashboard'!AA54","v":355.1},{"$f":"'Climate Dashboard'!AB54","v":359.51891696054838},{"$f":"'Climate Dashboard'!AC54","v":133.33312686922247},{"$f":"'Climate Dashboard'!AD54","v":-16},{"$f":"'Climate Dashboard'!AE54","v":-13},{"$f":"'Climate Dashboard'!AF54","v":-34},{"$f":"'Climate Dashboard'!AG54","v":-44},{"$f":"'Climate Dashboard'!AH54","v":-18},{"$f":"'Climate Dashboard'!AI54","v":-8},{"$f":"'Climate Dashboard'!AJ54","v":126.1},{"$f":"'Climate Dashboard'!AK54","v":203.8},{"$f":"'Climate Dashboard'!AL54","v":217.9},{"$f":"SUM(B20:M20)","v":1262.7520438297711}]
["Factor",{"$f":"B20/$N$20","v":0.28121118610350893},{"$f":"C20/$N$20","v":0.28471061972718881},0.1055893178084587,-1.2670737757409583E-2,-1.0294974427895285E-2,-2.6925317734495361E-2,-3.4844528832876351E-2,-1.425457997708578E-2,-6.3353688787047913E-3,9.9861251950584262E-2,0.16139352218500455,0.17255960983372176,{"$f":"SUM(B21:M21)","v":0.99999999999999989}]
[]
["Shawnigan Stream Flow Monthly Factors"]
["Month","Jan","Feb","Mar","Apr","May","Jun","Jul","Aug","Sep","Oct","Nov","Dec","Total"]
["1977-2006\nAverage Flow (m3/s)",5.881724137931033,5.163666666666666,3.7299999999999995,1.8034666666666668,0.63946666666666685,0.25936666666666663,0.15403333333333336,5.0033333333333339E-2,4.2066666666666662E-2,0.38610000000000011,2.7287000000000003,5.8139999999999992,{"$f":"SUM(B25:M25)","v":26.652624137931028}]
["Factor",{"$f":"B25/$N$25","v":0.22068086457424585},0.19373952223030552,0.13994869625957773,6.7665632372012466E-2,2.399263439717373E-2,9.7313744914725147E-3,5.7792933459831003E-3,1.8772385441074731E-3,1.5783311410150771E-3,1.4486378451963268E-2,0.10238016286421177,0.21813987132793164,{"$f":"SUM(B26:M26)","v":1.0000000000000004}]
["AQ202 Stream Flow (m3)",{"$f":"B26*'Bedrock 202'!$U$14","v":258889.3729219391},{"$f":"C26*'Bedrock 202'!$U$14","v":227283.42811764282},{"$f":"D26*'Bedrock 202'!$U$14","v":164179.30157100401},{"$f":"E26*'Bedrock 202'!$U$14","v":79381.205828396807},{"$f":"F26*'Bedrock 202'!$U$14","v":28146.69992259287},{"$f":"G26*'Bedrock 202'!$U$14","v":11416.256885826473},{"$f":"H26*'Bedrock 202'!$U$14","v":6779.9155724719376},{"$f":"I26*'Bedrock 202'!$U$14","v":2202.2621238434058},{"$f":"J26*'Bedrock 202'!$U$14","v":1851.6021321055146},{"$f":"K26*'Bedrock 202'!$U$14","v":16994.538428033426},{"$f":"L26*'Bedrock 202'!$U$14","v":120106.1823583911},{"$f":"M26*'Bedrock 202'!$U$14","v":255908.43413775266},{"$f":"SUM(B27:M27)","v":1173139.2000000002}]
[]
["Water Consumption Factors"]
["Month","Jan","Feb","Mar","Apr","May","Jun","Jul","Aug","Sep","Oct","Nov","Dec","Total"]
["Factor",0.06,6.5000000000000002E-2,7.4999999999999997E-2,0.08,0.09,0.1,0.11,0.115,0.1,0.08,7.0000000000000007E-2,5.5E-2,{"$f":"SUM(B31:M31)","v":0.99999999999999989}]
["AQ202 Water Consumption (m3)",{"$f":"B31*'Bedrock 202'!$U$15","v":-11511.3},{"$f":"C31*'Bedrock 202'!$U$15","v":-12470.575000000001},{"$f":"D31*'Bedrock 202'!$U$15","v":-14389.125},{"$f":"E31*'Bedrock 202'!$U$15","v":-15348.4},{"$f":"F31*'Bedrock 202'!$U$15","v":-17266.95},{"$f":"G31*'Bedrock 202'!$U$15","v":-19185.5},{"$f":"H31*'Bedrock 202'!$U$15","v":-21104.05},{"$f":"I31*'Bedrock 202'!$U$15","v":-22063.325000000001},{"$f":"J31*'Bedrock 202'!$U$15","v":-19185.5},{"$f":"K31*'Bedrock 202'!$U$15","v":-15348.4},{"$f":"L31*'Bedrock 202'!$U$15","v":-13429.850000000002},{"$f":"M31*'Bedrock 202'!$U$15","v":-10552.025},{"$f":"SUM(B32:M32)","v":-191855}]
[]
["Koksilah Stream Flow Monthly Factors"]
["Month","Jan","Feb","Mar","Apr","May","Jun","Jul","Aug","Sep","Oct","Nov","Dec","Total"]
["1977-2006\nAverage Flow (m3/s)",21.665333333333333,19.207666666666668,13.696,8.1620000000000008,3.2177666666666669,1.6228333333333333,0.83819999999999995,0.40103333333333324,0.60953333333333337,4.7747333333333319,18.522999999999993,21.717333333333336,{"$f":"SUM(B36:M36)","v":114.43543333333332}]
["Factor",{"$f":"B36/$N$36","v":0.1893236448034889},0.16784719651226909,0.119683210008089,7.1324062506280844E-2,2.8118621767209053E-2,1.4181213685854295E-2,7.324654397545283E-3,3.5044506902436683E-3,5.3264388098907605E-3,4.1724256152596083E-2,0.16186420115214892,0.18977804951438415,{"$f":"SUM(B37:M37)","v":1}]
["AQ202 Stream Flow (m3)",{"$f":"B37*'Bedrock 202'!$U$14","v":222102.98920584912},{"$f":"C37*'Bedrock 202'!$U$14","v":196908.12583864614},{"$f":"D37*'Bedrock 202'!$U$14","v":140405.06524232152},{"$f":"E37*'Bedrock 202'!$U$14","v":83673.053629368296},{"$f":"F37*'Bedrock 202'!$U$14","v":32987.057445086211},{"$f":"G37*'Bedrock 202'!$U$14","v":16636.537678452158},{"$f":"H37*'Bedrock 202'!$U$14","v":8592.8392002127548},{"$f":"I37*'Bedrock 202'!$U$14","v":4111.2084791919051},{"$f":"J37*'Bedrock 202'!$U$14","v":6248.6541642841985},{"$f":"K37*'Bedrock 202'!$U$14","v":48948.360483451645},{"$f":"L37*'Bedrock 202'!$U$14","v":189889.23944827105},{"$f":"M37*'Bedrock 202'!$U$14","v":222636.06918486499},{"$f":"SUM(B38:M38)","v":1173139.2000000002}]
[]
["Horizontal Inflow Factors"]
["Month","Jan","Feb","Mar","Apr","May","Jun","Jul","Aug","Sep","Oct","Nov","Dec","Total"]
["Average Factor",8.1000000000000003E-2,7.8E-2,8.6999999999999994E-2,8.5999999999999993E-2,0.09,8.5999999999999993E-2,8.6999999999999994E-2,8.5000000000000006E-2,8.1000000000000003E-2,8.2000000000000003E-2,7.8E-2,7.9000000000000001E-2,{"$f":"SUM(B42:M42)","v":0.99999999999999967}]
["Hot/dry",8.2000000000000003E-2,7.5999999999999998E-2,8.4000000000000005E-2,8.3000000000000004E-2,8.6999999999999994E-2,8.4000000000000005E-2,8.6999999999999994E-2,8.5999999999999993E-2,8.2000000000000003E-2,8.5000000000000006E-2,8.1000000000000003E-2,8.3000000000000004E-2,{"$f":"SUM(B43:M43)","v":0.99999999999999989}]
["Cold/Wet",8.1000000000000003E-2,7.8E-2,8.6999999999999994E-2,8.5999999999999993E-2,0.09,8.5999999999999993E-2,8.6999999999999994E-2,8.5000000000000006E-2,8.1000000000000003E-2,8.2000000000000003E-2,7.8E-2,7.9000000000000001E-2,{"$f":"SUM(B44:M44)","v":0.99999999999999967}]
[]
["Aquifer/Stream Factor"]
["Month","Jan","Feb","Mar","Apr","May","Jun","Jul","Aug","Sep","Oct","Nov","Dec","Total"]
["Factor",8.4000000000000005E-2,7.6999999999999999E-2,8.2000000000000003E-2,7.6999999999999999E-2,8.1000000000000003E-2,0.08,8.6999999999999994E-2,8.7999999999999995E-2,8.5999999999999993E-2,8.8999999999999996E-2,8.3000000000000004E-2,8.5999999999999993E-2,1]
[]
["Irrigation Use Factor"]
["Month","Jan","Feb","Mar","Apr","May","Jun","Jul","Aug","Sep","Oct","Nov","Dec","Total"]
["Factor",0,0,0,0,0.1,0.25,0.3,0.3,0.05,0,0,0,1]

{"sheet":"Bedrock 198","index":6,"n_rows":115,"n_cols":29,"rows_kept":115,"cut":false,"hidden":false,"merged":[[1,2,1,4],[4,2,4,4],[3,2,3,4],[2,2,2,4],[79,1,80,1],[79,2,80,2],[79,3,80,3],[79,4,80,4],[79,5,80,5],[99,11,100,11],[99,2,100,2],[79,12,79,14],[79,9,79,11],[6,16,6,20],[79,6,80,6],[79,7,80,7],[79,8,80,8],[21,16,21,20],[36,16,36,20],[104,1,106,1],[105,5,105,7],[105,8,105,10],[104,2,104,10],[99,3,100,3],[99,4,100,4],[99,5,100,5],[99,6,100,6],[105,2,105,4],[99,1,100,1],[99,7,100,7],[99,8,99,10]]}
[null,"CHM Aquifer Criteria: Aquifer #0198 Cowichan Station (Bedrock)",null,null,null,null,null,null,null,null,null,null,null,null,null,null,null,null,null,null,null,null,"Table A-1"]
[null,"AQ tag","198 Cowichan Station",null,null,null,null,null,null,null,null,null,null,null,null,null,null,null,null,null,null,null,"CHM Aquifer Criteria: Aquifer #0198 Cowichan Station (Bedrock)"]
[null,"Perimeter (km)",16.12]
[null,"Area (km2)",6.18,null,null,null,null,null,null,null,null,null,null,null,null,null,null,null,null,null,null,null,"BCMOE Criteria"]
[null,"Aquifer materials","Bedrock ",null,null,null,null,null,null,null,null,null,null,null,null,null,null,null,null,null,null,null,"AQ tag",null,null,null,"198 Cowichan Station"]
[null,"Table A-3 Monthly  Summary of AQ198 Water Budgets",null,null,null,null,null,null,null,null,null,null,null,null,null,null,"Table A-2 Annual Summary of AQ198 Water Budgets",null,null,null,null,null,"AQ classification",null,null,null,"IIIC(7)"]
[null,"Monthly Gains and Loses (m3)","Average Year",null,null,null,null,null,null,null,null,null,null,null,null,null,"Summary - 30 Year Average",null,null,null,null,null,null,"AQ type",null,null,null,"BCMOE / SLR Classsification = 5a"]
[null,null,"Jan","Feb","Mar","Apr","May","Jun","Jul","Aug","Sep","Oct","Nov","Dec","Total",null,"Gains and Losses","Source","Area (m2)","Infiltration/Exfiltration Factor","Q (m3/yr)",null,null,"Location",null,null,null,"Cowichan Station / Duncan South of Koksilah River;                                                                                                                                                     west-southwest of Cowichan Bay & east of Koksilah River"]
[{"$f":"$C$7&B9","v":"Average YearLeakage down from surficial sediment"},"Leakage down from surficial sediment",{"$f":"C56*$U$9","v":3123.5723122265999},3007.8844488107998,3354.9480390581998,3316.3854179195996,3470.635902474,3316.3854179195996,3354.9480390581998,3277.8227967810003,3123.5723122265999,3162.1349333652001,3007.8844488107998,3046.4470699494,{"$f":"SUM(C9:N9)","v":38562.621138599992},null,"Gain","Leakage down from surficial sediment",{"$f":"38.5626211386*10000","v":385626.21138599998},0.1,{"$f":"S9*T9","v":38562.6211386},null,null,"Perimeter (km)",null,null,null,16.12]
["Average YearLeakage down from 197","Leakage down from 197",{"$f":"C56*$U$10","v":40499.86236318},{"$f":"D56*$U$10","v":38999.867460839996},43499.852167859994,42999.853867079997,44999.847070199998,42999.853867079997,43499.852167859994,42499.855566300001,40499.86236318,40999.860663960004,38999.867460839996,39499.86576162,{"$f":"SUM(C10:N10)","v":499998.30077999999},null,"Gain","Leakage down from 197",{"$f":"G96","v":4999983.0077999998},{"$f":"F96","v":0.1},{"$f":"M96","v":499998.30077999999},null,null,"Area (km2)",null,null,null,6.18]
["Average YearLeakage down from 199","Leakage down from 199",{"$f":"C56*$U$11","v":6452.4362150385004},{"$f":"D56*$U$11","v":6213.457095963},6930.3944531894995,6850.734746830999,7169.3735722649999,6850.734746830999,6930.3944531894995,6771.0750404725004,6452.4362150385004,6532.095921397,6213.457095963,6293.1168023215005,79659.706358499985,null,"Gain","Leakage down from 199",{"$f":"G97","v":796597.063585},{"$f":"F97","v":0.1},{"$f":"M97","v":79659.7063585},null,null,"Aquifer materials",null,null,null,"Bedrock "]
["Average YearLateral Groundwater","Lateral Groundwater",{"$f":"C56*$U$12","v":-4650.6231832546518},{"$f":"D56*$U$12","v":-4478.3778801711469},-4995.1137894216627,-4937.698688393828,-5167.3590925051685,-4937.698688393828,-4995.1137894216627,-4880.2835873659933,-4650.6231832546518,-4708.0382842824874,-4478.3778801711469,-4535.7929811989816,-57415.101027835211,null,"Loss","Lateral Groundwater","--","--",{"$f":"SUMIF(M82:M95, \"<0\")","v":-57415.101027835211},null,null,"Lithostratographic unit",null,null,null,"Nanaimo Series"]
["Average YearLateral Groundwater","Lateral Groundwater",{"$f":"C56*$U$13","v":16944.064457670065},16316.506514793395,18199.180343423399,17989.994362464509,18826.738286300071,17989.994362464509,18199.180343423399,17780.808381505623,16944.064457670065,17153.250438628955,16316.506514793395,16525.692495752286,209185.98095888965,null,"Gain","Lateral Groundwater","--","--",{"$f":"SUMIF(M82:M95, \">0\")","v":209185.98095888968},null,null,"Productivity",null,null,null,"Low"]
["Average YearSurface Water","Surface Water",{"$f":"C57*$U$14","v":0},0,0,0,0,0,0,0,0,0,0,0,0,null,"Loss","Surface Water","--","--",{"$f":"SUMIF(I102,\"<0\")","v":0},null,null,"Vulnerability",null,null,null,"Low"]
["Average YearSurface Water","Surface Water",{"$f":"C57*$U$15","v":0},0,0,0,0,0,0,0,0,0,0,0,0,null,"Gain","Surface Water","--","--",{"$f":"SUMIF(I102,\">0\")","v":0},null,null,"Demand",null,null,null,"Low"]
["Average YearWell Water Usage","Well Water Usage",{"$f":"C58*$U$16","v":-14295.119999999999},-15486.380000000001,-17868.899999999998,-19060.16,-21442.68,-23825.200000000001,-26207.72,-27398.98,-23825.200000000001,-19060.16,-16677.640000000003,-13103.86,-238252,null,"Loss"," Water Usage","--","--",{"$f":"E115","v":-238252},null,null,"Use",null,null,null,"Domestic"]
["Average YearNet Gain","Net Gain",{"$f":"SUMIF(C9:C16, \">0\")","v":67019.935348115163},{"$f":"SUMIF(D9:D16, \">0\")","v":64537.71552040719},{"$f":"SUMIF(E9:E16, \">0\")","v":71984.375003531095},71156.968394295109,74466.594831239068,71156.968394295109,71984.375003531095,70329.561785059137,67019.935348115163,67847.341957351164,64537.71552040719,65365.122129643183,827406.60923598974,null,"Net Gain",null,null,null,{"$f":"SUMIF(U9:U16, \">0\")","v":827406.60923598963}]
["Average YearNet Loss","Net Loss",{"$f":"SUMIF(C9:C16, \"<0\")","v":-18945.74318325465},{"$f":"SUMIF(D9:D16, \"<0\")","v":-19964.75788017115},{"$f":"SUMIF(E9:E16, \"<0\")","v":-22864.01378942166},-23997.858688393826,-26610.039092505169,-28762.898688393827,-31202.833789421664,-32279.263587365993,-28475.823183254652,-23768.198284282487,-21156.017880171152,{"$f":"SUMIF(N9:N16, \"<0\")","v":-17639.652981198982},-295667.10102783522,null,"Net Loss",null,null,null,{"$f":"SUMIF(U9:U16, \"<0\")","v":-295667.10102783522},null,"Location"]
["Average YearNet Total (Gain - Loss)","Net Total (Gain - Loss)",{"$f":"SUM(C17:C18)","v":48074.192164860513},{"$f":"SUM(D17:D18)","v":44572.95764023604},49120.361214109435,47159.109705901283,47856.555738733899,42394.069705901282,40781.541214109428,38050.298197693148,38544.112164860511,44079.143673068676,43381.697640236038,{"$f":"SUM(N17:N18)","v":47725.469148444201},531739.50820815447,null,"Net Total (Gain - Loss)",null,null,null,{"$f":"SUM(U17:U18)","v":531739.50820815447},null,null,"NTS 50000",null,null,null,"Straddles 092B/12  & 092B/013"]
[null,null,null,null,null,null,null,null,null,null,null,null,null,null,null,null,null,null,null,null,null,null,null,"TRIM 20000",null,null,null,"092B.072"]
[null,null,null,null,null,null,null,null,null,null,null,null,null,null,null,null,null,null,null,null,null,null,null,"Lat / Long (Centre)",null,null,null,"48o44'34\" / 123o40'2\""]
[null,"Monthly Gains and Loses (m3)","Hot/Dry (1989)",null,null,null,null,null,null,null,null,null,null,null,null,null,"Summary - Hot/Dry (1989)",null,null,null,null,null,null,"UTM Zone 10 (Centre)",null,null,null,"450940E / 5399080N"]
[null,null,"Jan","Feb","Mar","Apr","May","Jun","Jul","Aug","Sep","Oct","Nov","Dec","Total",null,"Gains and Losses","Source","Area (m2)","Infiltration/Exfiltration Factor","Q (m3/yr)"]
[{"$f":"$C$22&B24","v":"Hot/Dry (1989)Leakage down from surficial sediment"},"Leakage down from surficial sediment",{"$f":"C63*$U$24","v":3162.1349333652001},{"$f":"D63*$U$24","v":2930.7592065335998},3239.2601756424001,3200.6975545038003,3354.9480390581998,3239.2601756424001,3354.9480390581998,3316.3854179195996,3162.1349333652001,3277.8227967810003,3123.5723122265999,3200.6975545038003,{"$f":"SUM(C24:N24)","v":38562.6211386},null,"Gain","Leakage down from surficial sediment",{"$f":"38.5626211386*10000","v":385626.21138599998},0.1,{"$f":"S24*T24","v":38562.6211386},null,"Climate"]
["Hot/Dry (1989)Leakage down from 197","Leakage down from 197",{"$f":"C63*$U$25","v":40999.860663960004},{"$f":"D63*$U$25","v":37999.870859279996},41999.857265520004,41499.85896474,43499.852167859994,41999.857265520004,43499.852167859994,42999.853867079997,40999.860663960004,42499.855566300001,40499.86236318,41499.85896474,{"$f":"SUM(C25:N25)","v":499998.30077999999},null,"Gain","Leakage down from 197",{"$f":"G96","v":4999983.0077999998},{"$f":"F96","v":0.1},{"$f":"M96","v":499998.30077999999},null,null,"Nearest active EC weather station / distance / elevation",null,null,null,"EC1012573 Duncan Kelvin Creek / 2.67 km to west-southwest ;                                                                                                                EC1017230 Shawnigan Lake / 7.1 km to south"]
["Hot/Dry (1989)Leakage down from 199","Leakage down from 199",{"$f":"C63*$U$26","v":6532.095921397},{"$f":"D63*$U$26","v":6054.1376832460001},6691.415334114,6611.7556277555004,6930.3944531894995,6691.415334114,6930.3944531894995,6850.734746830999,6532.095921397,6771.0750404725004,6452.4362150385004,6611.7556277555004,79659.706358499985,null,"Gain","Leakage down from 199",{"$f":"G97","v":796597.063585},{"$f":"F97","v":0.1},{"$f":"M97","v":79659.7063585},null,null,"IDF Curve",null,null,null,"Unknown"]
["Hot/Dry (1989)Lateral Groundwater","Lateral Groundwater",{"$f":"C63*$U$27","v":-4708.0382842824874},{"$f":"D63*$U$27","v":-4363.5476781154757},-4822.8684863381577,-4765.453385310323,-4995.1137894216627,-4822.8684863381577,-4995.1137894216627,-4937.698688393828,-4708.0382842824874,-4880.2835873659933,-4650.6231832546518,-4765.453385310323,-57415.101027835211,null,"Loss","Lateral Groundwater","--","--",{"$f":"SUMIF(M82:M95, \"<0\")","v":-57415.101027835211}]
["Hot/Dry (1989)Lateral Groundwater","Lateral Groundwater",{"$f":"C63*$U$28","v":17153.250438628955},{"$f":"D63*$U$28","v":15898.134552875616},17571.622400546734,17362.436419587844,18199.180343423399,17571.622400546734,18199.180343423399,17989.994362464509,17153.250438628955,17780.808381505623,16944.064457670065,17362.436419587844,209185.98095888968,null,"Gain","Lateral Groundwater","--","--",{"$f":"SUMIF(M82:M95, \">0\")","v":209185.98095888968},null,"Physiography"]
["Hot/Dry (1989)Surface Water","Surface Water",{"$f":"C64*$U$29","v":0},{"$f":"D64*$U$29","v":0},0,0,0,0,0,0,0,0,0,0,0,null,"Loss","Surface Water","--","--",{"$f":"SUMIF(I102,\"<0\")","v":0},null,null,"Physiographic zone",null,null,null,"Canadian Cordillera / Western System / Coastal Trough / Georgia Depression / Nanaimo Lowland"]
["Hot/Dry (1989)Surface Water","Surface Water",{"$f":"C64*$U$30","v":0},{"$f":"D64*$U$30","v":0},0,0,0,0,0,0,0,0,0,0,0,null,"Gain","Surface Water","--","--",{"$f":"SUMIF(I102,\">0\")","v":0},null,null,"Elevation range (m amsl)",null,null,null,"0 - 60 m amsl"]
["Hot/Dry (1989)Well Water Usage","Well Water Usage",{"$f":"$U$31*C65","v":-14295.119999999999},{"$f":"$U$31*D65","v":-15486.380000000001},-17868.899999999998,-19060.16,-21442.68,-23825.200000000001,-26207.72,-27398.98,-23825.200000000001,-19060.16,-16677.640000000003,-13103.86,-238252,null,"Loss"," Water Usage","--","--",{"$f":"E115","v":-238252},null,null,"Distance to marine",null,null,null,"Abuts Cowichan Bay at NE corner"]
["Hot/Dry (1989)Net Gain","Net Gain",{"$f":"SUMIF(C24:C31, \">0\")","v":67847.341957351164},{"$f":"SUMIF(D24:D31, \">0\")","v":62882.90230193521},{"$f":"SUMIF(E24:E31, \">0\")","v":69502.155175823136},68674.748566587135,71984.375003531095,69502.155175823136,71984.375003531095,71156.968394295109,67847.341957351164,70329.561785059137,67019.935348115163,68674.748566587135,827406.60923598974,null,"Net Gain",null,null,null,{"$f":"SUMIF(U24:U31, \">0\")","v":827406.60923598963},null,null,"Geomorphological setting",null,null,null,"Glacial outwash fan"]
["Hot/Dry (1989)Net Loss","Net Loss",{"$f":"SUMIF(C24:C31, \"<0\")","v":-19003.158284282486},{"$f":"SUMIF(D24:D31, \"<0\")","v":-19849.927678115477},{"$f":"SUMIF(E24:E31, \"<0\")","v":-22691.768486338155},-23825.613385310324,-26437.793789421663,-28648.068486338158,-31202.833789421664,-32336.678688393826,-28533.238284282488,-23940.443587365993,-21328.263183254654,{"$f":"SUMIF(N24:N31, \"<0\")","v":-17869.313385310325},-295667.10102783522,null,"Net Loss",null,null,null,{"$f":"SUMIF(U24:U31, \"<0\")","v":-295667.10102783522},null,null,"Topography",null,null,null,"Gentle hillslope on west / level areas on east"]
["Hot/Dry (1989)Net Total (Gain - Loss)","Net Total (Gain - Loss)",{"$f":"SUM(C32:C33)","v":48844.183673068677},{"$f":"SUM(D32:D33)","v":43032.974623819733},46810.386689484978,44849.135181276812,45546.581214109436,40854.086689484975,40781.541214109428,38820.289705901283,39314.103673068676,46389.11819769314,45691.672164860509,{"$f":"SUM(N32:N33)","v":50805.435181276815},531739.50820815447,null,"Net Total (Gain - Loss)",null,null,null,{"$f":"SUM(U32:U33)","v":531739.50820815447},null,null,"Terrain",null,null,null,"Undulating to hummocky on west edge / planar to undulating elsewhere"]
[null,null,null,null,null,null,null,null,null,null,null,null,null,null,null,null,null,null,null,null,null,null,null,"Aspect",null,null,null,"East / east-northeast "]
[null,null,null,null,null,null,null,null,null,null,null,null,null,null,null,null,null,null,null,null,null,null,null,"Slope",null,null,null,"Planar to slightly concave eastwards"]
[null,"Monthly Gains and Loses (m3)","Cold/Wet (1999)",null,null,null,null,null,null,null,null,null,null,null,null,null,"Summary - Wet/Cold (1999)",null,null,null,null,null,null,"XS max grade (m/m)",null,null,null,"0.0207 to east-northeast"]
[null,null,"Jan","Feb","Mar","Apr","May","Jun","Jul","Aug","Sep","Oct","Nov","Dec","Total",null,"Gains and Losses","Source","Area (m2)","Infiltration/Exfiltration Factor","Q (m3/yr)",null,null,"Roughness coefficient",null,null,null,"0.50 (partly cleared / deciduous - coniferous cover)"]
[{"$f":"$C$37&B39","v":"Cold/Wet (1999)Leakage down from surficial sediment"},"Leakage down from surficial sediment",{"$f":"C70*$U$39","v":3123.5723122265999},{"$f":"D70*$U$39","v":3007.8844488107998},3354.9480390581998,3316.3854179195996,3470.635902474,3316.3854179195996,3354.9480390581998,3277.8227967810003,3123.5723122265999,3162.1349333652001,3007.8844488107998,3046.4470699494,{"$f":"SUM(C39:N39)","v":38562.621138599992},null,"Gain","Leakage down from surficial sediment",{"$f":"38.5626211386*10000","v":385626.21138599998},0.1,{"$f":"S39*T39","v":38562.6211386}]
["Cold/Wet (1999)Leakage down from 197","Leakage down from 197",{"$f":"C70*$U$40","v":40499.86236318},{"$f":"D70*$U$40","v":38999.867460839996},43499.852167859994,42999.853867079997,44999.847070199998,42999.853867079997,43499.852167859994,42499.855566300001,40499.86236318,40999.860663960004,38999.867460839996,39499.86576162,{"$f":"SUM(C40:N40)","v":499998.30077999999},null,"Gain","Leakage down from 197",{"$f":"G96","v":4999983.0077999998},{"$f":"F96","v":0.1},{"$f":"M96","v":499998.30077999999},null,"Geology"]
["Cold/Wet (1999)Leakage down from 199","Leakage down from 199",{"$f":"C70*$U$41","v":6452.4362150385004},{"$f":"D70*$U$41","v":6213.457095963},6930.3944531894995,6850.734746830999,7169.3735722649999,6850.734746830999,6930.3944531894995,6771.0750404725004,6452.4362150385004,6532.095921397,6213.457095963,6293.1168023215005,79659.706358499985,null,"Gain","Leakage down from 199",{"$f":"G97","v":796597.063585},{"$f":"F97","v":0.1},{"$f":"M97","v":79659.7063585},null,null,"Terrane",null,null,null,"Overlap"]
["Cold/Wet (1999)Lateral Groundwater","Lateral Groundwater",{"$f":"C70*$U$42","v":-4650.6231832546518},{"$f":"D70*$U$42","v":-4478.3778801711469},-4995.1137894216627,-4937.698688393828,-5167.3590925051685,-4937.698688393828,-4995.1137894216627,-4880.2835873659933,-4650.6231832546518,-4708.0382842824874,-4478.3778801711469,-4535.7929811989816,-57415.101027835211,null,"Loss","Lateral Groundwater","--","--",{"$f":"SUMIF(M82:M95, \"<0\")","v":-57415.101027835211},null,null,"Bedrock (age ; formation ; lithology)",null,null,null," Upper Cretaceous; Nanaimo Group (uKN); mainly shale + subordinate sandstone"]
["Cold/Wet (1999)Lateral Groundwater","Lateral Groundwater",{"$f":"C70*$U$43","v":16944.064457670065},{"$f":"D70*$U$43","v":16316.506514793395},18199.180343423399,17989.994362464509,18826.738286300071,17989.994362464509,18199.180343423399,17780.808381505623,16944.064457670065,17153.250438628955,16316.506514793395,16525.692495752286,209185.98095888965,null,"Gain","Lateral Groundwater","--","--",{"$f":"SUMIF(M82:M95, \">0\")","v":209185.98095888968},null,null,"Structure",null,null,null,"2 E-ESE thrust faults cross centre   of AQ"]
["Cold/Wet (1999)Surface Water","Surface Water",{"$f":"C71*$U$44","v":0},{"$f":"D71*$U$44","v":0},0,0,0,0,0,0,0,0,0,0,0,null,"Loss","Surface Water","--","--",{"$f":"SUMIF(I102,\"<0\")","v":0},null,null,"Surficial (formation; lithology; thickness)",null,null,null,"Vashon Drift : Cowichan Head Formations, morainal; silt-sand-gravel; deep blankets (> 30 - 70 m)"]
["Cold/Wet (1999)Surface Water","Surface Water",{"$f":"C71*$U$45","v":0},{"$f":"D71*$U$45","v":0},0,0,0,0,0,0,0,0,0,0,0,null,"Gain","Surface Water","--","--",{"$f":"SUMIF(I102,\">0\")","v":0},null,null,"Surficial designation (1993)",null,null,null,"W // dMbh/$LGp // sgFGf"]
["Cold/Wet (1999)Well Water Usage","Well Water Usage",{"$f":"$U$46*C72","v":-14295.119999999999},{"$f":"$U$46*D72","v":-15486.380000000001},-17868.899999999998,-19060.16,-21442.68,-23825.200000000001,-26207.72,-27398.98,-23825.200000000001,-19060.16,-16677.640000000003,-13103.86,-238252,null,"Loss"," Water Usage","--","--",{"$f":"E115","v":-238252},null,null,"Soils (association; parent; texture; drainage; type; comments)",null,null,null,"FF2/d (Finlayson SA);  marine; si-cy; imperfect; GLE.DYB ; stone-free, fine-textured soils"]
["Cold/Wet (1999)Net Gain","Net Gain",{"$f":"SUMIF(C39:C46, \">0\")","v":67019.935348115163},{"$f":"SUMIF(D39:D46, \">0\")","v":64537.71552040719},{"$f":"SUMIF(E39:E46, \">0\")","v":71984.375003531095},71156.968394295109,74466.594831239068,71156.968394295109,71984.375003531095,70329.561785059137,67019.935348115163,67847.341957351164,64537.71552040719,65365.122129643183,827406.60923598974,null,"Net Gain",null,null,null,{"$f":"SUMIF(U39:U46, \">0\")","v":827406.60923598963},null,null,"Restrictive layers",null,null,null,"Yes - surface si-cy soils, dense till "]
["Cold/Wet (1999)Net Loss","Net Loss",{"$f":"SUMIF(C39:C46, \"<0\")","v":-18945.74318325465},{"$f":"SUMIF(D39:D46, \"<0\")","v":-19964.75788017115},{"$f":"SUMIF(E39:E46, \"<0\")","v":-22864.01378942166},-23997.858688393826,-26610.039092505169,-28762.898688393827,-31202.833789421664,-32279.263587365993,-28475.823183254652,-23768.198284282487,-21156.017880171152,{"$f":"SUMIF(N39:N46, \"<0\")","v":-17639.652981198982},-295667.10102783522,null,"Net Loss",null,null,null,{"$f":"SUMIF(U39:U46, \"<0\")","v":-295667.10102783522},null,null,"Estimated permeability",null,null,null,"Low @ surface from dominant M-LG / high at bedrock ct from dominant FG"]
["Cold/Wet (1999)Net Total (Gain - Loss)","Net Total (Gain - Loss)",{"$f":"SUM(C47:C48)","v":48074.192164860513},{"$f":"SUM(D47:D48)","v":44572.95764023604},49120.361214109435,47159.109705901283,47856.555738733899,42394.069705901282,40781.541214109428,38050.298197693148,38544.112164860511,44079.143673068676,43381.697640236038,{"$f":"SUM(N47:N48)","v":47725.469148444201},531739.50820815447,null,"Net Total (Gain - Loss)",null,null,null,{"$f":"SUM(U47:U48)","v":531739.50820815447}]
[null,null,null,null,null,null,null,null,null,null,null,null,null,null,null,null,null,null,null,null,null,null,"Hydrology"]
[null,null,null,null,null,null,null,null,null,null,null,null,null,null,null,null,null,null,null,null,null,null,null,"GW / SW basin coincidence",null,null,null,"No"]
[null,"Table A-4  Monthly  Coefficients used in Calculations for AQ198",null,null,null,null,null,null,null,null,null,null,null,null,null,null,null,null,null,null,null,null,null,"Catchments",null,null,null,"Koksilah / Garnett"]
[null,"Monthly Factors","30 Year Average",null,null,null,null,null,null,null,null,null,null,null,null,null,null,null,null,null,null,null,null,"Drainage regime",null,null,null,"Radial"]
[null,null,"Jan","Feb","Mar","Apr","May","Jun","Jul","Aug","Sep","Oct","Nov","Dec",null,null,null,null,null,null,null,null,null,"Surface waters",null,null,null,"Five small streams, radial drainage / west & north boundaries ~ 100 m from Koksilah River"]
[null,"Surplus Water",{"$f":"'Monthly Factors'!B16","v":0.25146830548450599},{"$f":"'Monthly Factors'!C16","v":0.16379677075085},{"$f":"'Monthly Factors'!D16","v":0.1182073911233482},{"$f":"'Monthly Factors'!E16","v":2.8387626824061124E-2},{"$f":"'Monthly Factors'!F16","v":-3.4169860825738051E-2},{"$f":"'Monthly Factors'!G16","v":-5.3883242071356162E-2},{"$f":"'Monthly Factors'!H16","v":-5.2569016654981621E-2},{"$f":"'Monthly Factors'!I16","v":-2.3656057494741728E-2},{"$f":"'Monthly Factors'!J16","v":-7.8853524982472421E-3},{"$f":"'Monthly Factors'!K16","v":8.6453811443823317E-2},{"$f":"'Monthly Factors'!L16","v":0.26525988999485034},{"$f":"'Monthly Factors'!M16","v":0.25858973392362583},null,null,null,null,null,null,null,null,null,"Runoff coefficient",null,null,null,"~70% cleared-agricultural / ~30% forested / flat - rolling terrain / =   0.35"]
[null,"Leakance/\nLateral Ground Water",{"$f":"'Monthly Factors'!B42","v":8.1000000000000003E-2},{"$f":"'Monthly Factors'!C42","v":7.8E-2},{"$f":"'Monthly Factors'!D42","v":8.6999999999999994E-2},{"$f":"'Monthly Factors'!E42","v":8.5999999999999993E-2},{"$f":"'Monthly Factors'!F42","v":0.09},{"$f":"'Monthly Factors'!G42","v":8.5999999999999993E-2},{"$f":"'Monthly Factors'!H42","v":8.6999999999999994E-2},{"$f":"'Monthly Factors'!I42","v":8.5000000000000006E-2},{"$f":"'Monthly Factors'!J42","v":8.1000000000000003E-2},{"$f":"'Monthly Factors'!K42","v":8.2000000000000003E-2},{"$f":"'Monthly Factors'!L42","v":7.8E-2},{"$f":"'Monthly Factors'!M42","v":7.9000000000000001E-2},null,null,null,null,null,null,null,null,null,"Nearest Active EC hydrometric station; distance; type",null,null,null,"EC 08HA003 Koksilah River  @ Cowichan Station; 200 m SW; active realtime"]
[null,"Surface Water",{"$f":"'Monthly Factors'!B26","v":0.22068086457424585},{"$f":"'Monthly Factors'!C26","v":0.19373952223030552},{"$f":"'Monthly Factors'!D26","v":0.13994869625957773},{"$f":"'Monthly Factors'!E26","v":6.7665632372012466E-2},{"$f":"'Monthly Factors'!F26","v":2.399263439717373E-2},{"$f":"'Monthly Factors'!G26","v":9.7313744914725147E-3},{"$f":"'Monthly Factors'!H26","v":5.7792933459831003E-3},{"$f":"'Monthly Factors'!I26","v":1.8772385441074731E-3},{"$f":"'Monthly Factors'!J26","v":1.5783311410150771E-3},{"$f":"'Monthly Factors'!K26","v":1.4486378451963268E-2},{"$f":"'Monthly Factors'!L26","v":0.10238016286421177},{"$f":"'Monthly Factors'!M26","v":0.21813987132793164}]
[null,"Water Usage",{"$f":"'Monthly Factors'!B31","v":0.06},{"$f":"'Monthly Factors'!C31","v":6.5000000000000002E-2},{"$f":"'Monthly Factors'!D31","v":7.4999999999999997E-2},{"$f":"'Monthly Factors'!E31","v":0.08},{"$f":"'Monthly Factors'!F31","v":0.09},{"$f":"'Monthly Factors'!G31","v":0.1},{"$f":"'Monthly Factors'!H31","v":0.11},{"$f":"'Monthly Factors'!I31","v":0.115},{"$f":"'Monthly Factors'!J31","v":0.1},{"$f":"'Monthly Factors'!K31","v":0.08},{"$f":"'Monthly Factors'!L31","v":7.0000000000000007E-2},{"$f":"'Monthly Factors'!M31","v":5.5E-2},null,null,null,null,null,null,null,null,"Land Cover"]
[null,null,null,null,null,null,null,null,null,null,null,null,null,null,null,null,null,null,null,null,null,null,null,"Vegetation zone",null,null,null,"CgF-wC"]
[null,"Monthly Factors","Hot/Dry (1989)",null,null,null,null,null,null,null,null,null,null,null,null,null,null,null,null,null,null,null,null,"Primary land uses",null,null,null,"Agricultural / forestry"]
[null,null,"Jan","Feb","Mar","Apr","May","Jun","Jul","Aug","Sep","Oct","Nov","Dec",null,null,null,null,null,null,null,null,null,"Degree of development",null,null,null,"Moderate to high, mainly agricultural.  Very low impervious cover"]
[null,"Surplus Water",{"$f":"'Monthly Factors'!B11","v":0.30660649782598431},{"$f":"'Monthly Factors'!C11","v":0.17581890480464263},{"$f":"'Monthly Factors'!D11","v":0.27338167402959174},{"$f":"'Monthly Factors'!E11","v":1.6409764448433315E-2},{"$f":"'Monthly Factors'!F11","v":-6.4466931761702304E-2},{"$f":"'Monthly Factors'!G11","v":-8.2048822242166558E-2},{"$f":"'Monthly Factors'!H11","v":-7.032756192185706E-2},{"$f":"'Monthly Factors'!I11","v":-2.9303150800773774E-2},{"$f":"'Monthly Factors'!J11","v":-1.9535433867182515E-2},{"$f":"'Monthly Factors'!K11","v":4.9815356361315413E-2},{"$f":"'Monthly Factors'!L11","v":0.19554969301049696},{"$f":"'Monthly Factors'!M11","v":0.24810001011321794},null,null,null,null,null,null,null,null,null,"Evapotranspiration potential",null,null,null,"Negligible, confined"]
[null,"Leakance/\nLateral Ground Water",{"$f":"'Monthly Factors'!B43","v":8.2000000000000003E-2},{"$f":"'Monthly Factors'!C43","v":7.5999999999999998E-2},{"$f":"'Monthly Factors'!D43","v":8.4000000000000005E-2},{"$f":"'Monthly Factors'!E43","v":8.3000000000000004E-2},{"$f":"'Monthly Factors'!F43","v":8.6999999999999994E-2},{"$f":"'Monthly Factors'!G43","v":8.4000000000000005E-2},{"$f":"'Monthly Factors'!H43","v":8.6999999999999994E-2},{"$f":"'Monthly Factors'!I43","v":8.5999999999999993E-2},{"$f":"'Monthly Factors'!J43","v":8.2000000000000003E-2},{"$f":"'Monthly Factors'!K43","v":8.5000000000000006E-2},{"$f":"'Monthly Factors'!L43","v":8.1000000000000003E-2},{"$f":"'Monthly Factors'!M43","v":8.3000000000000004E-2},null,null,null,null,null,null,null,null,null,"Relative environmental sensitivity",null,null,null,"Low"]
[null,"Surface Water",{"$f":"'Monthly Factors'!B26","v":0.22068086457424585},{"$f":"'Monthly Factors'!C26","v":0.19373952223030552},{"$f":"'Monthly Factors'!D26","v":0.13994869625957773},{"$f":"'Monthly Factors'!E26","v":6.7665632372012466E-2},{"$f":"'Monthly Factors'!F26","v":2.399263439717373E-2},{"$f":"'Monthly Factors'!G26","v":9.7313744914725147E-3},{"$f":"'Monthly Factors'!H26","v":5.7792933459831003E-3},{"$f":"'Monthly Factors'!I26","v":1.8772385441074731E-3},{"$f":"'Monthly Factors'!J26","v":1.5783311410150771E-3},{"$f":"'Monthly Factors'!K26","v":1.4486378451963268E-2},{"$f":"'Monthly Factors'!L26","v":0.10238016286421177},{"$f":"'Monthly Factors'!M26","v":0.21813987132793164},null,null,null,null,null,null,null,null,null,null,null,null,null,"Cgf-wC "]
[null,"Water Usage",{"$f":"'Monthly Factors'!B31","v":0.06},{"$f":"'Monthly Factors'!C31","v":6.5000000000000002E-2},{"$f":"'Monthly Factors'!D31","v":7.4999999999999997E-2},{"$f":"'Monthly Factors'!E31","v":0.08},{"$f":"'Monthly Factors'!F31","v":0.09},{"$f":"'Monthly Factors'!G31","v":0.1},{"$f":"'Monthly Factors'!H31","v":0.11},{"$f":"'Monthly Factors'!I31","v":0.115},{"$f":"'Monthly Factors'!J31","v":0.1},{"$f":"'Monthly Factors'!K31","v":0.08},{"$f":"'Monthly Factors'!L31","v":7.0000000000000007E-2},{"$f":"'Monthly Factors'!M31","v":5.5E-2},null,null,null,null,null,null,null,null,"Hydrogeology"]
[]
[null,"Monthly Factors","Cold/Wet (1999)"]
[null,null,"Jan","Feb","Mar","Apr","May","Jun","Jul","Aug","Sep","Oct","Nov","Dec"]
[null,"Surplus Water",{"$f":"'Monthly Factors'!B21","v":0.28121118610350893},{"$f":"'Monthly Factors'!C21","v":0.28471061972718881},{"$f":"'Monthly Factors'!D21","v":0.1055893178084587},{"$f":"'Monthly Factors'!E21","v":-1.2670737757409583E-2},{"$f":"'Monthly Factors'!F21","v":-1.0294974427895285E-2},{"$f":"'Monthly Factors'!G21","v":-2.6925317734495361E-2},{"$f":"'Monthly Factors'!H21","v":-3.4844528832876351E-2},{"$f":"'Monthly Factors'!I21","v":-1.425457997708578E-2},{"$f":"'Monthly Factors'!J21","v":-6.3353688787047913E-3},{"$f":"'Monthly Factors'!K21","v":9.9861251950584262E-2},{"$f":"'Monthly Factors'!L21","v":0.16139352218500455},{"$f":"'Monthly Factors'!M21","v":0.17255960983372176},null,null,null,null,null,null,null,null,null,"Groundwater occurrence (primary / secondary)",null,null,null,"Void infillings - bedding partings, bedrock fractures & faults"]
[null,"Leakance/\nLateral Ground Water",{"$f":"'Monthly Factors'!B44","v":8.1000000000000003E-2},{"$f":"'Monthly Factors'!C44","v":7.8E-2},{"$f":"'Monthly Factors'!D44","v":8.6999999999999994E-2},{"$f":"'Monthly Factors'!E44","v":8.5999999999999993E-2},{"$f":"'Monthly Factors'!F44","v":0.09},{"$f":"'Monthly Factors'!G44","v":8.5999999999999993E-2},{"$f":"'Monthly Factors'!H44","v":8.6999999999999994E-2},{"$f":"'Monthly Factors'!I44","v":8.5000000000000006E-2},{"$f":"'Monthly Factors'!J44","v":8.1000000000000003E-2},{"$f":"'Monthly Factors'!K44","v":8.2000000000000003E-2},{"$f":"'Monthly Factors'!L44","v":7.8E-2},{"$f":"'Monthly Factors'!M44","v":7.9000000000000001E-2},null,null,null,null,null,null,null,null,null,"Primary porosity",null,null,null,"Low "]
[null,"Surface Water",{"$f":"'Monthly Factors'!B26","v":0.22068086457424585},{"$f":"'Monthly Factors'!C26","v":0.19373952223030552},{"$f":"'Monthly Factors'!D26","v":0.13994869625957773},{"$f":"'Monthly Factors'!E26","v":6.7665632372012466E-2},{"$f":"'Monthly Factors'!F26","v":2.399263439717373E-2},{"$f":"'Monthly Factors'!G26","v":9.7313744914725147E-3},{"$f":"'Monthly Factors'!H26","v":5.7792933459831003E-3},{"$f":"'Monthly Factors'!I26","v":1.8772385441074731E-3},{"$f":"'Monthly Factors'!J26","v":1.5783311410150771E-3},{"$f":"'Monthly Factors'!K26","v":1.4486378451963268E-2},{"$f":"'Monthly Factors'!L26","v":0.10238016286421177},{"$f":"'Monthly Factors'!M26","v":0.21813987132793164},null,null,null,null,null,null,null,null,null,"Secondary porosity",null,null,null,"Low to moderate (probable low open void space due to ductile rock)"]
[null,"Water Usage",{"$f":"'Monthly Factors'!B31","v":0.06},{"$f":"'Monthly Factors'!C31","v":6.5000000000000002E-2},{"$f":"'Monthly Factors'!D31","v":7.4999999999999997E-2},{"$f":"'Monthly Factors'!E31","v":0.08},{"$f":"'Monthly Factors'!F31","v":0.09},{"$f":"'Monthly Factors'!G31","v":0.1},{"$f":"'Monthly Factors'!H31","v":0.11},{"$f":"'Monthly Factors'!I31","v":0.115},{"$f":"'Monthly Factors'!J31","v":0.1},{"$f":"'Monthly Factors'!K31","v":0.08},{"$f":"'Monthly Factors'!L31","v":7.0000000000000007E-2},{"$f":"'Monthly Factors'!M31","v":5.5E-2},null,null,null,null,null,null,null,null,null,"Confinement",null,null,null,"Confined / thick overburden with K-restrictive layers / water-bearing units below sea level;                                                                              WP = 0 to 41 m, avg  3.6 m"]
[null,null,null,null,null,null,null,null,null,null,null,null,null,null,null,null,null,null,null,null,null,null,null,"Aquifer thickness",null,null,null,"Bedrock aquifer / assume < 150 m"]
[null,null,null,null,null,null,null,null,null,null,null,null,null,null,null,null,null,null,null,null,null,null,null,"Hydraulic anisotropy",null,null,null,"High"]
[null,null,null,null,null,null,null,null,null,null,null,null,null,null,null,null,null,null,null,null,null,null,null,"Hydraulic gradient",null,null,null,"Unknown - confined"]
[null,null,null,null,null,null,null,null,null,null,null,null,null,null,null,null,null,null,null,null,null,null,null,"Storage potential",null,null,null,"Low - secondary voids only"]
[null,null,null,null,null,null,null,null,null,null,null,null,null,null,null,null,null,null,null,null,null,null,null,"Yield potential",null,null,null,"Low; WP = 0.06 - 1.26 L/s / average 0.13 L/s"]
[null,"TABLE A-5",null,null,null,null,null,null,null,null,null,null,null,null,null,null,null,null,null,null,null,null,null,"Flow velocities",null,null,null,"Low - moderate"]
[null,"Groundwater Flow Components: Aquifer #0198, Cowichan Station (Bedrock)",null,null,null,null,null,null,null,null,null,null,null,null,null,null,null,null,null,null,null,null,null,"Flow directions",null,null,null,"E / ENE towards Cowichan Bay / modified E - ESE by thrust faults"]
[null,"Groundwater Flow","Direction of Flow","Source or Receptor of Water","Length (m)","Depth (m)","Area (m)","Hydraulic Conductivity (m/s) - K","Distance (m) - dL","Hydraulic Head (m) - dh",null,null,"GW Flow (m3/yr)",null,null,null,null,null,null,null,null,null,null,"Static water levels",null,null,null,"WP = variable 0.5 - 49.7 m bgs / avg 9.7 m bgs"]
[null,null,null,null,null,null,null,null,null,"Year 1","Year 2","Year 3","Year 1","Year 2","Year 2",null,null,null,null,null,null,null,null,"Hydraulic connection with surface waters",null,null,null,"None"]
[null,"QGW1","Out","Inlet",1560,200,{"$f":"E82*F82","v":312000},1E-8,150,20,null,null,{"$f":"-(G82*H82*(J82/I82)*60*60*24*365)","v":-13118.976000000001},null,null,null,null,null,null,null,null,null,null,"Hydraulic connection to adjacent AQ"]
[null,"QGW2","Out","Koksilah River",1700,200,{"$f":"E83*F83","v":340000},1E-8,165,20,null,null,-12996.654545454547,null,null,null,null,null,null,null,null,null,null,null,"Over / Under",null,null,"Overlain by surficial AQ197 & AQ199"]
[null,"QGW3","Out","AQ 186",445,200,89000,1E-8,150,20,null,null,-3742.2720000000004,null,null,null,null,null,null,null,null,null,null,null,"Upgradient",null,null,"Upgradient contact with bedrock AQ 196 (not in study area)"]
[null,"QGW4","Out","AQ 186",130,200,26000,1E-8,225,20,null,null,-728.83200000000011,null,null,null,null,null,null,null,null,null,null,null,"Downgradient",null,null,"Downgradient contact with undeveloped extension of bedrock AQ198"]
[null,"QGW5","Out","AQ 186",1500,200,300000,1E-8,550,40,null,null,-6880.5818181818186,null,null,null,null,null,null,null,null,null,null,"Vulnerability to surface contamination",null,null,null,"Low - confined"]
[null,"QGW6","Out","AQ 186",90,200,18000,1E-8,270,20,null,null,-420.48000000000008,null,null,null,null,null,null,null,null,null,null,"Recharge"]
[null,"QGW7","Out","AQ 186",1560,200,312000,1E-8,465,40,null,null,-8463.8554838709679,null,null,null,null,null,null,null,null,null,null,null,"Vertical inflow",null,null,"None from precipitation-snowmelt, stream loss, irrigation, sewage disposal.  Low to moderate recharge from overlying surficial AQ197 & AQ199 "]
[null,"QGW8","Out","Koksilah River",2675,200,535000,1E-8,305,20,null,null,-11063.449180327871,null,null,null,null,null,null,null,null,null,null,null,"Lateral inflow",null,null,"Low - moderate lateral inflow from upgradient bedrock sources AQ196 (not in study area);                                                              possible increased K along thrust faults"]
[null,"QGW9","In","AQ 197","--","--","--","--","--","--","--","--",{"$f":"-'Surficial AQ 197'!M87","v":204984.00000000003},null,null,null,null,null,null,null,null,null,null,null,"Temporal variability",null,null,"Low, confined"]
[null,"QGW10","Zero","AQ 197",760,200,152000,1E-8,1,0,null,null,0,null,null,null,null,null,null,null,null,null,null,null,"MBR",null,null,"Negligible  "]
[null,"QGW11","In","AQ 197",90,200,18000,1E-8,1705,20,null,null,{"$f":"(G92*H92*(J92/I92)*60*60*24*365)","v":66.586275659824054},null,null,null,null,null,null,null,null,null,null,"Discharge"]
[null,"QGW12","Zero","AQ 197",535,200,107000,1E-8,1,0,null,null,{"$f":"-(G93*H93*(J93/I93)*60*60*24*365)","v":0},null,null,null,null,null,null,null,null,null,null,null,"Evapotranspiration",null,null,"Negligible, confined"]
[null,"QGW13","In","AQ 197",130,200,26000,1E-8,2800,20,null,null,{"$f":"(G94*H94*(J94/I94)*60*60*24*365)","v":58.566857142857152},null,null,null,null,null,null,null,null,null,null,null,"Outflow to marine",null,null,"Low"]
[null,"QGW14","In","AQ 197",1115,200,223000,1E-8,690,40,null,null,{"$f":"(G95*H95*(J95/I95)*60*60*24*365)","v":4076.827826086957},null,null,null,null,null,null,null,null,null,null,null,"Outflow to surface waters",null,null,"None"]
[null,"QGW15","In","Leakage from AQ 197","Leakance Factor (m/yr) = ",{"$f":"'Surficial AQ 197'!T11","v":0.1},{"$f":"'Surficial AQ 197'!S11","v":4999983.0077999998},"--","--","--",null,null,{"$f":"-'Surficial AQ 197'!U11","v":499998.30077999999},null,null,null,null,null,null,null,null,null,null,null,"Outflow to other AQ",null,null,"None"]
[null,"QGW16","In","Leakage from AQ 199","Leakance Factor (m/yr) = ",{"$f":"'Surficial AQ 199'!T10","v":0.1},{"$f":"'Surficial AQ 199'!S10","v":796597.063585},"--","--","--",null,null,{"$f":"-'Surficial AQ 199'!U10","v":79659.7063585},null,null,null,null,null,null,null,null,null,null,null,"Temporal variability",null,null,"None"]
[null,"Total",null,null,null,null,null,null,null,null,null,null,{"$f":"SUM(M82:M97)","v":731428.88706955453},{"$f":"SUM(N82:N97)","v":0},{"$f":"SUM(O82:O97)","v":0}]
[null,null,null,null,null,null,null,null,null,null,null,null,null,null,null,null,null,null,null,null,null,null,null,"Groundwater Development"]
[null,"Surface Water Contributions","Cold Water Creek?","Observed Vertical Gradient","Percent Permeable","Length (m)","Width (m)","Flux (m/s)","SW Flow (m3/yr)",null,null,"Comment",null,null,null,null,null,null,null,null,null,null,null,null,"Nearest BCMOE Observation Wells; distance; completion / relevance",null,null,"Well #233; 1.4 km SE; completed in surficial AQ197; irrelevant"]
[null,null,null,null,null,null,null,null,"Year 1","Year 2","Year 3",null,null,null,null,null,null,null,null,null,null,null,null,null,"Total Annual Water Use (m3/yr) as reported by Hatfield (2015)",null,null,null,"  SUMS"]
[null,"None",null,null,null,null,null,null,null,null,null,null,null,null,null,null,null,null,null,null,null,null,null,null,null,"Industrial",null,109500,"Total Commercial and Industrial"]
[null,"Total",null,null,null,null,null,null,{"$f":"SUM(I102:I102)","v":0},{"$f":"SUM(J102:J102)","v":0},{"$f":"SUM(K102:K102)","v":0},null,null,null,null,null,null,null,null,null,null,null,null,null,null,"Commercial",null,7300,{"$f":"AB102+AB103","v":116800}]
[null,null,null,null,null,null,null,null,null,null,null,null,null,null,null,null,null,null,null,null,null,null,null,null,null,"Domestic",null,53687,"Total Irrigation"]
[null,"Water Well Usage","Water Well Usage Volume (m3/yr)",null,null,null,null,null,null,null,null,"Comments",null,null,null,null,null,null,null,null,null,null,null,null,null,"Irrigation from GW (MoAg)",null,0,{"$f":"AB105","v":0}]
[null,null,"Year 1",null,null,"Year 2",null,null,"Year 3",null,null,null,null,null,null,null,null,null,null,null,null,null,null,null,null,"BCMOE Obs",null,0]
[null,null,"Total Volume Removed","Adjustment Factor","Adjusted Volume Removed","Total Volume Removed","Adjustment Factor","Adjusted Volume Removed","Total Volume Removed","Adjustment Factor","Adjusted Volume Removed",null,null,null,null,null,null,null,null,null,null,null,null,null,null,"Other",null,67300,"Total Domestic + Water Systems + Other"]
[null,"Industrial",{"$f":"AB102","v":109500},1,{"$f":"C108*D108","v":109500},null,null,null,null,null,null,"Assuming 100% consumptive",null,null,null,null,null,null,null,null,null,null,null,null,null,"Water Supply Systems",null,465,{"$f":"AB104+AB107+AB108","v":121452}]
[null,"Commercial",7300,1,{"$f":"C109*D109","v":7300},null,null,null,null,null,null,"Assuming 100% consumptive"]
[null,"Domestic",53687,1,53687,null,null,null,null,null,null,"Assuming 100% consumptive"]
[null,"Irrigation",0,1,0,null,null,null,null,null,null,"Assuming 100% consumptive"]
[null,"BCMOE Obs",0,1,0,null,null,null,null,null,null,"Assuming 100% consumptive"]
[null,"Other",67300,1,67300,null,null,null,null,null,null,"Assuming 100% consumptive"]
[null,"Water Supply Systems",465,1,465,null,null,null,null,null,null,"Assuming 100% consumptive"]
[null,"Total",null,null,{"$f":"-SUM(E108:E114)","v":-238252},null,null,{"$f":"-SUM(H108:H114)","v":0},null,null,{"$f":"-SUM(K108:K114)","v":0}]

{"sheet":"Bedrock 200","index":7,"n_rows":140,"n_cols":29,"rows_kept":140,"cut":false,"hidden":false,"merged":[[21,16,21,20],[36,16,36,20],[51,17,51,19],[129,1,131,1],[129,2,129,10],[79,12,79,14],[4,2,4,4],[3,2,3,4],[2,2,2,4],[1,2,1,4],[6,16,6,20]]}
[null,"Groundwater Impacts: Aquifer #0200, Kelvin Creek (Bedrock)",null,null,null,null,null,null,null,null,null,null,null,null,null,null,null,null,null,null,null,null,"TABLE B-1"]
[null,"AQ tag","200 Kelvin Creek",null,null,null,null,null,null,null,null,null,null,null,null,null,null,null,null,null,null,null,"CHM Aquifer Criteria: Aquifer #0200, Kelvin Creek (Bedrock)"]
[null,"Perimeter (km)",24.06]
[null,"Area (km2)",26.9,null,null,null,null,null,null,null,null,null,null,null,null,null,null,null,null,null,null,null,"BCMOE Criteria"]
[null,"Aquifer materials","Bedrock ",null,null,null,null,null,null,null,null,null,null,null,null,null,null,null,null,null,null,null,null,"AQ tag",null,null,null,"200 Kelvin Creek"]
[null,"Table B-4 Monthly  Summary of AQ200 Water Budgets",null,null,null,null,null,null,null,null,null,null,null,null,null,null,"Table B-3 Annual Summary of AQ200 Water Budgets",null,null,null,null,null,null,"AQ classification",null,null,null,"IIIB(9)"]
[null,"Monthly Gains and Loses (m3)","Average Year",null,null,null,null,null,null,null,null,null,null,null,null,null,"Summary - 30 Year Average",null,null,null,null,null,null,"AQ type",null,null,null,"BCMOE Classification = 6b (SLR Classification = 6a / 6b / 5a-5b)"]
[null,"Source","Jan","Feb","Mar","Apr","May","Jun","Jul","Aug","Sep","Oct","Nov","Dec","Total",null,"Gains and Losses","Source","Area (m2)","Infiltration Rate","Q (m3/yr)",null,null,"Location",null,null,null,"Cobble Hill / Duncan (between Koksilah River & Kelvin Creek)"]
[{"$f":"$C$7&B9","v":"Average YearDirect Recharge to 200"},"Direct Recharge to 200",{"$f":"C55*$U$9","v":3615457.0281581064},{"$f":"D55*$U$9","v":2354969.4855571003},1699513.3529600042,408139.88353735139,-491273.29679012287,-774700.19878442457,-755805.07198480447,-340112.28239316196,-113370.76079772065,1242979.864175708,3813743.9695334411,3717844.5574776898,{"$f":"SUM(C9:N9)","v":14377386.530649167},null,"Gain","Direct Recharge to 200",26939892.0557,{"$f":"U9/S9","v":0.53368389527779003},{"$f":"S58","v":14377386.530649167},null,null,"Perimeter (km)",null,null,null,24.06]
[{"$f":"$C$7&B10","v":"Average YearLateral Groundwater"},"Lateral Groundwater",{"$f":"C56*$U$10","v":-1225193.8545537638},-1179816.3043851058,-1315948.9548910796,-1300823.1048348602,-1361326.5050597375,-1300823.1048348602,-1315948.9548910796,-1285697.254778641,-1225193.8545537638,-1240319.7046099831,-1179816.3043851058,-1194942.1544413252,-15125850.056219306,null,"Loss","Lateral Groundwater","--","--",{"$f":"SUMIF(M82:M118, \"<0\")","v":-15125850.056219306},null,null,"Area (km2)",null,null,null,26.9]
["Average YearLateral Groundwater","Lateral Groundwater",{"$f":"C56*$U$11","v":54607.7376},52585.228799999997,58652.755199999992,57978.585599999991,60675.263999999996,57978.585599999991,58652.755199999992,57304.416000000005,54607.7376,55281.907200000001,52585.228799999997,53259.398399999998,674169.6,null,"Gain","Lateral Groundwater","--","--",{"$f":"SUMIF(M82:M118, \">0\")","v":674169.6},null,null,"Aquifer materials",null,null,null,"Bedrock "]
["Average YearSurface Water","Surface Water",{"$f":"C57*$U$12","v":-438441.67994844529},-384915.48310245964,-278045.59137024876,-134435.91309647847,-47667.798256004055,-19333.983435673865,-11482.115082412152,-3729.6374677993163,-3135.7778043722428,-28781.07314425016,-203405.63141340428,-433393.31587845209,-1986768,null,"Loss","Surface Water","--","--",{"$f":"SUMIF(I123:I127,\"<0\")","v":-1986768},null,null,"Lithostratographic unit",null,null,null,"Sicker Volcanics"]
["Average YearSurface Water","Surface Water",{"$f":"C57*$U$13","v":0},0,0,0,0,0,0,0,0,0,0,0,0,null,"Gain","Surface Water","--","--",{"$f":"SUMIF(I123:I127,\">0\")","v":0},null,null,"Productivity",null,null,null,"Low"]
["Average YearWater Well Usage","Water Well Usage",{"$f":"C58*$U$14","v":-2713.7999999999997},-2939.9500000000003,-3392.25,-3618.4,-4070.7,-4523,-4975.3,-5201.45,-4523,-3618.4,-3166.1000000000004,-2487.65,-45230,null,"Loss","Water Well Usage","--","--",{"$f":"E140","v":-45230},null,null,"Vulnerability",null,null,null,"Moderate"]
["Average YearNet Gain","Net Gain",{"$f":"SUMIF(C9:C14, \">0\")","v":3670064.7657581065},{"$f":"SUMIF(D9:D14, \">0\")","v":2407554.7143571004},{"$f":"SUMIF(E9:E14, \">0\")","v":1758166.1081600043},466118.46913735138,60675.263999999996,57978.585599999991,58652.755199999992,57304.416000000005,54607.7376,1298261.771375708,3866329.1983334413,3771103.9558776896,17526817.7413994,null,"Net Gain",null,null,null,{"$f":"SUMIF(U9:U14, \">0\")","v":15051556.130649166},null,null,"Demand",null,null,null,"Low"]
["Average YearNet Loss","Net Loss",{"$f":"SUMIF(C9:C14, \"<0\")","v":-1666349.3345022092},{"$f":"SUMIF(D9:D14, \"<0\")","v":-1567671.7374875655},{"$f":"SUMIF(E9:E14, \"<0\")","v":-1597386.7962613283},-1438877.4179313385,-1904338.3001058642,-2099380.2870549588,-2088211.4419582963,-1634740.6246396021,-1346223.3931558565,-1272719.1777542331,-1386388.0357985103,-1630823.1203197772,-19633109.666969538,null,"Net Loss",null,null,null,{"$f":"SUMIF(U9:U14, \"<0\")","v":-17157848.056219306},null,null,"Use",null,null,null,"Domestic"]
["Average YearNet Total (Gain - Loss)","Net Total (Gain - Loss)",{"$f":"SUM(C15:C16)","v":2003715.4312558973},{"$f":"SUM(D15:D16)","v":839882.97686953493},160779.31189867598,-972758.94879398716,-1843663.0361058642,-2041401.7014549589,-2029558.6867582963,-1577436.2086396022,-1291615.6555558564,25542.593621474924,2479941.1625349307,2140280.8355579125,-2106291.9255701397,null,"Net Total (Gain - Loss)",null,null,null,{"$f":"SUM(U15:U16)","v":-2106291.9255701397}]
[null,null,null,null,null,null,null,null,null,null,null,null,null,null,null,null,null,null,null,null,null,null,"Location"]
[null,null,null,null,null,null,null,null,null,null,null,null,null,null,null,null,null,null,null,null,null,null,null,"NTS 50000",null,null,null,"092B/12"]
[null,null,null,null,null,null,null,null,null,null,null,null,null,null,null,null,null,null,null,null,null,null,null,"TRIM 20000",null,null,null,"Straddles 092B.062 & 092B.072"]
[null,null,null,null,null,null,null,null,null,null,null,null,null,null,null,null,null,null,null,null,null,null,null,"Lat / Long (Centre)",null,null,null,"48o41'49\" / 123o41'34\""]
[null,"Monthly Gains and Loses (m3)","Hot/Dry (1989)",null,null,null,null,null,null,null,null,null,null,null,null,null,"Summary - Hot/Dry (1989)",null,null,null,null,null,null,"UTM Zone 10 (Centre)",null,null,null,"448940E / 5393900N"]
[null,"Source","Jan","Feb","Mar","Apr","May","Jun","Jul","Aug","Sep","Oct","Nov","Dec","Total",null,"Gains and Losses","Source","Area (m2)","Infiltration Rate","Q (m3/yr)"]
[{"$f":"$C$22&B24","v":"Hot/Dry (1989)Direct Recharge to 200"},"Direct Recharge to 200",{"$f":"$U$24*C62","v":2965569.4843520592},{"$f":"$U$24*D62","v":1700561.4119658095},2644211.2474190723,158719.06511680892,-623539.18438746361,-793595.32558404445,-680224.56478632393,-283426.90199430159,-188951.26799620106,481825.7333903127,1891402.1926419726,2399681.1035517538,{"$f":"SUM(C24:N24)","v":9672232.9936894514},null,"Gain","Direct Recharge to 200",26939892.0557,{"$f":"U24/S24","v":0.35903013173517823},{"$f":"R58","v":9672232.9936894532},null,"Climate"]
[{"$f":"$C$22&B25","v":"Hot/Dry (1989)Lateral Groundwater"},"Lateral Groundwater",{"$f":"$U$25*C63","v":-1240319.7046099831},{"$f":"$U$25*D63","v":-1149564.6042726673},-1270571.4047224217,-1255445.5546662025,-1315948.9548910796,-1270571.4047224217,-1315948.9548910796,-1300823.1048348602,-1240319.7046099831,-1285697.254778641,-1225193.8545537638,-1255445.5546662025,-15125850.056219306,null,"Loss","Lateral Groundwater","--","--",{"$f":"SUMIF(M82:M118, \"<0\")","v":-15125850.056219306},null,null,"Nearest active EC weather station / distance / elevation",null,null,null,"EC1012573 Duncan Kelvin Creek / 1.7 km to northwest;                                                                                                                                                    EC1017230 Shawnigan Lake / 4.3 km to southeast"]
["Hot/Dry (1989)Lateral Groundwater","Lateral Groundwater",{"$f":"$U$26*C63","v":55281.907200000001},{"$f":"$U$26*D63","v":51236.889599999995},56630.246400000004,55956.076800000003,58652.755199999992,56630.246400000004,58652.755199999992,57978.585599999991,55281.907200000001,57304.416000000005,54607.7376,55956.076800000003,674169.60000000009,null,"Gain","Lateral Groundwater","--","--",{"$f":"SUMIF(M82:M118, \">0\")","v":674169.6},null,null,"IDF Curve",null,null,null,"Unknown"]
["Hot/Dry (1989)Surface Water","Surface Water",{"$f":"$U$27*C64","v":-438441.67994844529},{"$f":"$U$27*D64","v":-384915.48310245964},-278045.59137024876,-134435.91309647847,-47667.798256004055,-19333.983435673865,-11482.115082412152,-3729.6374677993163,-3135.7778043722428,-28781.07314425016,-203405.63141340428,-433393.31587845209,-1986768,null,"Loss","Surface Water","--","--",{"$f":"SUMIF(I123:I127,\"<0\")","v":-1986768}]
["Hot/Dry (1989)Surface Water","Surface Water",{"$f":"$U$28*C64","v":0},{"$f":"$U$28*D64","v":0},0,0,0,0,0,0,0,0,0,0,0,null,"Gain","Surface Water","--","--",{"$f":"SUMIF(I123:I127,\">0\")","v":0},null,"Physiography"]
["Hot/Dry (1989)Water Well Usage","Water Well Usage",{"$f":"$U$29*C65","v":-2713.7999999999997},{"$f":"$U$29*D65","v":-2939.9500000000003},-3392.25,-3618.4,-4070.7,-4523,-4975.3,-5201.45,-4523,-3618.4,-3166.1000000000004,-2487.65,-45230,null,"Loss","Water Well Usage","--","--",{"$f":"E140","v":-45230},null,null,"Physiographic zone",null,null,null,"Canadian Cordillera / Western System / Outer Mountain Area / Insular Mountains / Vancouver Island Ranges"]
["Hot/Dry (1989)Net Gain","Net Gain",{"$f":"SUMIF(C24:C29, \">0\")","v":3020851.391552059},{"$f":"SUMIF(D24:D29, \">0\")","v":1751798.3015658096},{"$f":"SUMIF(E24:E29, \">0\")","v":2700841.4938190724},214675.14191680893,58652.755199999992,56630.246400000004,58652.755199999992,57978.585599999991,55281.907200000001,539130.14939031273,1946009.9302419727,2455637.1803517537,12916139.838437788,null,"Net Gain",null,null,null,{"$f":"SUMIF(U24:U29, \">0\")","v":10346402.593689453},null,null,"Elevation range (m amsl)",null,null,null,"40 - 480 m amsl"]
["Hot/Dry (1989)Net Loss","Net Loss",{"$f":"SUMIF(C24:C29, \"<0\")","v":-1681475.1845584286},{"$f":"SUMIF(D24:D29, \"<0\")","v":-1537420.037375127},{"$f":"SUMIF(E24:E29, \"<0\")","v":-1552009.2460926704},-1393499.8677626809,-1991226.6375345471,-2088023.71374214,-2012630.9347598157,-1593181.0942969609,-1436929.7504105563,-1318096.727922891,-1431765.5859671682,-1691326.5205446545,-19727585.300967641,null,"Net Loss",null,null,null,{"$f":"SUMIF(U24:U29, \"<0\")","v":-17157848.056219306},null,null,"Distance to marine",null,null,null,"4.12 NE"]
["Hot/Dry (1989)Net Total (Gain - Loss)","Net Total (Gain - Loss)",{"$f":"SUM(C30:C31)","v":1339376.2069936304},{"$f":"SUM(D30:D31)","v":214378.26419068268},1148832.247726402,-1178824.725845872,-1932573.8823345471,-2031393.4673421399,-1953978.1795598157,-1535202.5086969608,-1381647.8432105563,-778966.57853257831,514244.34427480446,764310.65980709926,-6811445.4625298511,null,"Net Total (Gain - Loss)",null,null,null,{"$f":"SUM(U30:U31)","v":-6811445.462529853},null,null,"Geomorphological setting",null,null,null,"Upland / foothills area with draped glacial moraine"]
[null,null,null,null,null,null,null,null,null,null,null,null,null,null,null,null,null,null,null,null,null,null,null,"Topography",null,null,null,"Locally rugged.  Three N-elongated, sub-conical hills , local fluvial incisions"]
[null,null,null,null,null,null,null,null,null,null,null,null,null,null,null,null,null,null,null,null,null,null,null,"Terrain",null,null,null,"Rugged to rolling in upland areas, rolling to undulating between topographic highs"]
[null,null,null,null,null,null,null,null,null,null,null,null,null,null,null,null,null,null,null,null,null,null,null,"Aspect",null,null,null,"Radial around central hills, generally towards east"]
[null,null,null,null,null,null,null,null,null,null,null,null,null,null,null,null,null,null,null,null,null,null,null,"Slope",null,null,null,"Mainly radial & convex / planar, concave along west edge"]
[null,"Monthly Gains and Loses (m3)","Cold/Wet (1999)",null,null,null,null,null,null,null,null,null,null,null,null,null,"Summary - Wet/Cold (1999)",null,null,null,null,null,null,"XS max grade (m/m)",null,null,null,"0.0630 to east-northeast"]
[null,"Source","Jan","Feb","Mar","Apr","May","Jun","Jul","Aug","Sep","Oct","Nov","Dec","Total",null,"Gains and Losses","Source","Area (m2)","Infiltration Rate","Q (m3/yr)",null,null,"Roughness coefficient",null,null,null,"0.65 (mainly coniferous cover)"]
[{"$f":"$C$37&B39","v":"Cold/Wet (1999)Direct Recharge to 200"},"Direct Recharge to 200",{"$f":"$U$39*C55","v":5999998.5594357392},{"$f":"$U$39*D55","v":3908168.0160519443},2820411.8013530164,677324.80131839344,-815288.09499684675,-1285646.6113411814,-1254289.3769182258,-564430.21961320157,-188143.40653773386,2062775.8361883485,6329063.8348189257,6169914.844883793,{"$f":"SUM(C39:N39)","v":23859859.984642968},null,"Gain","Direct Recharge to 200",26939892.0557,{"$f":"U39/S39","v":0.88567021483646413},{"$f":"T58","v":23859859.984642971}]
[{"$f":"$C$37&B40","v":"Cold/Wet (1999)Lateral Groundwater"},"Lateral Groundwater",{"$f":"$U$40*C70","v":-1225193.8545537638},{"$f":"$U$40*D70","v":-1179816.3043851058},-1315948.9548910796,-1300823.1048348602,-1361326.5050597375,-1300823.1048348602,-1315948.9548910796,-1285697.254778641,-1225193.8545537638,-1240319.7046099831,-1179816.3043851058,-1194942.1544413252,-15125850.056219306,null,"Loss","Lateral Groundwater","--","--",{"$f":"SUMIF(M82:M118, \"<0\")","v":-15125850.056219306},null,"Geology"]
["Cold/Wet (1999)Lateral Groundwater","Lateral Groundwater",{"$f":"$U$41*C70","v":54607.7376},{"$f":"$U$41*D70","v":52585.228799999997},58652.755199999992,57978.585599999991,60675.263999999996,57978.585599999991,58652.755199999992,57304.416000000005,54607.7376,55281.907200000001,52585.228799999997,53259.398399999998,674169.6,null,"Gain","Lateral Groundwater","--","--",{"$f":"SUMIF(M82:M118, \">0\")","v":674169.6},null,null,"Terrane",null,null,null,"Overlap / Wrangellia"]
["Cold/Wet (1999)Surface Water","Surface Water",{"$f":"$U$42*C71","v":-438441.67994844529},{"$f":"$U$42*D71","v":-384915.48310245964},-278045.59137024876,-134435.91309647847,-47667.798256004055,-19333.983435673865,-11482.115082412152,-3729.6374677993163,-3135.7778043722428,-28781.07314425016,-203405.63141340428,-433393.31587845209,-1986768,null,"Loss","Surface Water","--","--",{"$f":"SUMIF(I123:I127,\"<0\")","v":-1986768},null,null,"Bedrock (age ; formation ; lithology)"]
["Cold/Wet (1999)Surface Water","Surface Water",{"$f":"$U$43*C71","v":0},{"$f":"$U$43*D71","v":0},0,0,0,0,0,0,0,0,0,0,0,null,"Gain","Surface Water","--","--",{"$f":"SUMIF(I123:I127,\">0\")","v":0},null,null,null,"Primary",null,null," SE half = Devonian Sicker Group (muDSiD) & Triassic Karmutsen Fm Volcanics (uTrVK); basaltic (55%)"]
["Cold/Wet (1999)Water Well Usage","Water Well Usage",{"$f":"$U$44*C72","v":-2713.7999999999997},{"$f":"$U$44*D72","v":-2939.9500000000003},-3392.25,-3618.4,-4070.7,-4523,-4975.3,-5201.45,-4523,-3618.4,-3166.1000000000004,-2487.65,-45230,null,"Loss","Water Well Usage","--","--",{"$f":"E140","v":-45230},null,null,null,"Secondary",null,null,"NW half, E & SE fringes = Jurassic Island Plutonic Suite (EMJlgd); granodioritic (35%) "]
["Cold/Wet (1999)Net Gain","Net Gain",{"$f":"SUMIF(C39:C44, \">0\")","v":6054606.2970357388},{"$f":"SUMIF(D39:D44, \">0\")","v":3960753.2448519445},{"$f":"SUMIF(E39:E44, \">0\")","v":2879064.5565530164},735303.38691839343,60675.263999999996,57978.585599999991,58652.755199999992,57304.416000000005,54607.7376,2118057.7433883483,6381649.0636189254,6223174.2432837933,28641827.294050161,null,"Net Gain",null,null,null,{"$f":"SUMIF(U39:U44, \">0\")","v":24534029.584642973},null,null,null,"Tertiary",null,null,"North end = Upper Cretaceous Nanaimo Group (uKN), shale(5%);                                                                                                                                                           Central / SE areas =  Carboniferous-Permian Buttle Lake Formation (PnPBM); limestone (5%)"]
["Cold/Wet (1999)Net Loss","Net Loss",{"$f":"SUMIF(C39:C44, \"<0\")","v":-1666349.3345022092},{"$f":"SUMIF(D39:D44, \"<0\")","v":-1567671.7374875655},{"$f":"SUMIF(E39:E44, \"<0\")","v":-1597386.7962613283},-1438877.4179313385,-2228353.0983125884,-2610326.699611715,-2586695.7468917174,-1859058.5618596419,-1420996.0388958699,-1272719.1777542331,-1386388.0357985103,-1630823.1203197772,-21265645.765626498,null,"Net Loss",null,null,null,{"$f":"SUMIF(U39:U44, \"<0\")","v":-17157848.056219306}]
["Cold/Wet (1999)Net Total (Gain - Loss)","Net Total (Gain - Loss)",{"$f":"SUM(C45:C46)","v":4388256.9625335298},{"$f":"SUM(D45:D46)","v":2393081.5073643792},1281677.7602916881,-703574.03101294511,-2167677.8343125884,-2552348.1140117152,-2528042.9916917174,-1801754.145859642,-1366388.3012958698,845338.56563411513,4995261.0278204149,4592351.1229640162,7376181.528423667,null,"Net Total (Gain - Loss)",null,null,null,{"$f":"SUM(U45:U46)","v":7376181.528423667},null,null,"Structure",null,null,null,"AQ lies NW of major NE splay of San Juan Fault.  N and NNW mapped faults cross east-centre "]
[null,null,null,null,null,null,null,null,null,null,null,null,null,null,null,null,null,null,null,null,null,null,null,"Surficial (formation; lithology; thickness)",null,null,null,"Vashon Drift Formation, morainal; silt-sand; shallow blankets & veneers (> 5 m)"]
[null,null,null,null,null,null,null,null,null,null,null,null,null,null,null,null,null,null,null,null,null,null,null,"Surficial designation (1993)",null,null,null,"Generally Cb-Cv // R ;  E flank = Cb //sgFG"]
[null,null,null,null,null,null,null,null,null,null,null,null,null,null,null,null,null,null,null,null,null,null,null,"Soils (association; parent; texture; drainage; type; comments)",null,null,null,"Generally RL5R0S1/ed (Rosewall/Shawingan SAs), E & SE flanks - S1v/ed;  colluvial / moraine; gsl / si-s; rapid - good; O.HFP / DU.DYB ; coarse-textured soils + duric zones"]
[null,null,null,null,null,null,null,null,null,null,null,null,null,null,null,null,"Table B-2.  Direct Recharge Calculation for AQ200",null,null,null,null,null,null,"Restrictive layers",null,null,null,"RL soils - no / S soils yes (near-urface duric layers) "]
[null,"Table B-5  Monthly  Coefficients used in Calculations for AQ200",null,null,null,null,null,null,null,null,null,null,null,null,null,null,null,"Direct Recharge Calculation",null,null,null,null,null,"Estimated permeability",null,null,null,"RL soils - high; S soils low to moderate"]
[null,"Monthly Factors","30 Year Average",null,null,null,null,null,null,null,null,null,null,null,null,null,null,"Hot/Dry","Average","Cold/Wet"]
[null,null,"Jan","Feb","Mar","Apr","May","Jun","Jul","Aug","Sep","Oct","Nov","Dec",null,null,"Surplus (mm)",{"$f":"SUM('Climate Dashboard'!AA42:AL42)","v":511.89034592156941},{"$f":"SUM('Climate Dashboard'!C48:AL48)/3","v":760.90447463619182},{"$f":"SUM('Climate Dashboard'!AA54:AL54)","v":1262.7520438297711},null,null,"Hydrology"]
[null,"Surplus Water",{"$f":"'Monthly Factors'!B16","v":0.25146830548450599},{"$f":"'Monthly Factors'!C16","v":0.16379677075085},{"$f":"'Monthly Factors'!D16","v":0.1182073911233482},{"$f":"'Monthly Factors'!E16","v":2.8387626824061124E-2},{"$f":"'Monthly Factors'!F16","v":-3.4169860825738051E-2},{"$f":"'Monthly Factors'!G16","v":-5.3883242071356162E-2},{"$f":"'Monthly Factors'!H16","v":-5.2569016654981621E-2},{"$f":"'Monthly Factors'!I16","v":-2.3656057494741728E-2},{"$f":"'Monthly Factors'!J16","v":-7.8853524982472421E-3},{"$f":"'Monthly Factors'!K16","v":8.6453811443823317E-2},{"$f":"'Monthly Factors'!L16","v":0.26525988999485034},{"$f":"'Monthly Factors'!M16","v":0.25858973392362583},null,null,"Station Coeffiecient Factor",1.1200000000000001,1.1200000000000001,1.1200000000000001,null,null,null,"GW / SW basin coincidence",null,null,null,"No"]
[null,"Leakance/\nLateral Ground Water",{"$f":"'Monthly Factors'!B42","v":8.1000000000000003E-2},{"$f":"'Monthly Factors'!C42","v":7.8E-2},{"$f":"'Monthly Factors'!D42","v":8.6999999999999994E-2},{"$f":"'Monthly Factors'!E42","v":8.5999999999999993E-2},{"$f":"'Monthly Factors'!F42","v":0.09},{"$f":"'Monthly Factors'!G42","v":8.5999999999999993E-2},{"$f":"'Monthly Factors'!H42","v":8.6999999999999994E-2},{"$f":"'Monthly Factors'!I42","v":8.5000000000000006E-2},{"$f":"'Monthly Factors'!J42","v":8.1000000000000003E-2},{"$f":"'Monthly Factors'!K42","v":8.2000000000000003E-2},{"$f":"'Monthly Factors'!L42","v":7.8E-2},{"$f":"'Monthly Factors'!M42","v":7.9000000000000001E-2},null,null,"Infiltration Coefficient",0.62623298168200003,0.62623298168200003,0.62623298168200003,null,null,null,"Catchments",null,null,null,"Kelvin / Koksilah"]
[null,"Surface Water",{"$f":"'Monthly Factors'!B26","v":0.22068086457424585},{"$f":"'Monthly Factors'!C26","v":0.19373952223030552},{"$f":"'Monthly Factors'!D26","v":0.13994869625957773},{"$f":"'Monthly Factors'!E26","v":6.7665632372012466E-2},{"$f":"'Monthly Factors'!F26","v":2.399263439717373E-2},{"$f":"'Monthly Factors'!G26","v":9.7313744914725147E-3},{"$f":"'Monthly Factors'!H26","v":5.7792933459831003E-3},{"$f":"'Monthly Factors'!I26","v":1.8772385441074731E-3},{"$f":"'Monthly Factors'!J26","v":1.5783311410150771E-3},{"$f":"'Monthly Factors'!K26","v":1.4486378451963268E-2},{"$f":"'Monthly Factors'!L26","v":0.10238016286421177},{"$f":"'Monthly Factors'!M26","v":0.21813987132793164},null,null,"Area (m2)",{"$f":"S9","v":26939892.0557},{"$f":"S9","v":26939892.0557},{"$f":"S9","v":26939892.0557},null,null,null,"Drainage regime",null,null,null,"Radial, concentrated along SE border with Koksilah River"]
[null,"Water Usage",{"$f":"'Monthly Factors'!B31","v":0.06},{"$f":"'Monthly Factors'!C31","v":6.5000000000000002E-2},{"$f":"'Monthly Factors'!D31","v":7.4999999999999997E-2},{"$f":"'Monthly Factors'!E31","v":0.08},{"$f":"'Monthly Factors'!F31","v":0.09},{"$f":"'Monthly Factors'!G31","v":0.1},{"$f":"'Monthly Factors'!H31","v":0.11},{"$f":"'Monthly Factors'!I31","v":0.115},{"$f":"'Monthly Factors'!J31","v":0.1},{"$f":"'Monthly Factors'!K31","v":0.08},{"$f":"'Monthly Factors'!L31","v":7.0000000000000007E-2},{"$f":"'Monthly Factors'!M31","v":5.5E-2},null,null,"Q (m3/yr)",{"$f":"(R54/1000)*R55*R56*R57","v":9672232.9936894532},{"$f":"(S54/1000)*S55*S56*S57","v":14377386.530649167},{"$f":"(T54/1000)*T55*T56*T57","v":23859859.984642971},null,null,null,"Surface waters",null,null,null,"One small tribuary of Kelvin Ck along NW side; two small tributaries of Koksilah River in SE area;                                            scattered small wetlands;  SE border formed by Koksilah River"]
[null,null,null,null,null,null,null,null,null,null,null,null,null,null,null,null,"Average Infiltration Rate",{"$f":"R58/R57","v":0.35903013173517823},{"$f":"S58/S57","v":0.53368389527779003},{"$f":"T58/T57","v":0.88567021483646413},null,null,null,"Runoff coefficient",null,null,null,"~35% forested / 50% cleared-forested / 10% rural residential; rolling to rugged terrain / moderate slope =   0.45"]
[null,"Monthly Factors","Hot/Dry (1989)",null,null,null,null,null,null,null,null,null,null,null,null,null,null,null,null,null,null,null,null,"Nearest Active EC hydrometric station; distance; type",null,null,null,"EC 08HA003 Koksilah River  @ Cowichan Station; 1.93 km NE; active realtime                                                                                                         + Shawnigan Creek @ Mill Bay; 6.97 km SE (inactive)"]
[null,null,"Jan","Feb","Mar","Apr","May","Jun","Jul","Aug","Sep","Oct","Nov","Dec",null,null,null,null,null,null,null,null,null,"Surface water diversions ; relevance",null,null,null,"15 within and along AQ boundaries, Koksilah River, Kelvin Creek, unnamed streams, springs; relevant"]
[null,"Surplus Water",{"$f":"'Monthly Factors'!B11","v":0.30660649782598431},{"$f":"'Monthly Factors'!C11","v":0.17581890480464263},{"$f":"'Monthly Factors'!D11","v":0.27338167402959174},{"$f":"'Monthly Factors'!E11","v":1.6409764448433315E-2},{"$f":"'Monthly Factors'!F11","v":-6.4466931761702304E-2},{"$f":"'Monthly Factors'!G11","v":-8.2048822242166558E-2},{"$f":"'Monthly Factors'!H11","v":-7.032756192185706E-2},{"$f":"'Monthly Factors'!I11","v":-2.9303150800773774E-2},{"$f":"'Monthly Factors'!J11","v":-1.9535433867182515E-2},{"$f":"'Monthly Factors'!K11","v":4.9815356361315413E-2},{"$f":"'Monthly Factors'!L11","v":0.19554969301049696},{"$f":"'Monthly Factors'!M11","v":0.24810001011321794}]
[null,"Leakance/\nLateral Ground Water",{"$f":"'Monthly Factors'!B43","v":8.2000000000000003E-2},{"$f":"'Monthly Factors'!C43","v":7.5999999999999998E-2},{"$f":"'Monthly Factors'!D43","v":8.4000000000000005E-2},{"$f":"'Monthly Factors'!E43","v":8.3000000000000004E-2},{"$f":"'Monthly Factors'!F43","v":8.6999999999999994E-2},{"$f":"'Monthly Factors'!G43","v":8.4000000000000005E-2},{"$f":"'Monthly Factors'!H43","v":8.6999999999999994E-2},{"$f":"'Monthly Factors'!I43","v":8.5999999999999993E-2},{"$f":"'Monthly Factors'!J43","v":8.2000000000000003E-2},{"$f":"'Monthly Factors'!K43","v":8.5000000000000006E-2},{"$f":"'Monthly Factors'!L43","v":8.1000000000000003E-2},{"$f":"'Monthly Factors'!M43","v":8.3000000000000004E-2},null,null,null,null,null,null,null,null,"Land Cover"]
[null,"Surface Water",{"$f":"'Monthly Factors'!B26","v":0.22068086457424585},{"$f":"'Monthly Factors'!C26","v":0.19373952223030552},{"$f":"'Monthly Factors'!D26","v":0.13994869625957773},{"$f":"'Monthly Factors'!E26","v":6.7665632372012466E-2},{"$f":"'Monthly Factors'!F26","v":2.399263439717373E-2},{"$f":"'Monthly Factors'!G26","v":9.7313744914725147E-3},{"$f":"'Monthly Factors'!H26","v":5.7792933459831003E-3},{"$f":"'Monthly Factors'!I26","v":1.8772385441074731E-3},{"$f":"'Monthly Factors'!J26","v":1.5783311410150771E-3},{"$f":"'Monthly Factors'!K26","v":1.4486378451963268E-2},{"$f":"'Monthly Factors'!L26","v":0.10238016286421177},{"$f":"'Monthly Factors'!M26","v":0.21813987132793164},null,null,null,null,null,null,null,null,null,"Vegetation zone",null,null,null,"Cgf-wC "]
[null,"Water Usage",{"$f":"'Monthly Factors'!B31","v":0.06},{"$f":"'Monthly Factors'!C31","v":6.5000000000000002E-2},{"$f":"'Monthly Factors'!D31","v":7.4999999999999997E-2},{"$f":"'Monthly Factors'!E31","v":0.08},{"$f":"'Monthly Factors'!F31","v":0.09},{"$f":"'Monthly Factors'!G31","v":0.1},{"$f":"'Monthly Factors'!H31","v":0.11},{"$f":"'Monthly Factors'!I31","v":0.115},{"$f":"'Monthly Factors'!J31","v":0.1},{"$f":"'Monthly Factors'!K31","v":0.08},{"$f":"'Monthly Factors'!L31","v":7.0000000000000007E-2},{"$f":"'Monthly Factors'!M31","v":5.5E-2},null,null,null,null,null,null,null,null,null,"Primary land uses",null,null,null,"Forestry / rural residential"]
[null,null,null,null,null,null,null,null,null,null,null,null,null,null,null,null,null,null,null,null,null,null,null,"Degree of development",null,null,null,"Low to moderate, mainly forestry & rural residential.  Very low impervious cover"]
[null,"Monthly Factors","Cold/Wet (1999)",null,null,null,null,null,null,null,null,null,null,null,null,null,null,null,null,null,null,null,null,"Evapotranspiration potential",null,null,null,"High"]
[null,null,"Jan","Feb","Mar","Apr","May","Jun","Jul","Aug","Sep","Oct","Nov","Dec",null,null,null,null,null,null,null,null,null,"Relative environmental sensitivity",null,null,null,"Low"]
[null,"Surplus Water",{"$f":"'Monthly Factors'!B21","v":0.28121118610350893},{"$f":"'Monthly Factors'!C21","v":0.28471061972718881},{"$f":"'Monthly Factors'!D21","v":0.1055893178084587},{"$f":"'Monthly Factors'!E21","v":-1.2670737757409583E-2},{"$f":"'Monthly Factors'!F21","v":-1.0294974427895285E-2},{"$f":"'Monthly Factors'!G21","v":-2.6925317734495361E-2},{"$f":"'Monthly Factors'!H21","v":-3.4844528832876351E-2},{"$f":"'Monthly Factors'!I21","v":-1.425457997708578E-2},{"$f":"'Monthly Factors'!J21","v":-6.3353688787047913E-3},{"$f":"'Monthly Factors'!K21","v":9.9861251950584262E-2},{"$f":"'Monthly Factors'!L21","v":0.16139352218500455},{"$f":"'Monthly Factors'!M21","v":0.17255960983372176}]
[null,"Leakance/\nLateral Ground Water",{"$f":"'Monthly Factors'!B44","v":8.1000000000000003E-2},{"$f":"'Monthly Factors'!C44","v":7.8E-2},{"$f":"'Monthly Factors'!D44","v":8.6999999999999994E-2},{"$f":"'Monthly Factors'!E44","v":8.5999999999999993E-2},{"$f":"'Monthly Factors'!F44","v":0.09},{"$f":"'Monthly Factors'!G44","v":8.5999999999999993E-2},{"$f":"'Monthly Factors'!H44","v":8.6999999999999994E-2},{"$f":"'Monthly Factors'!I44","v":8.5000000000000006E-2},{"$f":"'Monthly Factors'!J44","v":8.1000000000000003E-2},{"$f":"'Monthly Factors'!K44","v":8.2000000000000003E-2},{"$f":"'Monthly Factors'!L44","v":7.8E-2},{"$f":"'Monthly Factors'!M44","v":7.9000000000000001E-2},null,null,null,null,null,null,null,null,"Hydrogeology"]
[null,"Surface Water",{"$f":"'Monthly Factors'!B26","v":0.22068086457424585},{"$f":"'Monthly Factors'!C26","v":0.19373952223030552},{"$f":"'Monthly Factors'!D26","v":0.13994869625957773},{"$f":"'Monthly Factors'!E26","v":6.7665632372012466E-2},{"$f":"'Monthly Factors'!F26","v":2.399263439717373E-2},{"$f":"'Monthly Factors'!G26","v":9.7313744914725147E-3},{"$f":"'Monthly Factors'!H26","v":5.7792933459831003E-3},{"$f":"'Monthly Factors'!I26","v":1.8772385441074731E-3},{"$f":"'Monthly Factors'!J26","v":1.5783311410150771E-3},{"$f":"'Monthly Factors'!K26","v":1.4486378451963268E-2},{"$f":"'Monthly Factors'!L26","v":0.10238016286421177},{"$f":"'Monthly Factors'!M26","v":0.21813987132793164},null,null,null,null,null,null,null,null,null,"Groundwater occurrence (primary / secondary)",null,null,null,"Void infillings - bedrock fractures & faults, karst solution cavities"]
[null,"Water Usage",{"$f":"'Monthly Factors'!B31","v":0.06},{"$f":"'Monthly Factors'!C31","v":6.5000000000000002E-2},{"$f":"'Monthly Factors'!D31","v":7.4999999999999997E-2},{"$f":"'Monthly Factors'!E31","v":0.08},{"$f":"'Monthly Factors'!F31","v":0.09},{"$f":"'Monthly Factors'!G31","v":0.1},{"$f":"'Monthly Factors'!H31","v":0.11},{"$f":"'Monthly Factors'!I31","v":0.115},{"$f":"'Monthly Factors'!J31","v":0.1},{"$f":"'Monthly Factors'!K31","v":0.08},{"$f":"'Monthly Factors'!L31","v":7.0000000000000007E-2},{"$f":"'Monthly Factors'!M31","v":5.5E-2},null,null,null,null,null,null,null,null,null,"Primary porosity",null,null,null,"Low "]
[null,null,null,null,null,null,null,null,null,null,null,null,null,null,null,null,null,null,null,null,null,null,null,"Secondary porosity",null,null,null,"Moderate (probable good open void space due to brittle rock & local karst solution cavities)"]
[null,null,null,null,null,null,null,null,null,null,null,null,null,null,null,null,null,null,null,null,null,null,null,"Confinement",null,null,null,"Unconfined to semiconfined - assume bedrock fractures / karst cavities generally daylight to surface.                                East fringe locally semi-confined by duric till blankets;                                                                                                                                                          WP = 0 to 28.7 m, avg 3.0 m"]
[null,null,null,null,null,null,null,null,null,null,null,null,null,null,null,null,null,null,null,null,null,null,null,"Aquifer thickness",null,null,null,"Bedrock aquifer / assume < 150 m"]
[null,null,null,null,null,null,null,null,null,null,null,null,null,null,null,null,null,null,null,null,null,null,null,"Hydraulic anisotropy",null,null,null,"High"]
[null,"TABLE B-6",null,null,null,null,null,null,null,null,null,null,null,null,null,null,null,null,null,null,null,null,null,"Storage potential",null,null,null,"Low - moderate due to proximity / presence of large structures & brittle rocks"]
[null,"Groundwater Flow Components: Aquifer #0200, Kelvin Creek (Bedrock)",null,null,null,null,null,null,null,null,null,null,null,null,null,null,null,null,null,null,null,null,null,"Yield potential",null,null,null,"Low - moderate;  WP = 0.02 - 1.58 L/s / average 0.19 L/s"]
[null,null,null,null,null,null,null,null,null,null,null,null,null,null,null,null,null,null,null,null,null,null,null,"Flow velocities",null,null,null,"Moderate to high"]
[null,"Groundwater Flow","Direction of Flow","Source or Receptor of Water","Length (m)","Depth (m)","Area (m)","Hydraulic Conductivity (m/s) - K","Distance (m) - dL","Hydraulic Head (m) - dh",null,null,"GW Flow (m3/yr)",null,null,null,null,null,null,null,null,null,null,"Flow directions",null,null,null,"Radial, generally E or SE to Koksilah River"]
[null,null,null,null,null,null,null,null,null,"Year 1","Year 2","Year 3","Year 1","Year 2","Year 2",null,null,null,null,null,null,null,null,"Static water levels",null,null,null,"WP = variable 0 - 44.2 m bgs / avg 11.9 m bgs"]
[null,"QGW1","Zero","N/A",{"$f":"6.5*370","v":2405},200,{"$f":"E82*F82","v":481000},9.9999999999999995E-7,1,0,null,null,{"$f":"-(G82*H82*(J82/I82))*60*60*24*365","v":0},null,null,null,null,null,null,null,null,null,null,"Hydraulic connection with surface waters",null,null,null,"High - likely provides baseflow to Koksilah River mainstem & tributaries + Kelvin Creek tributaries"]
[null,"QGW2","Out","Koksilah River",{"$f":"1*370","v":370},180,{"$f":"E83*F83","v":66600},9.9999999999999995E-7,930,140,null,null,{"$f":"-(G83*H83*(J83/I83))*60*60*24*365","v":-316173.83225806453},null,null,null,null,null,null,null,null,null,null,"Hydraulic connection to adjacent AQ"]
[null,"QGW3","Out","Koksilah River",{"$f":"0.4*370","v":148},180,26640,1.0000000000000001E-5,600,40,null,null,-560079.3600000001,null,null,null,null,null,null,null,null,null,null,null,"Over / Under",null,null,"None"]
[null,"QGW4","Out","Koksilah River",{"$f":"1.4*370","v":518},180,93240,9.9999999999999995E-7,735,100,null,null,-400056.6857142857,null,null,null,null,null,null,null,null,null,null,null,"Upgradient",null,null,"Upgradient contact with undeveloped extension of bedrock AQ 200 (not in study area)"]
[null,"QGW5","Out","Koksilah River",{"$f":"0.3*370","v":111},180,19980,1.0000000000000001E-5,310,40,null,null,-813018.42580645159,null,null,null,null,null,null,null,null,null,null,null,"Downgradient",null,null,"Downgradient contacts with bedrock AQ202 (in study area), bedrock AQ 196 (not in study area),                                                 and undeveloped extension of AQ200"]
[null,"QGW6","Out","Koksilah River",{"$f":"1.9*370","v":703},180,126540,9.9999999999999995E-7,540,60,null,null,-443396.16,null,null,null,null,null,null,null,null,null,null,"Vulnerability to surface contamination",null,null,null,"High"]
[null,"QGW7","Out","Koksilah River",{"$f":"0.3*370","v":111},180,19980,1.0000000000000001E-5,245,40,null,null,-1028717.1918367348,null,null,null,null,null,null,null,null,null,null,"Recharge"]
[null,"QGW8","Out","Koksilah River",{"$f":"1.3*370","v":481},100,48100,9.9999999999999995E-7,210,60,null,null,-433394.74285714288,null,null,null,null,null,null,null,null,null,null,null,"Vertical inflow",null,null,"Mainly precipitation, limited snowmelt / sewerage.  Negligible to low from stream loss.  "]
[null,"QGW9","Out","Koksilah River",{"$f":"0.5*370","v":185},100,18500,1.0000000000000001E-5,520,100,null,null,-1121953.8461538462,null,null,null,null,null,null,null,null,null,null,null,"Lateral inflow",null,null,"Low - moderate lateral inflow from upgradient bedrock sources / possible increased K along faults"]
[null,"QGW10","Out","Koksilah River",{"$f":"1.3*370","v":481},100,48100,9.9999999999999995E-7,375,60,null,null,-242701.05599999998,null,null,null,null,null,null,null,null,null,null,null,"Temporal variability",null,null,"High, linked to precipitation trends"]
[null,"QGW11","Out","Koksilah River",{"$f":"0.8*370","v":296},80,23680,1.0000000000000001E-5,290,60,null,null,-1545046.5103448278,null,null,null,null,null,null,null,null,null,null,null,"MBR",null,null,"High from internal and upgradient (west and southwest) rocky hills"]
[null,"QGW12","Out","Koksilah River",{"$f":"3.1*370","v":1147},80,91760,9.9999999999999995E-7,275,60,"-","-",-631362.18763636355,null,null,null,null,null,null,null,null,null,null,"Discharge"]
[null,"QGW13","Out","Koksilah River",{"$f":"0.5*370","v":185},80,14800,1.0000000000000001E-5,230,40,null,null,-811709.21739130456,null,null,null,null,null,null,null,null,null,null,null,"Evapotranspiration potential",null,null,"High"]
[null,"QGW14","Out","Koksilah River",{"$f":"4*370","v":1480},140,207200,9.9999999999999995E-7,1160,80,null,null,-450638.56551724143,null,null,null,null,null,null,null,null,null,null,null,"Outflow to marine",null,null,"None"]
[null,"QGW15","Out","Koksilah River",{"$f":"0.2*370","v":74},140,10360,1.0000000000000001E-5,495,80,null,null,-528020.94545454555,null,null,null,null,null,null,null,null,null,null,null,"Outflow to surface waters",null,null,"High to Koksilah River along SE border"]
[null,"QGW16","Out","Koksilah River",{"$f":"0.9*370","v":333},140,46620,9.9999999999999995E-7,210,40,null,null,-280039.67999999999,null,null,null,null,null,null,null,null,null,null,null,"Outflow to other AQ",null,null,"High - possible MBR zone to downgradient aquifers"]
[null,"QGW17","Out","Koksilah River",{"$f":"2.1*370","v":777},140,108780,1.0000000000000001E-9,140,60,null,null,-1470.2083200000002,null,null,null,null,null,null,null,null,null,null,null,"Temporal variability",null,null,"High, linked to precipitation trends"]
[null,"QGW18","Zero","N/A",{"$f":"0.4*370","v":148},200,29600,1.0000000000000001E-9,1,0,null,null,0]
[null,null,"Out","N/A",{"$f":"0.2*370","v":74},200,14800,1E-8,175,60,null,null,-1600.2267428571429,null,null,null,null,null,null,null,null,null,"Groundwater Development"]
[null,"QGW19","Zero","N/A",{"$f":"0.6*370","v":222},200,44400,1.0000000000000001E-9,1,0,null,null,0,null,null,null,null,null,null,null,null,null,null,null,"Nearest BCMOE Observation Wells; distance; completion / relevance",null,null,"Well #233; 3.6 km NE; completed in surficial AQ197; irrelevant                                                                                                                                    Well #320; 4.8 km E; completed in surficial AQ197; irrelevant "]
[null,"QGW20","Out","N/A",{"$f":"0.3*370","v":111},200,22200,9.9999999999999995E-8,210,60,null,null,-20002.834285714282,null,null,null,null,null,null,null,null,null,null,null,"Total Annual Water Use (m3/yr) as reported by Hatfield (2015)",null,null,null,"  SUMS"]
[null,"QGW21","Out","N/A",{"$f":"0.5*370","v":185},200,37000,1.0000000000000001E-9,80,20,null,null,-291.70800000000003,null,null,null,null,null,null,null,null,null,null,null,null,"Industrial",null,0,"Total Commercial and Industrial"]
[null,"QGW22","Out","N/A",{"$f":"0.6*370","v":222},200,44400,9.9999999999999995E-7,70,20,null,null,-400056.68571428559,null,null,null,null,null,null,null,null,null,null,null,null,"Commercial",null,0,{"$f":"AB103+AB104","v":0}]
[null,"QGW23","Out","N/A",{"$f":"0.3*370","v":111},200,22200,1.0000000000000001E-5,70,20,null,null,-2000283.4285714286,null,null,null,null,null,null,null,null,null,null,null,null,"Domestic",null,44348,"Total Irrigation"]
[null,"QGW24","Out","N/A",{"$f":"1.8*370","v":666},200,133200,9.9999999999999995E-8,165,40,null,null,-101832.61090909093,null,null,null,null,null,null,null,null,null,null,null,null,"Irrigation from groundwater (Ministry of AGRICULTURE)",null,882,{"$f":"AB106","v":882}]
[null,"QGW25","Out","N/A",{"$f":"0.4*370","v":148},200,29600,1.0000000000000001E-5,310,40,null,null,-1204471.7419354843,null,null,null,null,null,null,null,null,null,null,null,null,"BCMOE Obs",null,0]
[null,"QGW26","Out","N/A",{"$f":"1*370","v":370},200,74000,9.9999999999999995E-7,120,20,null,null,-388943.99999999994,null,null,null,null,null,null,null,null,null,null,null,null,"Other",null,0,"Total Domestic + Water Systems + Other"]
[null,"QGW27","Out","N/A",{"$f":"2.2*370","v":814.00000000000011},200,162800.00000000003,1.0000000000000001E-9,185,40,null,null,-1110.0672000000002,null,null,null,null,null,null,null,null,null,null,null,null,"Water Supply Systems",null,0,{"$f":"AB105+AB108+AB109","v":44348}]
[null,"QGW28","Out","N/A",{"$f":"0.4*370","v":148},200,29600,9.9999999999999995E-8,460,60,null,null,-12175.638260869564]
[null,"QGW29","Out","N/A",{"$f":"6.7*370","v":2479},200,495800,1.0000000000000001E-9,505,140,null,null,-4334.6075881188126]
[null,"QGW30","Out","Humes Creek",{"$f":"0.7*370","v":259},20,5180,1.0000000000000001E-9,220,60,null,null,-44.551767272727275]
[null,"QGW31","Out","Humes Creek",{"$f":"0.9*370","v":333},20,6660,9.9999999999999995E-7,175,60,null,null,-72010.203428571418]
[null,"QGW32","Out","Humes Creek",{"$f":"0.4*370","v":148},20,2960,1.0000000000000001E-5,1190,20,"-","-",-15688.497478991596]
[null,"QGW33","Out","Humes Creek",{"$f":"6*370","v":2220},20,44400,9.9999999999999995E-7,350,15,"-","-",-60008.502857142848]
[null,"QGW34","Out","Humes Creek",{"$f":"0.4*370","v":148},20,2960,1.0000000000000001E-5,1190,20,"-","-",-15688.497478991596]
[null,"QGW35","Out","Humes Creek",{"$f":"4.5*370","v":1665},60,99900,9.9999999999999995E-7,155,60,"-","-",-1219527.6387096772]
[null,"QGW36","In","N/A",{"$f":"2.6*370","v":962},200,192400,9.9999999999999995E-7,180,20,"-","-",{"$f":"(G118*H118*(J118/I118))*60*60*24*365","v":674169.6}]
[null,"Total",null,null,null,null,null,null,null,null,null,null,{"$f":"SUM(M82:M118)","v":-14451680.456219306},{"$f":"SUM(N82:N118)","v":0},{"$f":"SUM(O82:O118)","v":0}]
[]
[null,"Surface Water Contributions","Cold Water Creek?","Observed Vertical Gradient","Percent Permeable","Length (m)","Width (m)","Flux (m/s)","SW Flow (m3/yr)",null,null,"Comment"]
[null,null,null,null,null,null,null,null,"Year 1","Year 2","Year 3"]
[null,"Riverside Creek","Unknown","Downward",0.1,1000,2,3.0000000000000001E-5,{"$f":"-(E123*F123*G123)*(H123*60*60*24*365)","v":-189216},null,null,"Creek is being fed by a pond that empties into the Koksilah River."]
[null,"Unknown Creek Name (south-east edge)","Unknown","Downward",0.1,5200,2,3.0000000000000001E-5,{"$f":"-(E124*F124*G124)*(H124*60*60*24*365)","v":-983923.20000000007},null,null,"Creek is being fed by wetlands that empties into the Koksilah River."]
[null,"Unknown Creek Name (south edge)","Unknown","Downward",0.1,2900,2,3.0000000000000001E-5,{"$f":"-(E125*F125*G125)*(H125*60*60*24*365)","v":-548726.4}]
[null,"Upex Creek","Unknown","Zero",0,3400,2,3.0000000000000001E-5,{"$f":"-(E126*F126*G126)*(H126*60*60*24*365)","v":0},null,null,"Conveyance feature across the thick over burden."]
[null,"Batty's Creek","Unknown","Downward",0.1,1400,2,3.0000000000000001E-5,{"$f":"-(E127*F127*G127)*(H127*60*60*24*365)","v":-264902.40000000002}]
[null,"Total",null,null,null,null,null,null,{"$f":"SUM(I123:I127)","v":-1986768},{"$f":"SUM(J123:J123)","v":0},{"$f":"SUM(K123:K123)","v":0}]
[]
[null,"Water Well Usage","Water Well Usage Volume (m3/yr)",null,null,null,null,null,null,null,null,"Comments"]
[null,null,"Year 1",null,null,"Year 2",null,null,"Year 3"]
[null,null,"Total Volume Removed","Adjustment Factor","Adjusted Volume Removed","Total Volume Removed","Adjustment Factor","Adjusted Volume Removed","Total Volume Removed","Adjustment Factor","Adjusted Volume Removed"]
[null,"Industrial",{"$f":"AB103","v":0},1,{"$f":"C133*D133","v":0},null,null,null,null,null,null,"Assuming 100% consumptive"]
[null,"Commercial",0,1,{"$f":"C134*D134","v":0},null,null,null,null,null,null,"Assuming 100% consumptive"]
[null,"Domestic",44348,1,44348,null,null,null,null,null,null,"Assuming 100% percent goes to septic beds"]
[null,"Irrigation",882,1,882,null,null,null,null,null,null,"Assuming that 100% of the water is taken from a surface water source. "]
[null,"BCMOE Obs",0,1,0,null,null,null,null,null,null,"Assuming 100% consumptive"]
[null,"Other",0,1,0,null,null,null,null,null,null,"Assuming 100% consumptive"]
[null,"Water Supply Systems",0,1,0,null,null,null,null,null,null,"Assuming 100% consumptive"]
[null,"Total",null,null,{"$f":"-SUM(E133:E139)","v":-45230},null,null,{"$f":"-SUM(H133:H139)","v":0},null,null,{"$f":"-SUM(K133:K139)","v":0}]

{"sheet":"Bedrock 202","index":8,"n_rows":149,"n_cols":29,"rows_kept":149,"cut":false,"hidden":false,"merged":[[4,2,4,4],[3,2,3,4],[2,2,2,4],[1,2,1,4],[139,5,139,7],[139,2,139,4],[138,2,138,10],[6,16,6,20],[21,16,21,20],[51,16,51,19],[131,8,131,10],[139,8,139,10]]}
[null,"CHM Aquifer Criteria: Aquifer #0202, North Shawnigan (Bedrock)",null,null,null,null,null,null,null,null,null,null,null,null,null,null,null,null,null,null,null,null,"TABLE C-1"]
[null,"AQ tag","202 North Shawnigan",null,null,null,null,null,null,null,null,null,null,null,null,null,null,null,null,null,null,null,"CHM Aquifer Criteria: Aquifer #0202, North Shawnigan (Bedrock)"]
[null,"Perimeter (km)",25.31]
[null,"Area (km2)",21,null,null,null,null,null,null,null,null,null,null,null,null,null,null,null,null,null,null,null,"BCMOE Criteria"]
[null,"Aquifer materials","Bedrock",null,null,null,null,null,null,null,null,null,null,null,null,null,null,null,null,null,null,null,null,"AQ tag",null,null,null,"202 North Shawnigan"]
[null,"Table C-4 Monthly  Summary of AQ202 Water Budgets",null,null,null,null,null,null,null,null,null,null,null,null,null,null,"Table C-3 Annual Summary of AQ202 Water Budgets",null,null,null,null,null,null,"AQ classification",null,null,null,"IIB(10)"]
[null,"Monthly Gains and Loses (m3)","Average Year",null,null,null,null,null,null,null,null,null,null,null,null,null,"Summary - 30 Year Average",null,null,null,null,null,null,"AQ type",null,null,null,"BCMOE Classification = 6b (SLR Classification = 6a / 5a-5b-6b)"]
[null,"Source","Jan","Feb","Mar","Apr","May","Jun","Jul","Aug","Sep","Oct","Nov","Dec","Total",null,"Gains and Losses","Source","Area (m2)","Infiltration Rate","Q (m3/yr)",null,null,"Location",null,null,null,"Shawnigan Lake / Cobble Hill; north of Shwnigan Lake , bounded to NW by Koksilah River, includes Cobble Hill & Thain wetland"]
[{"$f":"$C$7&B9","v":"Average YearDirect Recharge to 202"},"Direct Recharge to 202",{"$f":"$U$9*C55","v":2213318.5449271151},{"$f":"$U$9*D55","v":1441670.4705729559},1040411.873841014,249855.9839384458,-300748.78222712793,-474257.69505047105,-462690.43419558147,-208210.69538801166,-69403.565129337221,760930.18473867304,2334706.2868211148,2275998.3709207191,{"$f":"SUM(C9:N9)","v":8801580.5437695086},null,"Gain","Direct Recharge to 202",18884418.513900001,{"$f":"U9/S9","v":0.4660763336340511},{"$f":"S58","v":8801580.5437695086},null,null,"Perimeter (km)",null,null,null,25.31]
[{"$f":"$C$7&B10","v":"Average YearLeakage down from 201"},"Leakage down from 201",{"$f":"$U$10*C56","v":51336.981900000006},{"$f":"$U$10*D56","v":49435.612200000003},55139.721299999997,54505.931399999994,57041.091,54505.931399999994,55139.721299999997,53872.141500000005,51336.981900000006,51970.771800000002,49435.612200000003,50069.402099999999,{"$f":"SUM(C10:N10)","v":633789.9},null,"Gain","Leakage down from 201",{"$f":"G129","v":2112633},{"$f":"F129","v":0.3},{"$f":"S10*T10","v":633789.9},null,null,"Area (km2)",null,null,null,21]
["Average YearLateral Ground Water Loss","Lateral Ground Water Loss",{"$f":"$U$11*C56","v":-1372769.5517065055},{"$f":"$U$11*D56","v":-1321926.2349766348},-1474456.1851662465,-1457508.4129229563,-1525299.5018961171,-1457508.4129229563,-1474456.1851662465,-1440560.6406796663,-1372769.5517065055,-1389717.3239497957,-1321926.2349766348,-1338874.0072199251,-16947772.24329019,null,"Loss","Lateral Ground Water","--","--",{"$f":"SUMIF(M82:M128, \"<0\")","v":-16947772.24329019},null,null,"Aquifer materials",null,null,null,"Bedrock"]
["Average YearLateral Ground Water Gain","Lateral Ground Water Gain",{"$f":"$U$12*C56","v":299353.12141516811},{"$f":"$U$12*D56","v":288265.96877016191},321527.42670518055,317831.70915684511,332614.5793501868,317831.70915684511,321527.42670518055,314135.99160850979,299353.12141516811,303048.83896350354,288265.96877016191,291961.68631849729,3695717.5483354083,null,"Gain","Lateral Ground Water","--","--",{"$f":"SUMIF(M82:M128, \">0\")","v":3695717.5483354088},null,null,"Lithostratigraphic unit",null,null,null,"Bonanza Group and Sicker Volcanics"]
["Average YearSurface Water Loss","Surface Water Loss",{"$f":"$U$13*C57","v":0},{"$f":"$U$13*D57","v":0},0,0,0,0,0,0,0,0,0,0,0,null,"Loss","Surface Water","--","--",{"$f":"SUMIF(I134:I136, \"<0\")","v":0},null,null,"Productivity",null,null,null,"Low"]
["Average YearSurface Water Gain","Surface Water Gain",{"$f":"$U$14*C57","v":258889.3729219391},{"$f":"$U$14*D57","v":227283.42811764282},164179.30157100401,79381.205828396807,28146.69992259287,11416.256885826473,6779.9155724719376,2202.2621238434058,1851.6021321055146,16994.538428033426,120106.1823583911,255908.43413775266,1173139.2000000002,null,"Gain","Surface Water","--","--",{"$f":"SUMIF(I134:I136, \">0\")","v":1173139.2},null,null,"Vulnerability",null,null,null,"Moderate"]
["Average YearWell Water Usage","Well Water Usage",{"$f":"C55*$U$15","v":-48245.451748729894},{"$f":"D55*$U$15","v":-31425.229452404328},-22678.679023969969,-5446.3081443302472,6555.6586487219738,10337.769407600037,10085.628690341498,4538.5329106536747,1512.8443035512246,-16586.595994554722,-50891.436194962014,-49611.733401917234,-191855,null,"Loss"," Water Usage","--","--",{"$f":"E149","v":-191855},null,null,"Demand",null,null,null,"Moderate"]
["Average YearNet Gain","Net Gain",{"$f":"SUMIF(C9:C15, \">0\")","v":2822898.0211642222},2006655.4796607608,1581258.3234171988,701574.83032368775,424358.02892150165,394091.66685027163,393532.69226799393,374748.92814300692,354054.54975082487,1132944.33393021,2792514.0501496675,2873937.8934769691,15852568.798056316,null,"Net Gain",null,null,null,{"$f":"SUMIF(U9:U15, \">0\")","v":14304227.192104917},null,null,"Use",null,null,null,"Multiple"]
["Average YearNet Loss","Net Loss",{"$f":"SUMIF(C9:C15, \"<0\")","v":-1421015.0034552354},-1353351.4644290393,-1497134.8641902164,-1462954.7210672866,-1826048.2841232452,-1931766.1079734273,-1937146.6193618281,-1648771.3360676779,-1442173.1168358426,-1406303.9199443504,-1372817.671171597,-1388485.7406218422,-18687968.849241588,null,"Net Loss",null,null,null,{"$f":"SUMIF(U9:U15, \"<0\")","v":-17139627.24329019}]
["Average YearNet Total (Gain - Loss)","Net Total (Gain - Loss)",{"$f":"SUM(C16:C17)","v":1401883.0177089868},653304.01523172157,84123.459226982435,-761379.89074359881,-1401690.2552017435,-1537674.4411231556,-1543613.9270938342,-1274022.407924671,-1088118.5670850177,-273359.5860141404,1419696.3789780706,1485452.1528551269,-2835400.0511852717,null,"Net Total (Gain - Loss)",null,null,null,{"$f":"SUM(U16:U17)","v":-2835400.0511852726},null,"Location"]
[null,null,null,null,null,null,null,null,null,null,null,null,null,null,null,null,null,null,null,null,null,null,null,"NTS 50000",null,null,null,"092B/12"]
[null,null,null,null,null,null,null,null,null,null,null,null,null,null,null,null,null,null,null,null,null,null,null,"TRIM 20000",null,null,null,"Straddles 092B.062 and 092B.072"]
[null,null,null,null,null,null,null,null,null,null,null,null,null,null,null,null,null,null,null,null,null,null,null,"Lat / Long (Centre)",null,null,null,"48o40'36\" / 123o38'28\""]
[null,"Monthly Gains and Loses (m3)","Hot/Dry (1989)",null,null,null,null,null,null,null,null,null,null,null,null,null,"Summary - Hot/Dry (1989)",null,null,null,null,null,null,"UTM Zone 10 (Centre)",null,null,null,"452800E / 5391700N"]
[null,"Source","Jan","Feb","Mar","Apr","May","Jun","Jul","Aug","Sep","Oct","Nov","Dec","Total",null,"Gains and Losses","Source","Area (m2)","Infiltration Rate","Q (m3/yr)"]
[{"$f":"$C$22&B24","v":"Hot/Dry (1989)Direct Recharge to 202"},"Direct Recharge to 202",{"$f":"$U$24*C62","v":1815468.9392976295},{"$f":"$U$24*D62","v":1041053.4769400584},1618739.1372755552,97164.991181072139,-381719.60821135482,-485824.95590536058,-416421.39077602344,-173508.9128233431,-115672.60854889538,294965.15179968323,1157882.8115744428,1469042.1285709715,{"$f":"SUM(C24:N24)","v":5921169.1603744347},null,"Gain","Direct Recharge to 202",18884418.513900001,{"$f":"U24/S24","v":0.31354786783697464},{"$f":"R58","v":5921169.1603744347},null,"Climate"]
["Hot/Dry (1989)Leakage down from 201","Leakage down from 201",{"$f":"$U$25*C63","v":51970.771800000002},{"$f":"$U$25*D63","v":48168.032400000004},53238.351600000002,52604.561700000006,55139.721299999997,53238.351600000002,55139.721299999997,54505.931399999994,51970.771800000002,53872.141500000005,51336.981900000006,52604.561700000006,{"$f":"SUM(C25:N25)","v":633789.9},null,"Gain","Leakage down from 201",{"$f":"G129","v":2112633},0.3,{"$f":"S25*T25","v":633789.9},null,null,"Nearest active EC weather station / distance / elevation",null,null,null,"EC1017230 Shawnigan Lake / 750 m to southeast;                                                                                                                                                                    EC1015136 Mill Bay SW1  / 4.5 km to east-southeast"]
["Hot/Dry (1989)Lateral Ground Water Loss","Lateral Ground Water Loss",{"$f":"$U$26*C63","v":-1389717.3239497957},{"$f":"$U$26*D63","v":-1288030.6904900544},-1423612.8684363761,-1406665.0961930859,-1474456.1851662465,-1423612.8684363761,-1474456.1851662465,-1457508.4129229563,-1389717.3239497957,-1440560.6406796663,-1372769.5517065055,-1406665.0961930859,-16947772.24329019,null,"Loss","Lateral Ground Water","--","--",{"$f":"SUMIF(M82:M128, \"<0\")","v":-16947772.24329019},null,null,"IDF Curve",null,null,null,"Unknown"]
["Hot/Dry (1989)Lateral Ground Water Gain","Lateral Ground Water Gain",{"$f":"$U$27*C63","v":303048.83896350354},{"$f":"$U$27*D63","v":280874.53367349104},310440.27406017436,306744.55651183892,321527.42670518055,310440.27406017436,321527.42670518055,317831.70915684511,303048.83896350354,314135.99160850979,299353.12141516811,306744.55651183892,3695717.5483354088,null,"Gain","Lateral Ground Water","--","--",{"$f":"SUMIF(M82:M128, \">0\")","v":3695717.5483354088}]
["Hot/Dry (1989)Surface Water Loss","Surface Water Loss",{"$f":"$U$28*C65","v":0},{"$f":"$U$28*D65","v":0},0,0,0,0,0,0,0,0,0,0,0,null,"Loss","Surface Water","--","--",{"$f":"SUMIF(I134:I136, \"<0\")","v":0},null,"Physiography"]
["Hot/Dry (1989)Surface Water Gain","Surface Water Gain",{"$f":"$U$29*C65","v":70388.351999999999},{"$f":"$U$29*D65","v":76254.047999999995},87985.439999999988,93851.135999999999,105582.52799999999,117313.92,129045.31199999999,134911.008,117313.92,93851.135999999999,82119.744000000006,64522.655999999995,1173139.2,null,"Gain","Surface Water","--","--",{"$f":"SUMIF(I134:I136, \">0\")","v":1173139.2},null,null,"Physiographic zone",null,null,null,"Straddles: Canadian Cordillera / Western System / Coastal Trough / Georgia Depression / Nanaimo Lowland                                                                                                                                                                                                                                      & Canadian Cordillera / Western System / Outer Mountain Area / Insular Mountains / Vancouver Island Ranges"]
["Hot/Dry (1989)Well Water Usage","Well Water Usage",{"$f":"$U$30*C65","v":-11511.3},{"$f":"$U$30*D65","v":-12470.575000000001},-14389.125,-15348.4,-17266.95,-19185.5,-21104.05,-22063.325000000001,-19185.5,-15348.4,-13429.850000000002,-10552.025,-191855,null,"Loss"," Water Usage","--","--",{"$f":"E149","v":-191855},null,null,"Elevation range (m amsl)",null,null,null,"60 - 320 m amsl"]
["Hot/Dry (1989)Net Gain","Net Gain",{"$f":"SUMIF(C24:C30, \">0\")","v":2240876.9020611332},1446350.0910135494,2070403.2029357294,550365.24539291114,482249.67600518052,480992.54566017434,505712.4600051805,507248.64855684515,472333.53076350351,756824.4209081931,1590692.6588896108,1892913.9027828104,12996963.284974823,null,"Net Gain",null,null,null,{"$f":"SUMIF(U24:U30, \">0\")","v":11423815.808709843},null,null,"Distance to marine",null,null,null,"4.3 km to east"]
["Hot/Dry (1989)Net Loss","Net Loss",{"$f":"SUMIF(C24:C30, \"<0\")","v":-1401228.6239497957},-1300501.2654900544,-1438001.9934363761,-1422013.4961930858,-1873442.7433776013,-1928623.3243417367,-1911981.62594227,-1653080.6507462994,-1524575.4324986911,-1455909.0406796662,-1386199.4017065056,-1417217.1211930858,-18712774.719555166,null,"Net Loss",null,null,null,{"$f":"SUMIF(U24:U30, \"<0\")","v":-17139627.24329019},null,null,"Geomorphological setting",null,null,null,"NE-trending series of low bedrock hills, flanked to south by deep moraine;                                                                                                            North-central part of AQ hosts a NE-trending, elongated depression containing glaciofluvial/lacustrine materials "]
["Hot/Dry (1989)Net Total (Gain - Loss)","Net Total (Gain - Loss)",{"$f":"SUM(C31:C32)","v":839648.27811133745},145848.82552349498,632401.20949935331,-871648.25080017466,-1391193.0673724208,-1447630.7786815623,-1406269.1659370896,-1145832.0021894542,-1052241.9017351875,-699084.61977147311,204493.25718310522,475696.78158972459,-5715811.4345803466,null,"Net Total (Gain - Loss)",null,null,null,{"$f":"SUM(U31:U32)","v":-5715811.4345803466},null,null,"Topography",null,null,null,"NE-trending line of low, sub-conical hills  flanked to south by bench-like areas dropping to Shawnigan Lake;                      northeast area hosts large depression"]
[null,null,null,null,null,null,null,null,null,null,null,null,null,null,null,null,null,null,null,null,null,null,null,"Terrain",null,null,null,"Rolling along NW side of hills, rolling to undulating elsewhere , planar in NE depression"]
[null,null,null,null,null,null,null,null,null,null,null,null,null,null,null,null,null,null,null,null,null,null,null,"Aspect",null,null,null,"NW - SE trending, separated by NW line of sub-conical hills"]
[null,null,null,null,null,null,null,null,null,null,null,null,null,null,null,null,null,null,null,null,null,null,null,"Slope",null,null,null,"Generally convex to planar on  and flanking hills, concave around central depression"]
[null,"Monthly Gains and Loses (m3)","Cold/Wet (1999)",null,null,null,null,null,null,null,null,null,null,null,null,null,"Summary - Cold/Wet (1999)",null,null,null,null,null,null,"XS max grade (m/m)",null,null,null,"0.27 to east- northeast to west-southwest, near south end"]
[null,"Source","Jan","Feb","Mar","Apr","May","Jun","Jul","Aug","Sep","Oct","Nov","Dec","Total",null,"Gains and Losses","Source","Area (m2)","Infiltration Rate","Q (m3/yr)",null,null,"Roughness coefficient",null,null,null,"0.60 (partly cleared, mainly coniferous cover)"]
[{"$f":"$C$37&B39","v":"Cold/Wet (1999)Direct Recharge to 202"},"Direct Recharge to 202",{"$f":"$U$39*C69","v":4107534.3295712736},{"$f":"$U$39*D69","v":4158649.0947500328},1542299.0590943771,-185076.17367823256,-150374.39111356394,-393286.86906624417,-508959.47761513951,-208210.69538801163,-92538.08683911628,1458631.5938015701,2357407.762226487,2520506.1402804297,{"$f":"SUM(C39:N39)","v":14606582.286023861},null,"Gain","Direct Recharge to 202",18884418.513900001,{"$f":"U39/S39","v":0.7734727058327262},{"$f":"T58","v":14606582.286023865}]
["Cold/Wet (1999)Leakage down from 201","Leakage down from 201",{"$f":"$U$40*C70","v":51336.981900000006},{"$f":"$U$40*D70","v":49435.612200000003},55139.721299999997,54505.931399999994,57041.091,54505.931399999994,55139.721299999997,53872.141500000005,51336.981900000006,51970.771800000002,49435.612200000003,50069.402099999999,{"$f":"SUM(C40:N40)","v":633789.9},null,"Gain","Leakage down from 201",{"$f":"G129","v":2112633},0.3,{"$f":"S40*T40","v":633789.9},null,"Geology"]
["Cold/Wet (1999)Lateral Ground Water Loss","Lateral Ground Water Loss",{"$f":"$U$41*C70","v":-1372769.5517065055},{"$f":"$U$41*D70","v":-1321926.2349766348},-1474456.1851662465,-1457508.4129229563,-1525299.5018961171,-1457508.4129229563,-1474456.1851662465,-1440560.6406796663,-1372769.5517065055,-1389717.3239497957,-1321926.2349766348,-1338874.0072199251,-16947772.24329019,null,"Loss","Lateral Ground Water","--","--",{"$f":"SUMIF(M82:M128, \"<0\")","v":-16947772.24329019},null,null,"Terrane",null,null,null,"Wrangellia / Overlap"]
["Cold/Wet (1999)Lateral Ground Water Gain","Lateral Ground Water Gain",{"$f":"$U$42*C70","v":299353.12141516811},{"$f":"$U$42*D70","v":288265.96877016191},321527.42670518055,317831.70915684511,332614.5793501868,317831.70915684511,321527.42670518055,314135.99160850979,299353.12141516811,303048.83896350354,288265.96877016191,291961.68631849729,3695717.5483354083,null,"Gain","Lateral Ground Water","--","--",{"$f":"SUMIF(M82:M128, \">0\")","v":3695717.5483354088},null,null,"Bedrock (age ; formation ; lithology)"]
["Cold/Wet (1999)Surface Water Loss","Surface Water Loss",{"$f":"$U$43*C71","v":0},{"$f":"$U$43*D71","v":0},0,0,0,0,0,0,0,0,0,0,0,null,"Loss","Surface Water","--","--",{"$f":"SUMIF(I134:I136, \"<0\")","v":0},null,null,null,"Primary",null,null,"Central NE-trending V belt = Devonian Sicker Group Volcanics (muDSiD); basaltic (70%)"]
["Cold/Wet (1999)Surface Water Gain","Surface Water Gain",{"$f":"$U$44*C71","v":258889.3729219391},{"$f":"$U$44*D71","v":227283.42811764282},164179.30157100401,79381.205828396807,28146.69992259287,11416.256885826473,6779.9155724719376,2202.2621238434058,1851.6021321055146,16994.538428033426,120106.1823583911,255908.43413775266,1173139.2000000002,null,"Gain","Surface Water","--","--",{"$f":"SUMIF(I134:I136, \">0\")","v":1173139.2},null,null,null,"Secondary",null,null,"E portion NE-trending central belt triangle = Triassic Karmutsen Volcanics (uTrVK); basaltic (15%) "]
["Cold/Wet (1999)Well Water Usage","Well Water Usage",{"$f":"$U$45*C72","v":-11511.3},{"$f":"$U$45*D72","v":-12470.575000000001},-14389.125,-15348.4,-17266.95,-19185.5,-21104.05,-22063.325000000001,-19185.5,-15348.4,-13429.850000000002,-10552.025,-191855,null,"Loss"," Water Usage","--","--",{"$f":"E149","v":-191855},null,null,null,"Tertiary",null,null,"North end = Upper Cretaceous Nanaimo Group (uKN); shale (5%);                                                                                                                   SSE corner = Jurassic Bonanza Group Volcanics (IJBca); andesitic (5%)"]
["Cold/Wet (1999)Net Gain","Net Gain",{"$f":"SUMIF(C39:C45, \">0\")","v":4717113.8058083812},4723634.1038378384,2083145.5086705619,451718.84638524195,417802.37027277966,383753.89744267159,383447.06357765244,370210.39523235324,352541.70544727362,1830645.7429931071,2815215.5255550398,3118445.6628366797,21647674.628059581,null,"Net Gain",null,null,null,{"$f":"SUMIF(U39:U45, \">0\")","v":20109228.934359271},null,null,null,"Subsidiary",null,null,"Central NE-trending zone = Carboniferous Buttle Lake Group (PnPBM); limestone (2.5%);                                                                                                   NW corner = Jurassic Island Plutonic Suite (EMJgd); granodioritic (2.5%)"]
["Cold/Wet (1999)Net Loss","Net Loss",{"$f":"SUMIF(C39:C45, \"<0\")","v":-1384280.8517065055},-1334396.8099766348,-1488845.3101662465,-1657932.9866011888,-1692940.843009681,-1869980.7819892005,-2004519.712781386,-1670834.6610676779,-1484493.1385456217,-1405065.7239497956,-1335356.0849766349,-1349426.032219925,-18678072.936990496,null,"Net Loss",null,null,null,{"$f":"SUMIF(U39:U45, \"<0\")","v":-17139627.24329019},null,null,"Structure",null,null,null,"2 major ENE faults cross centre  of AQ - south = San Juan Fault / north = SJF splay.                                                                                             N-trending  faults mapped in SW corner; NE end of AQ contains Wrangellia / Overlap terrane unconformity"]
["Cold/Wet (1999)Net Total (Gain - Loss)","Net Total (Gain - Loss)",{"$f":"SUM(C46:C47)","v":3332832.9541018754},3389237.2938612038,594300.19850431546,-1206214.1402159468,-1275138.4727369014,-1486226.884546529,-1621072.6492037335,-1300624.2658353248,-1131951.4330983481,425580.01904331148,1479859.4405784048,1769019.6306167548,2969601.6910690814,null,"Net Total (Gain - Loss)",null,null,null,{"$f":"SUM(U46:U47)","v":2969601.6910690814},null,null,"Surficial (formation; lithology; thickness)",null,null,null,"Vashon Drift, morainal & colluvial / Capilano Formation, glaciofluvial/lacustrine in NE depression;  silt-sand; shallow - moderate blankets & veneers (> 10 m)"]
[null,null,null,null,null,null,null,null,null,null,null,null,null,null,null,null,null,null,null,null,null,null,null,"Surficial designation (1993)",null,null,null,"Hilly areas = Cv/Cb/R; morainal blankets = dMb/Cb/R; NE depression = $LGp"]
[null,null,null,null,null,null,null,null,null,null,null,null,null,null,null,null,null,null,null,null,null,null,null,"Soils (association; parent; texture; drainage; type; comments)",null,null,null,"Hilly areas = RL5S5/gf (Rosewall/Shawnigan), colluvial-moraine veneers, rapid - good, O.HFP-shli & DU.DYB;                                                Morainal blankets = S1vQ5RL5/ef (Shawnigan, Qualicum,Rosewall), morainal & glaciofluvial blankets, moderate to good, DU-DYB;                                                                                                                                                                                                                                                                NE depressional area = C1AR1/b (Cowichan, Arrowsmith), marine/lacustrine blankets, imperfect to poor, O.HG & T.M "]
[null,null,null,null,null,null,null,null,null,null,null,null,null,null,null,null,"Table C-2.  Direct Recharge Calculation for AQ202",null,null,null,null,null,null,"Restrictive layers",null,null,null,"Yes - surface duric layers in Shawnigan soils / surface si-cy textures in Cowichan - Arrowsmith soils"]
[null,"Table C-5  Monthly  Coefficients used in Calculations for AQ202",null,null,null,null,null,null,null,null,null,null,null,null,null,null,"Direct Recharge Calculation",null,null,null,null,null,null,"Estimated permeability",null,null,null,"Low - moderate @ surface from dominant M-LG / high at bedrock ct from dominant Cb-Cv"]
[null,"Monthly Factors","30 Year Average",null,null,null,null,null,null,null,null,null,null,null,null,null,null,"Hot/Dry","Average","Cold/Wet"]
[null,null,"Jan","Feb","Mar","Apr","May","Jun","Jul","Aug","Sep","Oct","Nov","Dec",null,null,"Surplus (mm)",{"$f":"SUM('Climate Dashboard'!AA42:AL42)","v":511.89034592156941},{"$f":"SUM('Climate Dashboard'!C48:AL48)/3","v":760.90447463619182},{"$f":"SUM('Climate Dashboard'!AA54:AL54)","v":1262.7520438297711},null,null,"Hydrology"]
[null,"Surplus Water",{"$f":"'Monthly Factors'!B16","v":0.25146830548450599},{"$f":"'Monthly Factors'!C16","v":0.16379677075085},{"$f":"'Monthly Factors'!D16","v":0.1182073911233482},{"$f":"'Monthly Factors'!E16","v":2.8387626824061124E-2},{"$f":"'Monthly Factors'!F16","v":-3.4169860825738051E-2},{"$f":"'Monthly Factors'!G16","v":-5.3883242071356162E-2},{"$f":"'Monthly Factors'!H16","v":-5.2569016654981621E-2},{"$f":"'Monthly Factors'!I16","v":-2.3656057494741728E-2},{"$f":"'Monthly Factors'!J16","v":-7.8853524982472421E-3},{"$f":"'Monthly Factors'!K16","v":8.6453811443823317E-2},{"$f":"'Monthly Factors'!L16","v":0.26525988999485034},{"$f":"'Monthly Factors'!M16","v":0.25858973392362583},null,null,"Station Coeffiecient Factor",1.0900000000000001,1.0900000000000001,1.0900000000000001,null,null,null,"GW / SW basin coincidence",null,null,null,"No"]
[null,"Leakance/\nLateral Ground Water",{"$f":"'Monthly Factors'!B42","v":8.1000000000000003E-2},{"$f":"'Monthly Factors'!C42","v":7.8E-2},{"$f":"'Monthly Factors'!D42","v":8.6999999999999994E-2},{"$f":"'Monthly Factors'!E42","v":8.5999999999999993E-2},{"$f":"'Monthly Factors'!F42","v":0.09},{"$f":"'Monthly Factors'!G42","v":8.5999999999999993E-2},{"$f":"'Monthly Factors'!H42","v":8.6999999999999994E-2},{"$f":"'Monthly Factors'!I42","v":8.5000000000000006E-2},{"$f":"'Monthly Factors'!J42","v":8.1000000000000003E-2},{"$f":"'Monthly Factors'!K42","v":8.2000000000000003E-2},{"$f":"'Monthly Factors'!L42","v":7.8E-2},{"$f":"'Monthly Factors'!M42","v":7.9000000000000001E-2},null,null,"Infiltration Coefficient",0.56195354461699998,0.56195354461699998,0.56195354461699998,null,null,null,"Catchments",null,null,null,"Koksilah / Shawnigan"]
[null,"Surface Water",{"$f":"'Monthly Factors'!B26","v":0.22068086457424585},{"$f":"'Monthly Factors'!C26","v":0.19373952223030552},{"$f":"'Monthly Factors'!D26","v":0.13994869625957773},{"$f":"'Monthly Factors'!E26","v":6.7665632372012466E-2},{"$f":"'Monthly Factors'!F26","v":2.399263439717373E-2},{"$f":"'Monthly Factors'!G26","v":9.7313744914725147E-3},{"$f":"'Monthly Factors'!H26","v":5.7792933459831003E-3},{"$f":"'Monthly Factors'!I26","v":1.8772385441074731E-3},{"$f":"'Monthly Factors'!J26","v":1.5783311410150771E-3},{"$f":"'Monthly Factors'!K26","v":1.4486378451963268E-2},{"$f":"'Monthly Factors'!L26","v":0.10238016286421177},{"$f":"'Monthly Factors'!M26","v":0.21813987132793164},null,null,"Area (m2)",{"$f":"S9","v":18884418.513900001},{"$f":"S9","v":18884418.513900001},{"$f":"S9","v":18884418.513900001},null,null,null,"Drainage regime",null,null,null,"Radial"]
[null,"Water Usage",{"$f":"'Monthly Factors'!B31","v":0.06},{"$f":"'Monthly Factors'!C31","v":6.5000000000000002E-2},{"$f":"'Monthly Factors'!D31","v":7.4999999999999997E-2},{"$f":"'Monthly Factors'!E31","v":0.08},{"$f":"'Monthly Factors'!F31","v":0.09},{"$f":"'Monthly Factors'!G31","v":0.1},{"$f":"'Monthly Factors'!H31","v":0.11},{"$f":"'Monthly Factors'!I31","v":0.115},{"$f":"'Monthly Factors'!J31","v":0.1},{"$f":"'Monthly Factors'!K31","v":0.08},{"$f":"'Monthly Factors'!L31","v":7.0000000000000007E-2},{"$f":"'Monthly Factors'!M31","v":5.5E-2},null,null,"Q (m3/yr)",{"$f":"(R54/1000)*R55*R56*R57","v":5921169.1603744347},{"$f":"(S54/1000)*S55*S56*S57","v":8801580.5437695086},{"$f":"(T54/1000)*T55*T56*T57","v":14606582.286023865},null,null,null,"Surface waters",null,null,null,"Three watercourses & wetland chains (incl. Hartl CK), three small waterbodies (inc Cobble Hill Quarry Lake & Silver Mine lakes), radial drainage / north boundary formed by Koksilah River"]
[null,null,null,null,null,null,null,null,null,null,null,null,null,null,null,null,"Average Infiltration Rate",{"$f":"R58/R57","v":0.31354786783697464},{"$f":"S58/S57","v":0.4660763336340511},{"$f":"T58/T57","v":0.7734727058327262},null,null,null,"Runoff coefficient",null,null,null,"~15% cleared-agricultural / ~75% forested / 10% rural residential /moderate slope =  0.60"]
[null,"Monthly Factors","Hot/Dry (1989)",null,null,null,null,null,null,null,null,null,null,null,null,null,null,null,null,null,null,null,null,"Nearest Active EC hydrometric station; distance; type",null,null,null,"EC 08HA003 Koksilah River  @ Cowichan Station; 2.7 km NW; active realtime;                                                                                                      + Shawnigan Creek @ Mill Bay; 4.5 km SE (inactive)"]
[null,null,"Jan","Feb","Mar","Apr","May","Jun","Jul","Aug","Sep","Oct","Nov","Dec",null,null,null,null,null,null,null,null,null,"Surface water diversions ; relevance",null,null,null,"22 within AQ boundaries, Koksilah & Hartl Ck, springs ; relevant"]
[null,"Surplus Water",{"$f":"'Monthly Factors'!B11","v":0.30660649782598431},{"$f":"'Monthly Factors'!C11","v":0.17581890480464263},{"$f":"'Monthly Factors'!D11","v":0.27338167402959174},{"$f":"'Monthly Factors'!E11","v":1.6409764448433315E-2},{"$f":"'Monthly Factors'!F11","v":-6.4466931761702304E-2},{"$f":"'Monthly Factors'!G11","v":-8.2048822242166558E-2},{"$f":"'Monthly Factors'!H11","v":-7.032756192185706E-2},{"$f":"'Monthly Factors'!I11","v":-2.9303150800773774E-2},{"$f":"'Monthly Factors'!J11","v":-1.9535433867182515E-2},{"$f":"'Monthly Factors'!K11","v":4.9815356361315413E-2},{"$f":"'Monthly Factors'!L11","v":0.19554969301049696},{"$f":"'Monthly Factors'!M11","v":0.24810001011321794}]
[null,"Leakance/\nLateral Ground Water",{"$f":"'Monthly Factors'!B43","v":8.2000000000000003E-2},{"$f":"'Monthly Factors'!C43","v":7.5999999999999998E-2},{"$f":"'Monthly Factors'!D43","v":8.4000000000000005E-2},{"$f":"'Monthly Factors'!E43","v":8.3000000000000004E-2},{"$f":"'Monthly Factors'!F43","v":8.6999999999999994E-2},{"$f":"'Monthly Factors'!G43","v":8.4000000000000005E-2},{"$f":"'Monthly Factors'!H43","v":8.6999999999999994E-2},{"$f":"'Monthly Factors'!I43","v":8.5999999999999993E-2},{"$f":"'Monthly Factors'!J43","v":8.2000000000000003E-2},{"$f":"'Monthly Factors'!K43","v":8.5000000000000006E-2},{"$f":"'Monthly Factors'!L43","v":8.1000000000000003E-2},{"$f":"'Monthly Factors'!M43","v":8.3000000000000004E-2},null,null,null,null,null,null,null,null,"Land Cover"]
[null,"Surface Water",{"$f":"'Monthly Factors'!B26","v":0.22068086457424585},{"$f":"'Monthly Factors'!C26","v":0.19373952223030552},{"$f":"'Monthly Factors'!D26","v":0.13994869625957773},{"$f":"'Monthly Factors'!E26","v":6.7665632372012466E-2},{"$f":"'Monthly Factors'!F26","v":2.399263439717373E-2},{"$f":"'Monthly Factors'!G26","v":9.7313744914725147E-3},{"$f":"'Monthly Factors'!H26","v":5.7792933459831003E-3},{"$f":"'Monthly Factors'!I26","v":1.8772385441074731E-3},{"$f":"'Monthly Factors'!J26","v":1.5783311410150771E-3},{"$f":"'Monthly Factors'!K26","v":1.4486378451963268E-2},{"$f":"'Monthly Factors'!L26","v":0.10238016286421177},{"$f":"'Monthly Factors'!M26","v":0.21813987132793164},null,null,null,null,null,null,null,null,null,"Vegetation zone",null,null,null,"Cgf-wC "]
[null,"Water Usage",{"$f":"'Monthly Factors'!B31","v":0.06},{"$f":"'Monthly Factors'!C31","v":6.5000000000000002E-2},{"$f":"'Monthly Factors'!D31","v":7.4999999999999997E-2},{"$f":"'Monthly Factors'!E31","v":0.08},{"$f":"'Monthly Factors'!F31","v":0.09},{"$f":"'Monthly Factors'!G31","v":0.1},{"$f":"'Monthly Factors'!H31","v":0.11},{"$f":"'Monthly Factors'!I31","v":0.115},{"$f":"'Monthly Factors'!J31","v":0.1},{"$f":"'Monthly Factors'!K31","v":0.08},{"$f":"'Monthly Factors'!L31","v":7.0000000000000007E-2},{"$f":"'Monthly Factors'!M31","v":5.5E-2},null,null,null,null,null,null,null,null,null,"Primary land uses",null,null,null,"Forestry / agricultural / rural residential"]
[null,null,null,null,null,null,null,null,null,null,null,null,null,null,null,null,null,null,null,null,null,null,null,"Degree of development",null,null,null,"Low, mainly forestry & agricultural.  Very low impervious cover"]
[null,"Monthly Factors","Cold/Wet (1999)",null,null,null,null,null,null,null,null,null,null,null,null,null,null,null,null,null,null,null,null,"Evapotranspiration potential",null,null,null,"High"]
[null,null,"Jan","Feb","Mar","Apr","May","Jun","Jul","Aug","Sep","Oct","Nov","Dec",null,null,null,null,null,null,null,null,null,"Relative environmental sensitivity",null,null,null,"Moderate"]
[null,"Surplus Water",{"$f":"'Monthly Factors'!B21","v":0.28121118610350893},{"$f":"'Monthly Factors'!C21","v":0.28471061972718881},{"$f":"'Monthly Factors'!D21","v":0.1055893178084587},{"$f":"'Monthly Factors'!E21","v":-1.2670737757409583E-2},{"$f":"'Monthly Factors'!F21","v":-1.0294974427895285E-2},{"$f":"'Monthly Factors'!G21","v":-2.6925317734495361E-2},{"$f":"'Monthly Factors'!H21","v":-3.4844528832876351E-2},{"$f":"'Monthly Factors'!I21","v":-1.425457997708578E-2},{"$f":"'Monthly Factors'!J21","v":-6.3353688787047913E-3},{"$f":"'Monthly Factors'!K21","v":9.9861251950584262E-2},{"$f":"'Monthly Factors'!L21","v":0.16139352218500455},{"$f":"'Monthly Factors'!M21","v":0.17255960983372176}]
[null,"Leakance/\nLateral Ground Water",{"$f":"'Monthly Factors'!B44","v":8.1000000000000003E-2},{"$f":"'Monthly Factors'!C44","v":7.8E-2},{"$f":"'Monthly Factors'!D44","v":8.6999999999999994E-2},{"$f":"'Monthly Factors'!E44","v":8.5999999999999993E-2},{"$f":"'Monthly Factors'!F44","v":0.09},{"$f":"'Monthly Factors'!G44","v":8.5999999999999993E-2},{"$f":"'Monthly Factors'!H44","v":8.6999999999999994E-2},{"$f":"'Monthly Factors'!I44","v":8.5000000000000006E-2},{"$f":"'Monthly Factors'!J44","v":8.1000000000000003E-2},{"$f":"'Monthly Factors'!K44","v":8.2000000000000003E-2},{"$f":"'Monthly Factors'!L44","v":7.8E-2},{"$f":"'Monthly Factors'!M44","v":7.9000000000000001E-2},null,null,null,null,null,null,null,null,"Hydrogeology"]
[null,"Surface Water",{"$f":"'Monthly Factors'!B26","v":0.22068086457424585},{"$f":"'Monthly Factors'!C26","v":0.19373952223030552},{"$f":"'Monthly Factors'!D26","v":0.13994869625957773},{"$f":"'Monthly Factors'!E26","v":6.7665632372012466E-2},{"$f":"'Monthly Factors'!F26","v":2.399263439717373E-2},{"$f":"'Monthly Factors'!G26","v":9.7313744914725147E-3},{"$f":"'Monthly Factors'!H26","v":5.7792933459831003E-3},{"$f":"'Monthly Factors'!I26","v":1.8772385441074731E-3},{"$f":"'Monthly Factors'!J26","v":1.5783311410150771E-3},{"$f":"'Monthly Factors'!K26","v":1.4486378451963268E-2},{"$f":"'Monthly Factors'!L26","v":0.10238016286421177},{"$f":"'Monthly Factors'!M26","v":0.21813987132793164},null,null,null,null,null,null,null,null,null,"Groundwater occurrence (primary / secondary)",null,null,null,"Void infillings - bedrock fractures & faults, karst solution cavities"]
[null,"Water Usage",{"$f":"'Monthly Factors'!B31","v":0.06},{"$f":"'Monthly Factors'!C31","v":6.5000000000000002E-2},{"$f":"'Monthly Factors'!D31","v":7.4999999999999997E-2},{"$f":"'Monthly Factors'!E31","v":0.08},{"$f":"'Monthly Factors'!F31","v":0.09},{"$f":"'Monthly Factors'!G31","v":0.1},{"$f":"'Monthly Factors'!H31","v":0.11},{"$f":"'Monthly Factors'!I31","v":0.115},{"$f":"'Monthly Factors'!J31","v":0.1},{"$f":"'Monthly Factors'!K31","v":0.08},{"$f":"'Monthly Factors'!L31","v":7.0000000000000007E-2},{"$f":"'Monthly Factors'!M31","v":5.5E-2},null,null,null,null,null,null,null,null,null,"Primary porosity",null,null,null,"Low"]
[null,null,null,null,null,null,null,null,null,null,null,null,null,null,null,null,null,null,null,null,null,null,null,"Secondary porosity",null,null,null,"Moderate (probable good open void space due to brittle rock & local karst solution cavities; elevated along SJF and splays)"]
[null,null,null,null,null,null,null,null,null,null,null,null,null,null,null,null,null,null,null,null,null,null,null,"Confinement",null,null,null,"Unconfined to semiconfined - assume bedrock fractures / karst cavities generally daylight to surface.                                Morainal blanket areas locally semi-confined by duric till blankets;                                                                                                                         WP = 0 - 53.3 m, avg 2.1 m"]
[null,null,null,null,null,null,null,null,null,null,null,null,null,null,null,null,null,null,null,null,null,null,null,"Aquifer thickness",null,null,null,"Bedrock aquifer / assume < 150 m"]
[null,null,null,null,null,null,null,null,null,null,null,null,null,null,null,null,null,null,null,null,null,null,null,"Hydraulic anisotropy",null,null,null,"High"]
[null,"TABLE C-6",null,null,null,null,null,null,null,null,null,null,null,null,null,null,null,null,null,null,null,null,null,"Hydraulic gradient",null,null,null,"Moderate to high based on terrain"]
[null,"Groundwater Impacts: Aquifer #0202, North Shawnigan (Bedrock)",null,null,null,null,null,null,null,null,null,null,null,null,null,null,null,null,null,null,null,null,null,"Storage potential",null,null,null,"Low - moderate due to proximity / presence of large structures & brittle rocks"]
[null,null,null,null,null,null,null,null,null,null,null,null,null,null,null,null,null,null,null,null,null,null,null,"Yield potential",null,null,null,"Low - moderate;  WP = 0.02 - 5.68 L/s / average 0.19 L/s"]
[null,"Groundwater Flow","Direction of Flow","Source or Receptor of Water","Length (m)","Depth (m)","Area (m)","Hydraulic Conductivity (m/s) - K","Distance (m) - dL","Hydraulic Head (m) - dh",null,null,"GW Flow (m3/yr)",null,null,null,null,null,null,null,null,null,null,"Flow velocities",null,null,null,"Moderate to high"]
[null,null,null,null,null,null,null,null,null,"Year 1","Year 2","Year 3","Year 1","Year 2","Year 2",null,null,null,null,null,null,null,null,"Flow directions",null,null,null,"Radial, generally NW to Koksilah River or SE to Shawnigan Creek"]
[null,"QGW1","Out","N/A",{"$f":"1.2*357","v":428.4},200,{"$f":"E82*F82","v":85680},1.0000000000000001E-9,150,20,null,null,{"$f":"-(G82*H82*(J82/I82))*60*60*24*365","v":-360.26726400000001},null,null,null,null,null,null,null,null,null,null,"Static water levels",null,null,null,"WP = variable 0 - 81.7 m bgs / avg 8.4 m bgs"]
[null,"QGW2","Out","N/A",{"$f":"(2.7*357)/3","v":321.3},200,64260,1.0000000000000001E-5,150,20,null,null,-2702004.48,null,null,null,null,null,null,null,null,null,null,"Hydraulic connection with surface waters",null,null,null,"High - likely provides baseflow to Koksilah River mainstem & tributaries + Hartl Creek mainstem & tributaries"]
[null,"QGW3","Out","N/A",{"$f":"0.5*357","v":178.5},200,35700,9.9999999999999995E-7,140,20,null,null,-160833.60000000001,null,null,null,null,null,null,null,null,null,null,"Hydraulic connection to adjacent AQ"]
[null,"QGW4","Out","N/A",{"$f":"0.7*357","v":249.89999999999998},200,49979.999999999993,1.0000000000000001E-5,140,20,null,null,-2251670.4,null,null,null,null,null,null,null,null,null,null,null,"Over / Under",null,null,"NE part overlain by surficial AQ201"]
[null,"QGW5","N/A","N/A",{"$f":"1.7*357","v":606.9},200,121380,9.9999999999999995E-7,1,0,null,null,0,null,null,null,null,null,null,null,null,null,null,null,"Upgradient",null,null,"Upgradient contact with bedrock AQ 200 & undeveloped extension of AQ202"]
[null,"QGW6","Out","N/A",{"$f":"1.5*357","v":535.5},200,107100,9.9999999999999995E-7,205,60,null,null,-988538.22439024376,null,null,null,null,null,null,null,null,null,null,null,"Downgradient",null,null,"Downgradient contact with surficial AQ 199, surficial AQ 197, bedrock AQ 204, bedrock AQ207, bedrock AQ203, undeveloped extension to bedrock AQ 202"]
[null,"QGW7","Out","Koksilah River",{"$f":"0.5*357","v":178.5},40,7140,9.9999999999999995E-7,155,80,null,null,-116215.24645161291,null,null,null,null,null,null,null,null,null,null,"Vulnerability to surface contamination",null,null,null,"Moderate to high"]
[null,"QGW8","Out","Koksilah River",{"$f":"0.3*357","v":107.1},40,4284,1.0000000000000001E-5,145,80,null,null,-745380.54620689654,null,null,null,null,null,null,null,null,null,null,"Recharge"]
[null,"QGW9","Out","Koksilah River",{"$f":"0.4*357","v":142.80000000000001},40,5712,9.9999999999999995E-7,155,80,null,null,-92972.197161290314,null,null,null,null,null,null,null,null,null,null,null,"Vertical inflow",null,null,"Mainly precipitation, limited snowmelt / irrigation / sewerage.  Low from stream loss.                                                                              Low from from overlying surficial AQ201"]
[null,"QGW10","Out","Koksilah River",{"$f":"0.3*357","v":107.1},40,4284,1.0000000000000001E-5,145,80,null,null,-745380.54620689654,null,null,null,null,null,null,null,null,null,null,null,"Lateral inflow",null,null,"Low - moderate lateral inflow from upgradient bedrock sources / possible increased K along thrust faults"]
[null,"QGW11","Out","Koksilah River",{"$f":"1.5*357","v":535.5},40,21420,9.9999999999999995E-7,125,80,null,null,-432320.71679999999,null,null,null,null,null,null,null,null,null,null,null,"Temporal variability",null,null,"High, linked to precipitation trends"]
[null,"QGW12","In","Koksilah River",{"$f":"0.3*357","v":107.1},40,4284,1.0000000000000001E-5,"--","--","--","--",{"$f":"-'Bedrock 200'!M88","v":1028717.1918367348},null,null,null,null,null,null,null,null,null,null,null,"MBR",null,null,"High from internal (Cobble Hill) and upgradient (northwest) rocky hills "]
[null,"QGW13","Out","Koksilah River",{"$f":"1.5*357","v":535.5},40,21420,9.9999999999999995E-7,195,60,null,null,{"$f":"-(G94*H94*(J94/I94))*60*60*24*365","v":-207846.49846153843},null,null,null,null,null,null,null,null,null,null,"Discharge"]
[null,"QGW14","In","Koksilah River",{"$f":"0.4*357","v":142.80000000000001},40,5712,1.0000000000000001E-5,"--","--","--","--",{"$f":"-'Bedrock 200'!M90","v":1121953.8461538462},null,null,null,null,null,null,null,null,null,null,null,"Evapotranspiration potential",null,null,"High"]
[null,"QGW15","Out","Koksilah River",{"$f":"1.2*357","v":428.4},40,17136,9.9999999999999995E-7,320,80,null,null,{"$f":"-(G96*H96*(J96/I96))*60*60*24*365","v":-135100.22400000002},null,null,null,null,null,null,null,null,null,null,null,"Outflow to marine",null,null,"None"]
[null,"QGW16","In","Koksilah River",{"$f":"0.4*357","v":142.80000000000001},40,5712,1.0000000000000001E-5,"--","--","--","--",{"$f":"-'Bedrock 200'!M92","v":1545046.5103448278},null,null,null,null,null,null,null,null,null,null,null,"Outflow to surface waters",null,null,"High to Koksilah River along NW border & internally to Hartl Ck"]
[null,"QGW17","Out","Koksilah River",{"$f":"4.3*357","v":1535.1},40,61404,9.9999999999999995E-7,350,60,null,null,{"$f":"-(G98*H98*(J98/I98))*60*60*24*365","v":-331960.55040000001},null,null,null,null,null,null,null,null,null,null,null,"Outflow to other AQ",null,null,"High - possible MBR zone to downgradient aquifers"]
[null,"QGW18","Out","Koksilah River",{"$f":"0.5*357","v":178.5},40,7140,1.0000000000000001E-5,110,20,null,null,-409394.61818181822,null,null,null,null,null,null,null,null,null,null,null,"Temporal variability",null,null,"High"]
[null,"QGW19","Out","Koksilah River",{"$f":"3.5*357","v":1249.5},40,49980,9.9999999999999995E-7,200,80,null,null,-630467.71199999994]
[null,"QGW20","Out","Koksilah River",{"$f":"0.5*357","v":178.5},40,7140,1.0000000000000001E-5,735,40,null,null,-122539.88571428572,null,null,null,null,null,null,null,null,null,"Groundwater Development"]
[null,"QGW21","Out","Koksilah River",{"$f":"1*357","v":357},40,14280,9.9999999999999995E-7,250,80,null,null,-144106.9056,null,null,null,null,null,null,null,null,null,null,null,"Nearest BCMOE Observation Wells; distance; completion / relevance",null,null,"Well #320; 2.0 km ENE; completed in surficial AQ197; irrelevant"]
[null,"QGW22","Out","Koksilah River",{"$f":"0.6*357","v":214.2},40,8568,1.0000000000000001E-9,260,60,null,null,-62.353949538461549,null,null,null,null,null,null,null,null,null,null,null,"Total Annual Water Use (m3/yr) as reported by Hatfield (2015)",null,null,null,"  SUMS"]
[null,"QGW23","Out","AQ 199",{"$f":"0.3*357","v":107.1},200,21420,1E-8,510,60,null,null,-794.70719999999983,null,null,null,null,null,null,null,null,null,null,null,null,"Industrial",null,0,"Total Commercial and Industrial"]
[null,"QGW24","Out","AQ 199",{"$f":"0.6*357","v":214.2},200,42840,1.0000000000000001E-9,600,80,null,null,-180.13363200000001,null,null,null,null,null,null,null,null,null,null,null,null,"Commercial",null,7300,{"$f":"AB104+AB105","v":7300}]
[null,"QGW25","Out","AQ 199",{"$f":"0.4*357","v":142.80000000000001},200,28560.000000000004,1E-8,665,100,null,null,-1354.388210526316,null,null,null,null,null,null,null,null,null,null,null,null,"Domestic",null,110837,"Total Irrigation"]
[null,"QGW26","Out","AQ 199",{"$f":"5.1*357","v":1820.6999999999998},200,364139.99999999994,1.0000000000000001E-9,575,100,null,null,-1997.1337460869561,null,null,null,null,null,null,null,null,null,null,null,null,"Irrigation from groundwater (Ministry of AGRICULTURE)",null,6458,{"$f":"AB107","v":6458}]
[null,"QGW27","Out","AQ 197",{"$f":"0.4*357","v":142.80000000000001},200,28560.000000000004,9.9999999999999995E-8,235,20,null,null,-7665.2609361702116,null,null,null,null,null,null,null,null,null,null,null,null,"BCMOE Obs",null,0]
[null,"QGW28","Out","AQ 197",{"$f":"0.8*357","v":285.60000000000002},200,57120.000000000007,1.0000000000000001E-9,235,20,null,null,-153.30521872340427,null,null,null,null,null,null,null,null,null,null,null,null,"Other",null,10950,"Total Domestic + Water Systems + Other"]
[null,"QGW29","Out","AQ 197",{"$f":"3.3*357","v":1178.0999999999999},200,235619.99999999997,9.9999999999999995E-8,335,100,null,null,-221806.33791044771,null,null,null,null,null,null,null,null,null,null,null,null,"Water Supply Systems",null,56310,{"$f":"AB106+AB109+AB110","v":178097}]
[null,"QGW30","Out","AQ 204",{"$f":"3.6*357","v":1285.2},200,257040,9.9999999999999995E-7,525,140,null,null,-2161603.5840000003]
[null,"QGW31","Out","AQ 204",{"$f":"0.5*357","v":178.5},200,35700,1.0000000000000001E-5,150,20,null,null,-1501113.6]
[null,"QGW32","Out","AQ 204",{"$f":"2.3*357","v":821.09999999999991},200,164219.99999999997,9.9999999999999995E-7,555,80,"-","-",-746499.736216216]
[null,"QGW33","Out","AQ 204",{"$f":"0.4*357","v":142.80000000000001},200,28560.000000000004,1.0000000000000001E-5,100,20,"-","-",-1801336.3200000005]
[null,"QGW34","Out","AQ 204",{"$f":"0.5*357","v":178.5},20,3570,1.0000000000000001E-5,1900,40,"-","-",-23701.793684210523]
[null,"QGW35","Out","Shawnigan Creek",{"$f":"(1.1*357)/3","v":130.9},100,13090,1.0000000000000001E-5,315,20,"-","-",-262099.19999999998]
[null,"QGW36","Out","Shawnigan Creek",{"$f":"0.5*357","v":178.5},20,3570,1.0000000000000001E-9,65,10,"-","-",-17.320541538461541]
[null,"QGW37","Out","Shawnigan Creek",{"$f":"0.5*357","v":178.5},20,3570,1E-8,65,10,"-","-",-173.20541538461541]
[null,"QGW38","Out","Shawnigan Creek",{"$f":"3.5*357","v":1249.5},20,24990,1.0000000000000001E-9,65,10,"-","-",-121.24379076923078]
[null,"QGW39","N/A","AQ 203",{"$f":"7*357","v":2499},200,499800,1.0000000000000001E-9,1,0,"-","-",0]
[null,"QGW40","N/A","AQ 203",{"$f":"1.9*357","v":678.3},200,135660,1.0000000000000001E-5,1,0,"-","-",0]
[null,"QGW41","N/A","AQ 203",{"$f":"1.4*357","v":499.79999999999995},200,99959.999999999985,9.9999999999999995E-7,1,0,"-","-",0]
[null,"QGW42","N/A","AQ 203",{"$f":"0.8*357","v":285.60000000000002},200,57120.000000000007,1E-4,1,0,"-","-",0]
[null,"QGW43","N/A","AQ 203",{"$f":"0.8*357","v":285.60000000000002},200,57120.000000000007,9.9999999999999995E-7,1,0,"-","-",0]
[null,"QGW44","N/A","AQ 203",{"$f":"0.3*357","v":107.1},200,21420,1E-4,1,0,"-","-",0]
[null,"QGW45","N/A","AQ 203",{"$f":"0.6*357","v":214.2},200,42840,9.9999999999999995E-7,1,0,"-","-",0]
[null,"QGW46","N/A","AQ 203",{"$f":"1*357","v":357},200,71400,1.0000000000000001E-5,1,0,"-","-",0]
[null,"QGW47","N/A","AQ 203",{"$f":"0.3*357","v":107.1},200,21420,1.0000000000000001E-9,1,0,"-","-",0]
[null,"QGW48","In","Leakage from AQ 201","Leakance Factor (m/yr) = ",{"$f":"'Surficial AQ 201'!F83","v":0.3},{"$f":"'Surficial AQ 201'!G83","v":2112633},"--","--","--",null,null,{"$f":"F129*G129","v":633789.9}]
[null,"Total",null,null,null,null,null,null,null,null,null,null,{"$f":"SUM(M82:M129)","v":-12618264.794954782}]
[]
[null,"Surface Water Contributions","Cold Water Creek?","Observed Vertical Gradient","Percent Permeable","Length (m)","Width (m)","Flux (m/s)","SW Flow (m3/yr)",null,null,"Comment"]
[null,null,null,null,null,null,null,null,"Year 1","Year 2","Year 3"]
[null,"Haril Creek","Unknown","Downward",0.1,3800,2,3.0000000000000001E-5,{"$f":"(E134*F134*G134)*(H134*60*60*24*365)","v":719020.8}]
[null,"Timothy Brook","Unknown","Downward",0.1,1100,2,3.0000000000000001E-5,{"$f":"(E135*F135*G135)*(H135*60*60*24*365)","v":208137.60000000001}]
[null,"Heather Bank Brook","Unknown","Downward",0.1,1300,2,3.0000000000000001E-5,{"$f":"(E136*F136*G136)*(H136*60*60*24*365)","v":245980.80000000002}]
[null,"Total",null,null,null,null,null,null,{"$f":"SUM(I134:I136)","v":1173139.2},{"$f":"SUM(J134:J136)","v":0},{"$f":"SUM(K134:K136)","v":0}]
[]
[null,"Water Well Usage","Water Well Usage Volume (m3/yr)",null,null,null,null,null,null,null,null,"Comments"]
[null,null,"Year 1",null,null,"Year 2",null,null,"Year 3"]
[null,null,"Total Volume Removed","Adjustment Factor","Adjusted Volume Removed","Total Volume Removed","Adjustment Factor","Adjusted Volume Removed","Total Volume Removed","Adjustment Factor","Adjusted Volume Removed"]
[null,"Industrial",{"$f":"AB104","v":0},1,{"$f":"C142*D142","v":0},null,null,null,null,null,null,"Assuming 100% consumptive"]
[null,"Commercial",7300,1,7300,null,null,null,null,null,null,"Assuming 100% consumptive"]
[null,"Domestic",110837,1,110837,null,null,null,null,null,null,"Assuming 100% consumptive"]
[null,"Irrigation",6458,1,6458,null,null,null,null,null,null,"Assuming 100% consumptive"]
[null,"BCMOE Obs",0,1,0,null,null,null,null,null,null,"Assuming 100% consumptive"]
[null,"Other",10950,1,10950,null,null,null,null,null,null,"Assuming 100% consumptive"]
[null,"Water Supply Systems",56310,1,56310,null,null,null,null,null,null,"Assuming 100% consumptive"]
[null,"Total",null,null,{"$f":"-SUM(E142:E148)","v":-191855},null,null,{"$f":"-SUM(H142:H148)","v":0},null,null,{"$f":"-SUM(K142:K148)","v":0}]

{"sheet":"Bedrock 203","index":9,"n_rows":137,"n_cols":29,"rows_kept":137,"cut":false,"hidden":false,"merged":[[3,2,3,4],[2,2,2,4],[1,2,1,4],[51,17,51,19],[6,16,6,20],[21,16,21,20],[36,16,36,20],[4,2,4,4]]}
[null,"CHM Aquifer Criteria: Aquifer #0203, Shawnigan Lake (Bedrock)",null,null,null,null,null,null,null,null,null,null,null,null,null,null,null,null,null,null,null,null,"TABLE D-1"]
[null,"AQ tag","203 Shawnigan Lake",null,null,null,null,null,null,null,null,null,null,null,null,null,null,null,null,null,null,null,"CHM Aquifer Criteria: Aquifer #0203, Shawnigan Lake (Bedrock)"]
[null,"Perimeter (km)",54]
[null,"Area (km2)",31,null,null,null,null,null,null,null,null,null,null,null,null,null,null,null,null,null,null,null,"BCMOE Criteria"]
[null,"Aquifer materials","Bedrock ",null,null,null,null,null,null,null,null,null,null,null,null,null,null,null,null,null,null,null,null,"AQ tag",null,null,null,"203 Shawnigan Lake"]
[null,"Table D-4 Monthly  Summary of AQ203 Water Budgets",null,null,null,null,null,null,null,null,null,null,null,null,null,null,"Table D-3 Annual Summary of AQ203 Water Budgets",null,null,null,null,null,null,"AQ classification",null,null,null,"IIA(12)"]
[null,"Monthly Gains and Loses (m3)","Average Year",null,null,null,null,null,null,null,null,null,null,null,null,null,"Summary - 30 Year Average",null,null,null,null,null,null,"AQ type",null,null,null,"BCMOE Classification = 6b (SLR Classification = 6b / 6a / 5b)"]
[null,"Source","Jan","Feb","Mar","Apr","May","Jun","Jul","Aug","Sep","Oct","Nov","Dec","Total",null,"Gains and Losses","Source","Area (m2)","Infiltration Rate","Q (m3/yr)",null,null,"Location",null,null,null,"Shawnigan Lake / Cobble Hill; Shawnigan Lake watershed basin"]
[{"$f":"$C$7&B9","v":"Average YearDirect Recharge to 203"},"Direct Recharge to 203",{"$f":"C55*$U$9","v":3906751.7537242337},2544707.6527291317,1836441.8994454981,441023.41511902027,-530854.8266083186,-837117.22657465632,-816699.73324356717,-367514.87995960517,-122504.95998653505,1343125.8417379814,4121014.5287829516,4017388.5713142231,{"$f":"SUM(C9:N9)","v":15535762.036480356},null,"Gain","Direct Recharge to 203",{"$f":"10000*3101.68230523","v":31016823.052300002},{"$f":"U9/S9","v":0.50088179599452332},{"$f":"S58","v":15535762.036480358},null,null,"Perimeter (km)",null,null,null,54]
[{"$f":"$C$7&B10","v":"Average YearLateral Ground Water"},"Lateral Ground Water",{"$f":"C56*$U$10","v":-473.98071314618181},-456.42587191854545,-509.09039560145447,-503.23878185890902,-526.64523682909089,-503.23878185890902,-509.09039560145447,-497.38716811636368,-473.98071314618181,-479.83232688872727,-456.42587191854545,-462.27748566109091,{"$f":"SUM(C10:N10)","v":-5851.6137425454544},null,"Loss","Lateral Ground Water","--","--",{"$f":"SUMIF(M82:M117, \"<0\")","v":-5851.6137425454544},null,null,"Area (km2)",null,null,null,31]
["Average YearLateral Ground Water","Lateral Ground Water",{"$f":"C56*$U$11","v":3074.3195006162096},2960.4558154082019,3302.0468710322248,3264.0923092962221,3415.9105562402328,3264.0923092962221,3302.0468710322248,3226.1377475602199,3074.3195006162096,3112.2740623522122,2960.4558154082019,2998.4103771442042,37954.561736002586,null,"Gain","Lateral Ground Water","--","--",{"$f":"SUMIF(M82:M117, \">0\")","v":37954.561736002586},null,null,"Aquifer materials",null,null,null,"Bedrock "]
["Average YearSurface Water","Surface Water",{"$f":"C57*$U$12","v":-3605731.64538188},-3165533.7566975639,-2286638.8701469069,-1105597.0458483314,-392018.58878372016,-159002.11839689978,-94428.581045119412,-30672.430242095699,-25788.545613274327,-236694.70985622556,-1672802.0066943346,-3564214.0458536511,-16339122.344560005,null,"Loss","Surface Water","--","--",{"$f":"SUMIF(I122:I124, \"<0\")","v":-16339122.344560001},null,null,"Lithostratigraphic unit",null,null,null,"Wark-Colquitz Gneiss & Bonanza Group"]
["Average YearSurface Water","Surface Water",{"$f":"C57*$U$13","v":0},0,0,0,0,0,0,0,0,0,0,0,0,null,"Gain","Surface Water","--","--",{"$f":"SUMIF(I122:I124, \">0\")","v":0},null,null,"Productivity",null,null,null,"Low"]
["Average YearWell Water Usage","Well Water Usage",{"$f":"C58*$U$14","v":-29574.36},-32038.89,-36967.949999999997,-39432.480000000003,-44361.54,-49290.600000000006,-54219.66,-56684.19,-49290.600000000006,-39432.480000000003,-34503.420000000006,-27109.83,-492906,null,"Loss","Well Water Usage","--","--",{"$f":"E137","v":-492906},null,null,"Vulnerability",null,null,null,"High"]
["Average YearNet Gain","Net Gain",{"$f":"SUMIF(C9:C14, \">0\")","v":3909826.07322485},{"$f":"SUMIF(D9:D14, \">0\")","v":2547668.1085445401},1839743.9463165305,444287.50742831652,3415.9105562402328,3264.0923092962221,3302.0468710322248,3226.1377475602199,3074.3195006162096,1346238.1158003337,4123974.98459836,4020386.9816913675,18248408.224589042,null,"Net Gain",null,null,null,{"$f":"SUMIF(U8:U14, \">0\")","v":15573716.59821636},null,null,"Demand",null,null,null,"Moderate"]
["Average YearNet Loss","Net Loss",{"$f":"SUMIF(C9:C14, \"<0\")","v":-3635779.9860950261},{"$f":"SUMIF(D9:D14, \"<0\")","v":-3198029.0725694825},-2324115.9105425086,-1145532.7646301903,-967761.60062886786,-1045913.183753415,-965857.06468428811,-455368.88736981724,-198058.08631295557,-276607.02218311426,-1707761.8525662529,-3591786.1533393124,-19512571.58467523,null,"Net Loss",null,null,null,{"$f":"SUMIF(U8:U14, \"<0\")","v":-16837879.958302546},null,null,"Use",null,null,null,"Multiple"]
["Average YearNet Total (Gain - Loss)","Net Total (Gain - Loss)",{"$f":"SUM(C15:C16)","v":274046.08712982386},{"$f":"SUM(D15:D16)","v":-650360.96402494237},-484371.96422597812,-701245.25720187381,-964345.69007262762,-1042649.0914441188,-962555.01781325589,-452142.74962225702,-194983.76681233937,1069631.0936172195,2416213.1320321071,428600.82835205505,-1264163.3600861877,null,"Net Total (Gain - Loss)",null,null,null,{"$f":"SUM(U15:U16)","v":-1264163.3600861859}]
[null,null,null,null,null,null,null,null,null,null,null,null,null,null,null,null,null,null,null,null,null,null,"Location"]
[null,null,null,null,null,null,null,null,null,null,null,null,null,null,null,null,null,null,null,null,null,null,null,"NTS 50000",null,null,null,"092B/12"]
[null,null,null,null,null,null,null,null,null,null,null,null,null,null,null,null,null,null,null,null,null,null,null,"TRIM 20000",null,null,null,"Straddles 092B.062 & 092B.052"]
[null,null,null,null,null,null,null,null,null,null,null,null,null,null,null,null,null,null,null,null,null,null,null,"Lat / Long (Centre)",null,null,null,"48o37'12\" / 123o38'18\""]
[null,"Monthly Gains and Loses (m3)","Hot/Dry (1989)",null,null,null,null,null,null,null,null,null,null,null,null,null,"Summary - Hot/Dry (1989)",null,null,null,null,null,null,"UTM Zone 10 (Centre)",null,null,null,"452960E / 5385390N"]
[null,"Source","Jan","Feb","Mar","Apr","May","Jun","Jul","Aug","Sep","Oct","Nov","Dec","Total",null,"Gains and Losses","Source","Area (m2)","Infiltration Rate","Q (m3/yr)"]
[{"$f":"$C$22&B24","v":"Hot/Dry (1989)Direct Recharge to 203"},"Direct Recharge to 203",{"$f":"$U$24*C62","v":3204503.2463532924},{"$f":"$U$24*D62","v":1837574.3997980256},2857253.4115651101,171506.94398114909,-673777.27992594277,-857534.71990574524,-735029.75991921034,-306262.3999663376,-204174.93331089173,520646.07994277391,2043791.0824420261,2593021.6530483249,{"$f":"SUM(C24:N24)","v":10451517.724102575},null,"Gain","Direct Recharge to 203",{"$f":"10000*3101.68230523","v":31016823.052300002},{"$f":"U24/S24","v":0.33696287032619088},{"$f":"R58","v":10451517.724102573},null,"Climate"]
[{"$f":"$C$22&B25","v":"Hot/Dry (1989)Lateral Ground Water"},"Lateral Ground Water",{"$f":"$U$25*C63","v":-479.83232688872727},{"$f":"$U$25*D63","v":-444.72264443345455},-491.53555437381823,-485.68394063127272,-509.09039560145447,-491.53555437381823,-509.09039560145447,-503.23878185890902,-479.83232688872727,-497.38716811636368,-473.98071314618181,-485.68394063127272,{"$f":"SUM(C25:N25)","v":-5851.6137425454544},null,"Loss","Lateral Ground Water","--","--",{"$f":"SUMIF(M97:M132, \"<0\")","v":-5851.6137425454544},null,null,"Nearest active EC weather station / distance / elevation",null,null,null,"EC1017230 Shawnigan Lake / NE corner of AQ ;                                                                                                                                                               EC1017563 Sooke Lake North / 1.9 km to southwest"]
["Hot/Dry (1989)Lateral Ground Water","Lateral Ground Water",{"$f":"$U$26*C63","v":4773.2864396119066},{"$f":"$U$26*D63","v":4424.0215781768893},4889.7080600902464,4831.497249851077,5064.3404908077546,4889.7080600902464,5064.3404908077546,5006.1296805685843,4773.2864396119066,4947.9188703294158,4715.0756293727372,4831.497249851077,58210.810239169594,null,"Gain","Lateral Ground Water","--","--",{"$f":"SUMIF(M97:M132, \">0\")","v":58210.810239169594},null,null,"IDF Curve",null,null,null,"Unknown"]
["Hot/Dry (1989)Surface Water","Surface Water",{"$f":"$U$27*C64","v":-3605731.64538188},{"$f":"$U$27*D64","v":-3165533.7566975639},-2286638.8701469069,-1105597.0458483314,-392018.58878372016,-159002.11839689978,-94428.581045119412,-30672.430242095699,-25788.545613274327,-236694.70985622556,-1672802.0066943346,-3564214.0458536511,-16339122.344560005,null,"Loss","Surface Water","--","--",{"$f":"SUMIF(I122:I124, \"<0\")","v":-16339122.344560001}]
["Hot/Dry (1989)Surface Water","Surface Water",{"$f":"$U$28*C64","v":0},{"$f":"$U$28*D64","v":0},0,0,0,0,0,0,0,0,0,0,0,null,"Gain","Surface Water","--","--",{"$f":"SUMIF(I122:I124, \">0\")","v":0},null,"Physiography"]
["Hot/Dry (1989)Well Water Usage","Well Water Usage",{"$f":"$U$29*C65","v":-29574.36},{"$f":"$U$29*D65","v":-32038.89},-36967.949999999997,-39432.480000000003,-44361.54,-49290.600000000006,-54219.66,-56684.19,-49290.600000000006,-39432.480000000003,-34503.420000000006,-27109.83,-492906,null,"Loss","Well Water Usage","--","--",{"$f":"E137","v":-492906},null,null,"Physiographic zone",null,null,null,"Canadian Cordillera / Western System / Outer Mountain Area / Insular Mountains / Vancouver Island Ranges"]
["Hot/Dry (1989)Net Gain","Net Gain",{"$f":"SUMIF(C24:C29, \">0\")","v":3209276.5327929044},{"$f":"SUMIF(D24:D29, \">0\")","v":1841998.4213762025},2862143.1196252005,176338.44123100018,5064.3404908077546,4889.7080600902464,5064.3404908077546,5006.1296805685843,4773.2864396119066,525593.9988131033,2048506.158071399,2597853.1502981759,13286507.627369871,null,"Net Gain",null,null,null,{"$f":"SUMIF(U23:U29, \">0\")","v":10509728.534341743},null,null,"Elevation range (m amsl)",null,null,null,"120 - 580 m amsl"]
["Hot/Dry (1989)Net Loss","Net Loss",{"$f":"SUMIF(C24:C29, \"<0\")","v":-3635785.8377087684},{"$f":"SUMIF(D24:D29, \"<0\")","v":-3198017.3693419974},-2324098.3557012808,-1145515.2097889627,-1110666.4991052644,-1066318.9738570189,-884187.09135993128,-394122.25899029226,-279733.91125105479,-276624.57702434191,-1707779.4074074808,-3591809.5597942825,-19614659.051330678,null,"Net Loss",null,null,null,{"$f":"SUMIF(U23:U29, \"<0\")","v":-16837879.958302546},null,null,"Distance to marine",null,null,null,"4.4 km southeast to Findlayson Arm"]
["Hot/Dry (1989)Net Total (Gain - Loss)","Net Total (Gain - Loss)",{"$f":"SUM(C30:C31)","v":-426509.30491586402},{"$f":"SUM(D30:D31)","v":-1356018.9479657949},538044.76392391976,-969176.7685579625,-1105602.1586144567,-1061429.2657969287,-879122.7508691235,-389116.12930972368,-274960.62481144286,248969.42178876139,340726.75066391821,-993956.40949610667,-6328151.4239608031,null,"Net Total (Gain - Loss)",null,null,null,{"$f":"SUM(U30:U31)","v":-6328151.4239608031},null,null,"Geomorphological setting",null,null,null,"Shawnigan Lake basin: linear, U-shaped valley, basal morainal blankets & veneers,                                                                    lateral glaciofluvial terraces & kames, exposed higher areas"]
[null,null,null,null,null,null,null,null,null,null,null,null,null,null,null,null,null,null,null,null,null,null,null,"Topography",null,null,null,"U-shaped basin, overall drainage towards north-northwest"]
[null,null,null,null,null,null,null,null,null,null,null,null,null,null,null,null,null,null,null,null,null,null,null,"Terrain",null,null,null,"Undulating to hummocky & rugged at higher elevations; undulating to planar at lower elevations"]
[null,null,null,null,null,null,null,null,null,null,null,null,null,null,null,null,null,null,null,null,null,null,null,"Aspect",null,null,null,"Basinal centred on Shawnigan Lake: ENE and WSW at valley head and flanks, N to NE at north outflow"]
[null,null,null,null,null,null,null,null,null,null,null,null,null,null,null,null,null,null,null,null,null,null,null,"Slope",null,null,null,"Variable, planar-convex-concave depending on centripetal stream locations & subcatchment morphologies"]
[null,"Monthly Gains and Loses (m3)","Cold/Wet (1999)",null,null,null,null,null,null,null,null,null,null,null,null,null,"Summary - Wet/Cold (1999)",null,null,null,null,null,null,"XS max grade (m/m)",null,null,null,"0.001 to N-S; max gradient = 0.14 west side, E-W "]
[null,"Source","Jan","Feb","Mar","Apr","May","Jun","Jul","Aug","Sep","Oct","Nov","Dec","Total",null,"Gains and Losses","Source","Area (m2)","Infiltration Rate","Q (m3/yr)",null,null,"Roughness coefficient",null,null,null,"0.65 (partly cleared /  coniferous cover)"]
[{"$f":"$C$37&B39","v":"Cold/Wet (1999)Direct Recharge to 203"},"Direct Recharge to 203",{"$f":"$U$39*C55","v":6483414.0502453176},{"$f":"$U$39*D55","v":4223046.2515933411},3047650.3151176628,731896.36463183933,-880975.25986696163,-1389230.2174825165,-1355346.5536414795,-609905.9491386658,-203301.9830462219,2228972.1749712876,6838991.8739286354,6667020.3664013352,{"$f":"SUM(C39:N39)","v":25782231.43371357},null,"Gain","Direct Recharge to 203",{"$f":"10000*3101.68230523","v":31016823.052300002},{"$f":"U39/S39","v":0.83123379174714462},{"$f":"T58","v":25782231.433713574}]
[{"$f":"$C$37&B40","v":"Cold/Wet (1999)Lateral Ground Water"},"Lateral Ground Water",{"$f":"$U$40*C70","v":-442.14618763636366},{"$f":"$U$40*D70","v":-425.77040290909088},-474.89775709090907,-469.43916218181812,-491.2735418181818,-469.43916218181812,-474.89775709090907,-463.98056727272728,-442.14618763636366,-447.60478254545455,-425.77040290909088,-431.22899781818182,{"$f":"SUM(C40:N40)","v":-5458.5949090909089},null,"Loss","Lateral Ground Water","--","--",{"$f":"SUMIF(M112:M156, \"<0\")","v":-5458.5949090909089},null,"Geology"]
["Cold/Wet (1999)Lateral Ground Water","Lateral Ground Water",{"$f":"$U$41*C70","v":2600.3387874700284},{"$f":"$U$41*D70","v":2504.0299434896569},2792.9564754307708,2760.8535274373139,2889.2653194111426,2760.8535274373139,2792.9564754307708,2728.7505794438571,2600.3387874700284,2632.4417354634857,2504.0299434896569,2536.1328914831142,32102.947993457139,null,"Gain","Lateral Ground Water","--","--",{"$f":"SUMIF(M112:M156, \">0\")","v":32102.947993457139},null,null,"Terrane",null,null,null,"Wrangellia"]
["Cold/Wet (1999)Surface Water","Surface Water",{"$f":"$U$42*C71","v":-3605731.64538188},{"$f":"$U$42*D71","v":-3165533.7566975639},-2286638.8701469069,-1105597.0458483314,-392018.58878372016,-159002.11839689978,-94428.581045119412,-30672.430242095699,-25788.545613274327,-236694.70985622556,-1672802.0066943346,-3564214.0458536511,-16339122.344560005,null,"Loss","Surface Water","--","--",{"$f":"SUMIF(I122:I124, \"<0\")","v":-16339122.344560001},null,null,"Bedrock (type ; age ; formation ; lithology)"]
["Cold/Wet (1999)Surface Water","Surface Water",{"$f":"$U$43*C71","v":0},{"$f":"$U$43*D71","v":0},0,0,0,0,0,0,0,0,0,0,0,null,"Gain","Surface Water","--","--",{"$f":"SUMIF(I122:I124, \">0\")","v":0},null,null,null,"Primary",null,null,"South 2/3 = Palaeozoic to Jurasssic Westcoast Crystalline Complex  (Wark / Colquitz Gneiss) (PzJWg); variably gabbroic to granodioritic (65%) "]
["Cold/Wet (1999)Well Water Usage","Well Water Usage",{"$f":"$U$44*C72","v":-29574.36},{"$f":"$U$44*D72","v":-32038.89},-36967.949999999997,-39432.480000000003,-44361.54,-49290.600000000006,-54219.66,-56684.19,-49290.600000000006,-39432.480000000003,-34503.420000000006,-27109.83,-492906,null,"Loss","Well Water Usage","--","--",{"$f":"E137","v":-492906},null,null,null,"Secondary",null,null," North 1/3 = Jurassic Bonanza Group Volcanics (IJBca); basaltic-andesitic (30%);"]
["Cold/Wet (1999)Net Gain","Net Gain",{"$f":"SUMIF(C39:C44, \">0\")","v":6486014.3890327876},{"$f":"SUMIF(D39:D44, \">0\")","v":4225550.2815368306},3050443.2715930934,734657.21815927664,2889.2653194111426,2760.8535274373139,2792.9564754307708,2728.7505794438571,2600.3387874700284,2231604.6167067513,6841495.9038721249,6669556.4992928179,30253094.344882876,null,"Net Gain",null,null,null,{"$f":"SUMIF(U38:U44, \">0\")","v":25814334.381707031},null,null,null,"Tertiary",null,null,"Small Middle-Upper Triasssic Quatsino Formation (uTrVQ) limestone wedge at contact on east side of Lake (5%)"]
["Cold/Wet (1999)Net Loss","Net Loss",{"$f":"SUMIF(C39:C44, \"<0\")","v":-3635748.1515695164},{"$f":"SUMIF(D39:D44, \"<0\")","v":-3197998.4171004733},-2324081.7179039982,-1145498.9650105133,-1317846.6621925,-1597992.3750415985,-1504469.6924436896,-697726.54994803434,-278823.27484713262,-276574.79463877098,-1707731.1970972435,-3591755.1048514694,-21276246.90264494,null,"Net Loss",null,null,null,{"$f":"SUMIF(U38:U44, \"<0\")","v":-16837486.939469092},null,null,"Structure",null,null,null,"Several major, high-angle faults: (1) NE-trending Shawnigan Fault; follows Sooke Lk -> Lubbe Lake -> S Baldy Mountain Pass -> Mill Bay lineament; crosses AQ at southern third; BCGS = offsets PzJWg:IJBca contact; (2) NW-trending Spectacle Lake & Oliphant Faults; follow Spectacle Creek and Bamberton / Oliphant Lake lineaments; intersects AQ on SE side, does not appear to cross Shawnigan Fault; not mapped by BCGS; (3) N-trending Devereaux/Stebbings Fault swarm; follows south end of Shawnigan Creek lineament; intersects south end of AQ, does not seem to cross Shawnigan Fault; not mapped by BCGS; (4) Numerous other high-angle & low angle minor structures known at south end of AQ basin, variable strikes & dips, not mapped by BCGS"]
["Cold/Wet (1999)Net Total (Gain - Loss)","Net Total (Gain - Loss)",{"$f":"SUM(C45:C46)","v":2850266.2374632712},{"$f":"SUM(D45:D46)","v":1027551.8644363573},726361.55368909519,-410841.74685123668,-1314957.3968730888,-1595231.521514161,-1501676.7359682587,-694997.79936859047,-276222.93605966261,1955029.8220679802,5133764.7067748811,3077801.3944413485,8976847.442237936,null,"Net Total (Gain - Loss)",null,null,null,{"$f":"SUM(U45:U46)","v":8976847.4422379397},null,null,"Surficial (formation; lithology; thickness)",null,null,null,"Capilano Formation glaciofluvial / Vashon Drift morainal; silt-sand-gravel; generally moderately shallow blankets (< 10 m); higher areas - mainly colluvial veneers;  mid-elevations = morainal-glaciofluvial materials; basal areas = glaciofluvial & glaciolacustrine materials"]
[null,null,null,null,null,null,null,null,null,null,null,null,null,null,null,null,null,null,null,null,null,null,null,"Surficial designation (1993)",null,null,null,"Higher elevations = CbCv/R                                                                                                                                                                                                                            Mid-elevations =dMbvCbv/R & $dMbh/$oP/SGfg                                                                                                                                                                                                                                                                                                                                                                                                                                        Lower elevations = $oP & $LGp "]
[null,null,null,null,null,null,null,null,null,null,null,null,null,null,null,null,null,null,null,null,null,null,null,"Soils (association; parent; texture; drainage; type; comments)",null,null,null,"Higher elevations = SL1S3/ef (Squally/Shawnigan), colluvial-moraine veneers, rapid, O.DYB-shli & DU.DYB;                                                Mid-elevations = S3S1/e & D2S3RL5/Fe (Shawnigan / Dashwood/Rosewall), morainal & glaciofluvial blankets & veneers, moderate to good, DU-DYB;                                                                                                                                                                                                                                                                Low ares = Q/CH4 (Qualicum/Chemainus), marine/fluvialblankets, imperfect to poor, D.DYB & O.DYB "]
[null,null,null,null,null,null,null,null,null,null,null,null,null,null,null,null,null,null,null,null,null,null,null,"Restrictive layers",null,null,null,"Yes - surface duric layer in morainal areas"]
[null,null,null,null,null,null,null,null,null,null,null,null,null,null,null,null,"Table D-2.  Direct Recharge Calculation for AQ203",null,null,null,null,null,null,"Estimated permeability",null,null,null,"Low-moderate @ surface in duric morainal areas / high in colluvial & bedrock areas"]
[null,"Table D-5  Monthly  Coefficients used in Calculations for AQ203",null,null,null,null,null,null,null,null,null,null,null,null,null,null,null,"Direct Recharge Calculation"]
[null,"Monthly Factors","30 Year Average",null,null,null,null,null,null,null,null,null,null,null,null,null,null,"Hot/Dry","Average","Cold/Wet",null,null,"Hydrology"]
[null,null,"Jan","Feb","Mar","Apr","May","Jun","Jul","Aug","Sep","Oct","Nov","Dec",null,null,"Surplus (mm)",{"$f":"SUM('Climate Dashboard'!AA42:AL42)","v":511.89034592156941},{"$f":"SUM('Climate Dashboard'!C48:AL48)/3","v":760.90447463619182},{"$f":"SUM('Climate Dashboard'!AA54:AL54)","v":1262.7520438297711},null,null,null,"GW / SW basin coincidence",null,null,null,"Yes - Occupies  lake area and headwaters of Shawnigan watershed"]
[null,"Surplus Water",{"$f":"'Monthly Factors'!B16","v":0.25146830548450599},{"$f":"'Monthly Factors'!C16","v":0.16379677075085},{"$f":"'Monthly Factors'!D16","v":0.1182073911233482},{"$f":"'Monthly Factors'!E16","v":2.8387626824061124E-2},{"$f":"'Monthly Factors'!F16","v":-3.4169860825738051E-2},{"$f":"'Monthly Factors'!G16","v":-5.3883242071356162E-2},{"$f":"'Monthly Factors'!H16","v":-5.2569016654981621E-2},{"$f":"'Monthly Factors'!I16","v":-2.3656057494741728E-2},{"$f":"'Monthly Factors'!J16","v":-7.8853524982472421E-3},{"$f":"'Monthly Factors'!K16","v":8.6453811443823317E-2},{"$f":"'Monthly Factors'!L16","v":0.26525988999485034},{"$f":"'Monthly Factors'!M16","v":0.25858973392362583},null,null,"Station Coeffiecient Factor",1.1299999999999999,1.1299999999999999,1.1299999999999999,null,null,null,"Catchments",null,null,null,"Shawnigan & lower McGee"]
[null,"Leakance/\nLateral Ground Water",{"$f":"'Monthly Factors'!B42","v":8.1000000000000003E-2},{"$f":"'Monthly Factors'!C42","v":7.8E-2},{"$f":"'Monthly Factors'!D42","v":8.6999999999999994E-2},{"$f":"'Monthly Factors'!E42","v":8.5999999999999993E-2},{"$f":"'Monthly Factors'!F42","v":0.09},{"$f":"'Monthly Factors'!G42","v":8.5999999999999993E-2},{"$f":"'Monthly Factors'!H42","v":8.6999999999999994E-2},{"$f":"'Monthly Factors'!I42","v":8.5000000000000006E-2},{"$f":"'Monthly Factors'!J42","v":8.1000000000000003E-2},{"$f":"'Monthly Factors'!K42","v":8.2000000000000003E-2},{"$f":"'Monthly Factors'!L42","v":7.8E-2},{"$f":"'Monthly Factors'!M42","v":7.9000000000000001E-2},null,null,"Infiltration Coefficient",0.582541227341,0.582541227341,0.582541227341,null,null,null,"Drainage regime",null,null,null,"Centripetal, overall flow to north"]
[null,"Surface Water",{"$f":"'Monthly Factors'!B26","v":0.22068086457424585},{"$f":"'Monthly Factors'!C26","v":0.19373952223030552},{"$f":"'Monthly Factors'!D26","v":0.13994869625957773},{"$f":"'Monthly Factors'!E26","v":6.7665632372012466E-2},{"$f":"'Monthly Factors'!F26","v":2.399263439717373E-2},{"$f":"'Monthly Factors'!G26","v":9.7313744914725147E-3},{"$f":"'Monthly Factors'!H26","v":5.7792933459831003E-3},{"$f":"'Monthly Factors'!I26","v":1.8772385441074731E-3},{"$f":"'Monthly Factors'!J26","v":1.5783311410150771E-3},{"$f":"'Monthly Factors'!K26","v":1.4486378451963268E-2},{"$f":"'Monthly Factors'!L26","v":0.10238016286421177},{"$f":"'Monthly Factors'!M26","v":0.21813987132793164},null,null,"Area (m2)",{"$f":"S9","v":31016823.052300002},{"$f":"S9","v":31016823.052300002},{"$f":"S9","v":31016823.052300002},null,null,null,"Surface waters",null,null,null,"Shawnigan Lake; Shawnigan / McGee Creeks; numerous small streams centred on Shawnigan Lake"]
[null,"Water Usage",{"$f":"'Monthly Factors'!B31","v":0.06},{"$f":"'Monthly Factors'!C31","v":6.5000000000000002E-2},{"$f":"'Monthly Factors'!D31","v":7.4999999999999997E-2},{"$f":"'Monthly Factors'!E31","v":0.08},{"$f":"'Monthly Factors'!F31","v":0.09},{"$f":"'Monthly Factors'!G31","v":0.1},{"$f":"'Monthly Factors'!H31","v":0.11},{"$f":"'Monthly Factors'!I31","v":0.115},{"$f":"'Monthly Factors'!J31","v":0.1},{"$f":"'Monthly Factors'!K31","v":0.08},{"$f":"'Monthly Factors'!L31","v":7.0000000000000007E-2},{"$f":"'Monthly Factors'!M31","v":5.5E-2},null,null,"Q (m3/yr)",{"$f":"(R54/1000)*R55*R56*R57","v":10451517.724102573},{"$f":"(S54/1000)*S55*S56*S57","v":15535762.036480358},{"$f":"(T54/1000)*T55*T56*T57","v":25782231.433713574},null,null,null,"Runoff coefficient",null,null,null,"~60% cleared-forestry / ~30% forested / 10% rural residential / moderate slope =   0.60"]
[null,null,null,null,null,null,null,null,null,null,null,null,null,null,null,null,"Average Infiltration Rate",{"$f":"R58/R57","v":0.33696287032619088},{"$f":"S58/S57","v":0.50088179599452332},{"$f":"T58/T57","v":0.83123379174714462},null,null,null,"Nearest Active EC hydrometric station; distance; type",null,null,null,"Shawnigan Creek @ Mill Bay; 4.1 km E (inactive);                                                                                                                                                                  EC 08HA003 Koksilah River  @ Cowichan Station; 9.0 km NNW; active realtime;                                                                                                      "]
[null,"Monthly Factors","Hot/Dry (1989)",null,null,null,null,null,null,null,null,null,null,null,null,null,null,null,null,null,null,null,null,"Surface water diversions ; relevance",null,null,null,"6 within south end of AQ area, numerous diversion licences on Shawnigan Lake;  somewhat relevant"]
[null,null,"Jan","Feb","Mar","Apr","May","Jun","Jul","Aug","Sep","Oct","Nov","Dec"]
[null,"Surplus Water",{"$f":"'Monthly Factors'!B11","v":0.30660649782598431},{"$f":"'Monthly Factors'!C11","v":0.17581890480464263},{"$f":"'Monthly Factors'!D11","v":0.27338167402959174},{"$f":"'Monthly Factors'!E11","v":1.6409764448433315E-2},{"$f":"'Monthly Factors'!F11","v":-6.4466931761702304E-2},{"$f":"'Monthly Factors'!G11","v":-8.2048822242166558E-2},{"$f":"'Monthly Factors'!H11","v":-7.032756192185706E-2},{"$f":"'Monthly Factors'!I11","v":-2.9303150800773774E-2},{"$f":"'Monthly Factors'!J11","v":-1.9535433867182515E-2},{"$f":"'Monthly Factors'!K11","v":4.9815356361315413E-2},{"$f":"'Monthly Factors'!L11","v":0.19554969301049696},{"$f":"'Monthly Factors'!M11","v":0.24810001011321794},null,null,null,null,null,null,null,null,"Land Cover"]
[null,"Leakance/\nLateral Ground Water",{"$f":"'Monthly Factors'!B43","v":8.2000000000000003E-2},{"$f":"'Monthly Factors'!C43","v":7.5999999999999998E-2},{"$f":"'Monthly Factors'!D43","v":8.4000000000000005E-2},{"$f":"'Monthly Factors'!E43","v":8.3000000000000004E-2},{"$f":"'Monthly Factors'!F43","v":8.6999999999999994E-2},{"$f":"'Monthly Factors'!G43","v":8.4000000000000005E-2},{"$f":"'Monthly Factors'!H43","v":8.6999999999999994E-2},{"$f":"'Monthly Factors'!I43","v":8.5999999999999993E-2},{"$f":"'Monthly Factors'!J43","v":8.2000000000000003E-2},{"$f":"'Monthly Factors'!K43","v":8.5000000000000006E-2},{"$f":"'Monthly Factors'!L43","v":8.1000000000000003E-2},{"$f":"'Monthly Factors'!M43","v":8.3000000000000004E-2},null,null,null,null,null,null,null,null,null,"Vegetation zone",null,null,null,"CwH:a"]
[null,"Surface Water",{"$f":"'Monthly Factors'!B26","v":0.22068086457424585},{"$f":"'Monthly Factors'!C26","v":0.19373952223030552},{"$f":"'Monthly Factors'!D26","v":0.13994869625957773},{"$f":"'Monthly Factors'!E26","v":6.7665632372012466E-2},{"$f":"'Monthly Factors'!F26","v":2.399263439717373E-2},{"$f":"'Monthly Factors'!G26","v":9.7313744914725147E-3},{"$f":"'Monthly Factors'!H26","v":5.7792933459831003E-3},{"$f":"'Monthly Factors'!I26","v":1.8772385441074731E-3},{"$f":"'Monthly Factors'!J26","v":1.5783311410150771E-3},{"$f":"'Monthly Factors'!K26","v":1.4486378451963268E-2},{"$f":"'Monthly Factors'!L26","v":0.10238016286421177},{"$f":"'Monthly Factors'!M26","v":0.21813987132793164},null,null,null,null,null,null,null,null,null,"Primary land uses",null,null,null,"Cgf-wC "]
[null,"Water Usage",{"$f":"'Monthly Factors'!B31","v":0.06},{"$f":"'Monthly Factors'!C31","v":6.5000000000000002E-2},{"$f":"'Monthly Factors'!D31","v":7.4999999999999997E-2},{"$f":"'Monthly Factors'!E31","v":0.08},{"$f":"'Monthly Factors'!F31","v":0.09},{"$f":"'Monthly Factors'!G31","v":0.1},{"$f":"'Monthly Factors'!H31","v":0.11},{"$f":"'Monthly Factors'!I31","v":0.115},{"$f":"'Monthly Factors'!J31","v":0.1},{"$f":"'Monthly Factors'!K31","v":0.08},{"$f":"'Monthly Factors'!L31","v":7.0000000000000007E-2},{"$f":"'Monthly Factors'!M31","v":5.5E-2},null,null,null,null,null,null,null,null,null,"Degree of development",null,null,null,"Shawnigan Lake village at NE corner; Highly developed throughout for forestry purposes.  Extensive rural residential.  Very low impervious cover"]
[null,null,null,null,null,null,null,null,null,null,null,null,null,null,null,null,null,null,null,null,null,null,null,"Evapotranspiration potential",null,null,null,"High"]
[null,"Monthly Factors","Cold/Wet (1999)",null,null,null,null,null,null,null,null,null,null,null,null,null,null,null,null,null,null,null,null,"Relative environmental sensitivity",null,null,null,"High"]
[null,null,"Jan","Feb","Mar","Apr","May","Jun","Jul","Aug","Sep","Oct","Nov","Dec"]
[null,"Surplus Water",{"$f":"'Monthly Factors'!B21","v":0.28121118610350893},{"$f":"'Monthly Factors'!C21","v":0.28471061972718881},{"$f":"'Monthly Factors'!D21","v":0.1055893178084587},{"$f":"'Monthly Factors'!E21","v":-1.2670737757409583E-2},{"$f":"'Monthly Factors'!F21","v":-1.0294974427895285E-2},{"$f":"'Monthly Factors'!G21","v":-2.6925317734495361E-2},{"$f":"'Monthly Factors'!H21","v":-3.4844528832876351E-2},{"$f":"'Monthly Factors'!I21","v":-1.425457997708578E-2},{"$f":"'Monthly Factors'!J21","v":-6.3353688787047913E-3},{"$f":"'Monthly Factors'!K21","v":9.9861251950584262E-2},{"$f":"'Monthly Factors'!L21","v":0.16139352218500455},{"$f":"'Monthly Factors'!M21","v":0.17255960983372176},null,null,null,null,null,null,null,null,"Hydrogeology"]
[null,"Leakance/\nLateral Ground Water",{"$f":"'Monthly Factors'!B44","v":8.1000000000000003E-2},{"$f":"'Monthly Factors'!C44","v":7.8E-2},{"$f":"'Monthly Factors'!D44","v":8.6999999999999994E-2},{"$f":"'Monthly Factors'!E44","v":8.5999999999999993E-2},{"$f":"'Monthly Factors'!F44","v":0.09},{"$f":"'Monthly Factors'!G44","v":8.5999999999999993E-2},{"$f":"'Monthly Factors'!H44","v":8.6999999999999994E-2},{"$f":"'Monthly Factors'!I44","v":8.5000000000000006E-2},{"$f":"'Monthly Factors'!J44","v":8.1000000000000003E-2},{"$f":"'Monthly Factors'!K44","v":8.2000000000000003E-2},{"$f":"'Monthly Factors'!L44","v":7.8E-2},{"$f":"'Monthly Factors'!M44","v":7.9000000000000001E-2},null,null,null,null,null,null,null,null,null,"Groundwater occurrence (primary / secondary)",null,null,null,"Void infillings - bedrock fractures & faults, karst solution cavities"]
[null,"Surface Water",{"$f":"'Monthly Factors'!B26","v":0.22068086457424585},{"$f":"'Monthly Factors'!C26","v":0.19373952223030552},{"$f":"'Monthly Factors'!D26","v":0.13994869625957773},{"$f":"'Monthly Factors'!E26","v":6.7665632372012466E-2},{"$f":"'Monthly Factors'!F26","v":2.399263439717373E-2},{"$f":"'Monthly Factors'!G26","v":9.7313744914725147E-3},{"$f":"'Monthly Factors'!H26","v":5.7792933459831003E-3},{"$f":"'Monthly Factors'!I26","v":1.8772385441074731E-3},{"$f":"'Monthly Factors'!J26","v":1.5783311410150771E-3},{"$f":"'Monthly Factors'!K26","v":1.4486378451963268E-2},{"$f":"'Monthly Factors'!L26","v":0.10238016286421177},{"$f":"'Monthly Factors'!M26","v":0.21813987132793164},null,null,null,null,null,null,null,null,null,"Primary porosity",null,null,null,"Low to negligible "]
[null,"Water Usage",{"$f":"'Monthly Factors'!B31","v":0.06},{"$f":"'Monthly Factors'!C31","v":6.5000000000000002E-2},{"$f":"'Monthly Factors'!D31","v":7.4999999999999997E-2},{"$f":"'Monthly Factors'!E31","v":0.08},{"$f":"'Monthly Factors'!F31","v":0.09},{"$f":"'Monthly Factors'!G31","v":0.1},{"$f":"'Monthly Factors'!H31","v":0.11},{"$f":"'Monthly Factors'!I31","v":0.115},{"$f":"'Monthly Factors'!J31","v":0.1},{"$f":"'Monthly Factors'!K31","v":0.08},{"$f":"'Monthly Factors'!L31","v":7.0000000000000007E-2},{"$f":"'Monthly Factors'!M31","v":5.5E-2},null,null,null,null,null,null,null,null,null,"Secondary porosity",null,null,null,"Low to moderate in gneissic areas, higher in fractue zones & faults; low in volcanics areas due to ductile rock"]
[null,null,null,null,null,null,null,null,null,null,null,null,null,null,null,null,null,null,null,null,null,null,null,"Confinement",null,null,null,"Higher areas = Unconfined to semiconfined - assume bedrock fractures generally daylight to surface.                                Morainal blanket areas locally semi-confined by duric till blankets;                                                                                                                         WP = 0 - 59.7 m, avg 0.3 m"]
[null,null,null,null,null,null,null,null,null,null,null,null,null,null,null,null,null,null,null,null,null,null,null,"Aquifer thickness",null,null,null,"Bedrock aquifer / assume < 150 m"]
[null,null,null,null,null,null,null,null,null,null,null,null,null,null,null,null,null,null,null,null,null,null,null,"Hydraulic anisotropy",null,null,null,"High"]
[null,null,null,null,null,null,null,null,null,null,null,null,null,null,null,null,null,null,null,null,null,null,null,"Hydraulic gradient",null,null,null,"Moderate to high based on terrain"]
[null,"TABLE D-6",null,null,null,null,null,null,null,null,null,null,null,null,null,null,null,null,null,null,null,null,null,"Storage potential",null,null,null,"Low - secondary voids only"]
[null,"Groundwater Flow Components: Aquifer #0203, North Shawnigan (Bedrock)",null,null,null,null,null,null,null,null,null,null,null,null,null,null,null,null,null,null,null,null,null,"Yield potential",null,null,null,"Low; WP = 0.01 - 4.42 L/s / average 0.19 L/s"]
[null,null,null,null,null,null,null,null,null,null,null,null,null,null,null,null,null,null,null,null,null,null,null,"Flow velocities",null,null,null,"Low - moderate"]
[null,"Groundwater Flow","Direction of Flow","Source or Receptor of Water","Length (m)","Depth (m)","Area (m)","Hydraulic Conductivity (m/s) - K","Distance (m) - dL","Hydraulic Head (m) - dh",null,null,"GW Flow (m3/yr)",null,null,null,null,null,null,null,null,null,null,"Flow directions",null,null,null,"Centripetal towards Shawnigan Lake / modified faults"]
[null,null,null,null,null,null,null,null,null,"Year 1","Year 2","Year 3","Year 1","Year 2","Year 2",null,null,null,null,null,null,null,null,"Static water levels",null,null,null,"WP = variable 0 - 59.9 m bgs / avg 5.9 m bgs"]
[null,"QGW1","Zero","AQ 202",{"$f":"0.9*476","v":428.40000000000003},200,{"$f":"E82*F82","v":85680},1.0000000000000001E-5,1,0,null,null,{"$f":"-(G82*H82*(J82/I82))*60*60*24*365","v":0},null,null,null,null,null,null,null,null,null,null,"Hydraulic connection with surface waters",null,null,null,"High"]
[null,"QGW2","Zero","AQ 202",{"$f":"1.2*476","v":571.19999999999993},200,{"$f":"E83*F83","v":114239.99999999999},9.9999999999999995E-7,1,0,null,null,{"$f":"-(G83*H83*(J83/I83))*60*60*24*365","v":0},null,null,null,null,null,null,null,null,null,null,"Hydraulic connection to adjacent AQ"]
[null,"QGW3","Zero","AQ 202",{"$f":"1.6*476","v":761.6},200,152320,1E-4,1,0,null,null,0,null,null,null,null,null,null,null,null,null,null,null,"Over / Under",null,null,"None"]
[null,"QGW4","Zero","AQ 202",{"$f":"0.4*476","v":190.4},200,38080,9.9999999999999995E-7,1,0,null,null,0,null,null,null,null,null,null,null,null,null,null,null,"Upgradient",null,null,"Upgradient contact with undeveloped west, south, & east extensions of bedrock AQ 203 (not in study area); bedrock AQ 202; "]
[null,"QGW5","Zero","N/A",{"$f":"1*476","v":476},200,95200,1.0000000000000001E-5,1,0,null,null,0,null,null,null,null,null,null,null,null,null,null,null,"Downgradient",null,null,"Downgradient contact in NE quarter with bedrock AQ207"]
[null,"QGW6","Zero","N/A",{"$f":"2.4*476","v":1142.3999999999999},200,228479.99999999997,1.0000000000000001E-9,1,0,null,null,0,null,null,null,null,null,null,null,null,null,null,"Vulnerability to surface contamination",null,null,null,"High"]
[null,"QGW7","Zero","N/A",{"$f":"0.3*476","v":142.79999999999998},200,28559.999999999996,1E-8,1,0,null,null,0,null,null,null,null,null,null,null,null,null,null,"Recharge"]
[null,"QGW8","Zero","N/A",{"$f":"5.4*476","v":2570.4},200,514080,1.0000000000000001E-9,1,0,null,null,0,null,null,null,null,null,null,null,null,null,null,null,"Vertical inflow",null,null,"Mainly precipitation, limited snowmelt / sewerage.  Moderate to high from stream loss.                                                                                              Moderate irrigation return at north end (Shawnigan Lake School)"]
[null,"QGW9","In","N/A",{"$f":"0.3*476","v":142.79999999999998},200,28559.999999999996,9.9999999999999995E-8,2200,40,null,null,{"$f":"(G90*H90*(J90/I90))*60*60*24*365","v":1637.5784727272724},null,null,null,null,null,null,null,null,null,null,null,"Lateral inflow",null,null,"Low - moderate lateral inflow from upgradient bedrock sources (west = AQ203 extension / south & east from undeveloped MBR bedrock area (Malahat Ridge);                                                                                                                                                                   "]
[null,"QGW10","In","N/A",{"$f":"1*476","v":476},200,95200,1.0000000000000001E-9,2200,40,null,null,{"$f":"(G91*H91*(J91/I91))*60*60*24*365","v":54.585949090909097},null,null,null,null,null,null,null,null,null,null,null,"Temporal variability",null,null,"High"]
[null,"QGW11","In","N/A",{"$f":"0.3*476","v":142.79999999999998},200,28559.999999999996,9.9999999999999995E-8,2200,40,null,null,{"$f":"(G92*H92*(J92/I92))*60*60*24*365","v":1637.5784727272724},null,null,null,null,null,null,null,null,null,null,null,"MBR",null,null,"High from surrounding rocky hills to the west, south, and east"]
[null,"QGW12","Zero","N/A",{"$f":"7.5*476","v":3570},200,714000,1.0000000000000001E-9,1,0,"-","-",0,null,null,null,null,null,null,null,null,null,null,"Discharge"]
[null,"QGW13","Zero","N/A",{"$f":"0.7*476","v":333.2},200,66640,9.9999999999999995E-8,1,0,null,null,0,null,null,null,null,null,null,null,null,null,null,null,"Evapotranspiration",null,null,"High"]
[null,"QGW14","Zero","N/A",{"$f":"4*476","v":1904},200,380800,1.0000000000000001E-9,1,0,null,null,0,null,null,null,null,null,null,null,null,null,null,null,"Outflow to marine",null,null,"None"]
[null,"QGW15","In","N/A",{"$f":"4*476","v":1904},200,380800,1E-8,1410,100,null,null,{"$f":"(G96*H96*(J96/I96))*60*60*24*365","v":8516.9565957446812},null,null,null,null,null,null,null,null,null,null,null,"Outflow to surface waters",null,null,"High to Shawnigan Lake & feeder streams"]
[null,"QGW16","In","N/A",{"$f":"1.8*476","v":856.80000000000007},200,171360,1.0000000000000001E-9,635,40,null,null,{"$f":"(G97*H97*(J97/I97))*60*60*24*365","v":340.41001322834654},null,null,null,null,null,null,null,null,null,null,null,"Outflow to other AQ",null,null,"Moderate in NE quarter to bedrock AQ 207"]
[null,"QGW17","In","N/A",{"$f":"0.3*476","v":142.79999999999998},200,28559.999999999996,9.9999999999999995E-8,1015,80,null,null,{"$f":"(G98*H98*(J98/I98))*60*60*24*365","v":7098.8623448275848},null,null,null,null,null,null,null,null,null,null,null,"Temporal variability",null,null,"High"]
[null,"QGW18","Out","N/A",{"$f":"2.4*476","v":1142.3999999999999},60,68543.999999999985,1.0000000000000001E-9,220,40,null,null,-393.01883345454542]
[null,"QGW19","Zero","N/A",{"$f":"2.2*476","v":1047.2},200,209440,1.0000000000000001E-9,1,0,null,null,null,null,null,null,null,null,null,null,null,null,"Groundwater Development"]
[null,"QGW20","Zero","N/A",{"$f":"0.3*476","v":142.79999999999998},200,28559.999999999996,9.9999999999999995E-8,1,0,null,null,0,null,null,null,null,null,null,null,null,null,null,null,"Nearest BCMOE Observation Wells; distance; completion / relevance",null,null,"Well #320 = 5.3 m northeast of north end of AQ;  completed in surficial materials; irrelevant"]
[null,"QGW21","Zero","N/A",{"$f":"1*476","v":476},200,95200,1.0000000000000001E-9,1,0,null,null,0,null,null,null,null,null,null,null,null,null,null,null,"Total Annual Water Use (m3/yr) as reported by Hatfield (2015)",null,null,null,"  SUMS"]
[null,"QGW22","Zero","N/A",{"$f":"6.5*476","v":3094},200,618800,1E-8,1,0,null,null,0,null,null,null,null,null,null,null,null,null,null,null,null,"Industrial",null,0,"Total Commercial and Industrial"]
[null,"QGW23","Zero","N/A",{"$f":"0.3*476","v":142.79999999999998},200,28559.999999999996,9.9999999999999995E-8,1,0,null,null,0,null,null,null,null,null,null,null,null,null,null,null,null,"Commercial",null,14600,{"$f":"AB103+AB104","v":14600}]
[null,"QGW24","Zero","N/A",{"$f":"1.3*476","v":618.80000000000007},200,123760.00000000001,1.0000000000000001E-9,1,0,null,null,0,null,null,null,null,null,null,null,null,null,null,null,null,"Domestic",null,211827,"Total Irrigation"]
[null,"QGW25","In","N/A",{"$f":"1.6*476","v":761.6},200,152320,1.0000000000000001E-9,260,40,null,null,{"$f":"(G106*H106*(J106/I106))*60*60*24*365","v":739.00977230769229},null,null,null,null,null,null,null,null,null,null,null,null,"Irrigation from groundwater (Hatfield)",null,87428,{"$f":"AB106","v":87428}]
[null,"QGW26","Zero","N/A",{"$f":"1.8*476","v":856.80000000000007},200,171360,1.0000000000000001E-9,1,0,null,null,0,null,null,null,null,null,null,null,null,null,null,null,null,"BCMOE Obs",null,0]
[null,"QGW27","In","N/A",{"$f":"0.6*476","v":285.59999999999997},200,57119.999999999993,9.9999999999999995E-8,645,60,null,null,{"$f":"(G108*H108*(J108/I108))*60*60*24*365","v":16756.616930232554},null,null,null,null,null,null,null,null,null,null,null,null,"Other",null,29200,"Total Domestic + Water Systems + Other"]
[null,"QGW28","In","N/A",{"$f":"1.2*476","v":571.19999999999993},200,114239.99999999999,1.0000000000000001E-9,645,60,null,null,{"$f":"(G109*H109*(J109/I109))*60*60*24*365","v":335.13233860465112},null,null,null,null,null,null,null,null,null,null,null,null,"Water Supply Systems",null,149851,{"$f":"AB105+AB108+AB109","v":390878}]
[null,"QGW29","In","N/A",{"$f":"0.3*476","v":142.79999999999998},200,28559.999999999996,1E-8,645,60,null,null,{"$f":"(G110*H110*(J110/I110))*60*60*24*365","v":837.83084651162767}]
[null,"QGW30","Zero","AQ 207",{"$f":"5.3*476","v":2522.7999999999997},200,504559.99999999994,1.0000000000000001E-9,1,0,null,null,0,null,null,null,null,null,null,null,null,null,null,null,null,null,null,null,{"$f":"AC104+AC106+AC109","v":492906}]
[null,"QGW31","Zero","AQ 207",{"$f":"0.3*476","v":142.79999999999998},200,28559.999999999996,1E-8,1,0,null,null,0]
[null,"QGW32","Zero","AQ 207",{"$f":"1.2*476","v":571.19999999999993},200,114239.99999999999,1.0000000000000001E-9,1,0,null,null,0]
[null,"QGW33","Zero","AQ 207",{"$f":"0.3*476","v":142.79999999999998},200,28559.999999999996,1E-8,1,0,"-","-",0]
[null,"QGW34","Zero","AQ 207",{"$f":"2*476","v":952},200,190400,1.0000000000000001E-9,1,0,"-","-",0]
[null,"QGW35","Out","AQ 207",{"$f":"0.5*476","v":238},200,47600,9.9999999999999995E-8,550,20,"-","-",-5458.5949090909089]
[null,"QGW36","Zero","AQ 202",{"$f":"6.5*476","v":3094},200,618800,1.0000000000000001E-9,1,0,"-","-",0]
[null,"Total",null,null,null,null,null,null,null,null,null,null,{"$f":"SUM(M82:M117)","v":32102.947993457139}]
[]
[null,"Surface Water Contributions","Cold Water Creek?","Observed Vertical Gradient","Percent Permeable","Length (m)","Width (m)","Flux (m/s)","SW Flow (m3/yr)",null,null,"Comment"]
[null,null,null,null,null,null,null,null,"Year 1","Year 2","Year 3"]
[null,"Major River Out","--","Percent of Catchment Area = ",0.33226,"Infiltration Factor",0.57999999999999996,79778200,{"$f":"E122*G122*-H122","v":-15374120.74456},null,null,"Average annual flow calculated from flow station down gradient of Shawnigan Lake. Assuming AQ203 takes up 33.26% of the creeks catchment area. "]
[null,"McGee Creek","Unknown","Upward",0.1,2800,2,3.0000000000000001E-5,{"$f":"-(E123*F123*G123)*(H123*60*60*24*365)","v":-529804.80000000005}]
[null,"Van Horn Creek","Unknown","Upward",0.1,2300,2,3.0000000000000001E-5,{"$f":"-(E124*F124*G124)*(H124*60*60*24*365)","v":-435196.80000000005}]
[null,"Total",null,null,null,null,null,null,{"$f":"SUM(I122:I124)","v":-16339122.344560001},{"$f":"SUM(J122:J122)","v":0},{"$f":"SUM(K122:K122)","v":0}]
[]
[null,"Water Well Usage","Water Well Usage Volume (m3/yr)",null,null,null,null,null,null,null,null,"Comments"]
[null,null,"Year 1",null,null,"Year 2",null,null,"Year 3"]
[null,null,"Total Volume Removed","Adjustment Factor","Adjusted Volume Removed","Total Volume Removed","Adjustment Factor","Adjusted Volume Removed","Total Volume Removed","Adjustment Factor","Adjusted Volume Removed"]
[null,"Industrial",{"$f":"AB103","v":0},1,{"$f":"C130*D130","v":0},null,null,null,null,null,null,"Assuming 100% consumptive"]
[null,"Commercial",14600,1,{"$f":"C131*D131","v":14600},null,null,null,null,null,null,"Assuming 100% consumptive"]
[null,"Domestic",211827,1,211827,null,null,null,null,null,null,"Assuming 100% consumptive"]
[null,"Irrigation",87428,1,87428,null,null,null,null,null,null,"Assuming 100% consumptive"]
[null,"BCMOE Obs",0,1,0,null,null,null,null,null,null,"Assuming 100% consumptive"]
[null,"Other",29200,1,29200,null,null,null,null,null,null,"Assuming 100% consumptive"]
[null,"Water Supply Systems",149851,1,149851,null,null,null,null,null,null,"Assuming 100% consumptive"]
[null,"Total",null,null,{"$f":"-SUM(E130:E136)","v":-492906},null,null,{"$f":"-SUM(H130:H136)","v":0},null,null,{"$f":"-SUM(K130:K136)","v":0}]

{"sheet":"Bedrock 204","index":10,"n_rows":155,"n_cols":29,"rows_kept":155,"cut":false,"hidden":false,"merged":[[79,2,80,2],[79,1,80,1],[79,7,80,7],[79,6,80,6],[79,5,80,5],[79,4,80,4],[79,3,80,3],[1,2,1,4],[2,2,2,4],[3,2,3,4],[6,16,6,20],[21,16,21,20],[36,16,36,20],[4,2,4,4],[51,17,51,19],[137,1,138,1],[137,2,138,2],[137,3,138,3],[137,4,138,4],[137,5,138,5],[137,6,138,6],[137,7,138,7],[137,8,137,10],[137,11,138,11],[50,16,50,19],[79,12,79,14],[79,9,79,11],[79,8,80,8],[144,1,146,1],[144,2,144,10],[145,2,145,4],[145,5,145,7],[145,8,145,10]]}
[null,"CHM Aquifer Criteria: Aquifer #0204, Cobble Hill (Bedrock)",null,null,null,null,null,null,null,null,null,null,null,null,null,null,null,null,null,null,null,null,"TABLE E-1"]
[null,"AQ tag","204 Cobble Hill",null,null,null,null,null,null,null,null,null,null,null,null,null,null,null,null,null,null,null,"CHM Aquifer Criteria: Aquifer #0204, Cobble Hill (Bedrock)"]
[null,"Perimeter (km)",31.99]
[null,"Area (km2)",16.579999999999998,null,null,null,null,null,null,null,null,null,null,null,null,null,null,null,null,null,null,null,"BCMOE Criteria"]
[null,"Aquifer materials","Bedrock",null,null,null,null,null,null,null,null,null,null,null,null,null,null,null,null,null,null,null,null,"AQ tag",null,null,null,"204 Cobble Hill"]
[null,"Table E-4 Monthly  Summary of AQ204 Water Budgets",null,null,null,null,null,null,null,null,null,null,null,null,null,null,"Table E-3 Annual Summary of AQ204 Water Budgets",null,null,null,null,null,null,"AQ classification",null,null,null,"IIB (11)"]
[null,"Monthly Gains and Loses (m3)","Average Year",null,null,null,null,null,null,null,null,null,null,null,null,null,"Summary - 30 Year Average",null,null,null,null,null,null,"AQ type",null,null,null,"BCMOE Classification = 6b (SLR Classification = 6b / 6a)"]
[null,"Source","Jan","Feb","Mar","Apr","May","Jun","Jul","Aug","Sep","Oct","Nov","Dec","Total",null,"Gains and Losses","Source","Area (m2)","Infiltration Rate","Q (m3/yr)",null,null,"Location",null,null,null,"Cobble Hill / Mill Bay"]
[{"$f":"$C$7&B9","v":"Average YearDirect Recharge to 204"},"Direct Recharge to 204",{"$f":"C55*$U$9","v":1041668.0710922462},678502.46936860797,489655.60436359467,117591.29811501522,-141543.2968670087,-223202.89121335989,-217758.91825693648,-97991.513215621409,-32663.837738540467,358121.37371247739,1098797.5499206677,1071167.4730598491,{"$f":"SUM(C9:N9)","v":4142343.3823409909},null,"Gain","Direct Recharge to 204",{"$f":"1145.35034424*10000","v":11453503.442399999},{"$f":"U9/S9","v":0.36166605293943083},{"$f":"S58","v":4142343.3823409914},null,null,"Perimeter (km)",null,null,null,31.99]
[{"$f":"$C$7&B10","v":"Average YearLeakage down from 197"},"Leakage down from 197",{"$f":"C56*$U$10","v":124571.17301228101},119957.42586367801,133798.66730948701,132260.751593286,138412.41445809,132260.751593286,133798.66730948701,130722.83587708502,124571.17301228101,126109.08872848202,119957.42586367801,121495.34157987901,{"$f":"SUM(C10:N10)","v":1537915.7162010001},null,"Gain","Leakage down from 197",{"$f":"G135","v":5126385.7206700006},{"$f":"F135","v":0.3},{"$f":"M135","v":1537915.7162010001},null,null,"Area (km2)",null,null,null,16.579999999999998]
["Average YearLateral Groundwater","Lateral Groundwater",{"$f":"C56*$U$11","v":-1053505.4512575506},-1014486.7308406043,-1131542.8920914431,-1118536.6519524611,-1170561.6125083894,-1118536.6519524611,-1131542.8920914431,-1105530.4118134791,-1053505.4512575506,-1066511.6913965328,-1014486.7308406043,-1027492.9709795864,-13006240.138982106,null,"Loss","Lateral Groundwater","--","--",{"$f":"SUMIF(M82:M134, \"<0\")","v":-13006240.138982106},null,null,"Aquifer materials",null,null,null,"Bedrock"]
["Average YearLateral Groundwater","Lateral Groundwater",{"$f":"C56*$U$12","v":882924.80141666159},850223.88284567406,948326.63855863642,937426.33236830728,981027.55712962395,937426.33236830728,948326.63855863642,926526.02617797826,882924.80141666159,893825.10760699073,850223.88284567406,861124.1890360032,10900306.190329155,null,"Gain","Lateral Groundwater","--","--",{"$f":"SUMIF(M82:M134, \">0\")","v":10900306.190329155},null,null,"Lithostratigraphic unit",null,null,null,"Lower to Middle Jurassic Island Intrusions"]
["Average YearSurface Water","Surface Water",{"$f":"C57*$U$13","v":0},0,0,0,0,0,0,0,0,0,0,0,0,null,"Loss","Surface Water","--","--",{"$f":"SUMIF(I140:I142, \"<0\")","v":0},null,null,"Productivity",null,null,null,"Moderate"]
["Average YearSurface Water","Surface Water",{"$f":"C57*$U$14","v":215880.3319365202},189525.05215616347,136904.35308420821,66193.682924647015,23470.715903194381,9519.6851773746566,5653.5747596257934,1836.402448430711,1543.9972617718568,14171.252205311746,100153.05851498098,213394.61362777118,978246.72000000009,null,"Gain","Surface Water","--","--",{"$f":"SUMIF(I140:I142, \">0\")","v":978246.72000000009},null,null,"Vulnerability",null,null,null,"Moderate"]
["Average YearWell Water Usage","Well Water Usage",{"$f":"C58*$U$15","v":-36487.199999999997},-39527.800000000003,-45609,-48649.599999999999,-54730.799999999996,-60812,-66893.2,-69933.8,-60812,-48649.599999999999,-42568.4,-33446.6,-608120,null,"Loss"," Water Usage","--","--",{"$f":"E155","v":-608120},null,null,"Demand",null,null,null,"Moderate"]
["Average YearNet Gain","Net Gain",{"$f":"SUMIF(C9:C15, \">0\")","v":2265044.3774577091},{"$f":"SUMIF(D9:D15, \">0\")","v":1838208.8302341234},1708685.2633159263,1253472.0650012556,1142910.6874909084,1079206.7691389679,1087778.8806277493,1059085.2645034939,1009039.9716907145,1392226.8222532619,2169131.9171450008,2267181.6173035027,18271972.466162615,null,"Net Gain",null,null,null,{"$f":"SUMIF(U9:U15, \">0\")","v":17558812.008871146},null,null,"Use",null,null,null,"Multiple"]
["Average YearNet Loss","Net Loss",{"$f":"SUMIF(C9:C15, \"<0\")","v":-1089992.6512575506},{"$f":"SUMIF(D9:D15, \"<0\")","v":-1054014.5308406043},-1177151.8920914431,-1167186.2519524612,-1366835.7093753982,-1402551.5431658211,-1416195.0103483794,-1273455.7250291007,-1146981.2889960911,-1115161.2913965329,-1057055.1308406042,-1060939.5709795863,-14327520.596273573,null,"Net Loss",null,null,null,{"$f":"SUMIF(U9:U15, \"<0\")","v":-13614360.138982106}]
["Average YearNet Total (Gain - Loss)","Net Total (Gain - Loss)",{"$f":"SUM(C16:C17)","v":1175051.7262001585},{"$f":"SUM(D16:D17)","v":784194.29939351906},531533.37122448324,86285.8130487944,-223925.0218844898,-323344.77402685327,-328416.12972063012,-214370.46052560676,-137941.31730537664,277065.53085672902,1112076.7863043966,1206242.0463239164,3944451.8698890409,null,"Net Total (Gain - Loss)",null,null,null,{"$f":"SUM(U16:U17)","v":3944451.8698890395},null,"Location"]
[null,null,null,null,null,null,null,null,null,null,null,null,null,null,null,null,null,null,null,null,null,null,null,"NTS 50000",null,null,null,"092B/12"]
[null,null,null,null,null,null,null,null,null,null,null,null,null,null,null,null,null,null,null,null,null,null,null,"TRIM 20000",null,null,null,"Straddles 092B.062 & 092B.063"]
[null,null,null,null,null,null,null,null,null,null,null,null,null,null,null,null,null,null,null,null,null,null,null,"Lat / Long (Centre)",null,null,null,"48o40'19\" / 123o33'41\""]
[null,"Monthly Gains and Loses (m3)","Hot/Dry (1989)",null,null,null,null,null,null,null,null,null,null,null,null,null,"Summary - Hot/Dry (1989)",null,null,null,null,null,null,"UTM Zone 10 (Centre)",null,null,null,"458655E / 5391148N"]
[null,"Source","Jan","Feb","Mar","Apr","May","Jun","Jul","Aug","Sep","Oct","Nov","Dec","Total",null,"Gains and Losses","Source","Area (m2)","Infiltration Rate","Q (m3/yr)"]
[{"$f":"$C$22&B24","v":"Hot/Dry (1989)Direct Recharge to 204"},"Direct Recharge to 204",{"$f":"C62*$U$24","v":854425.60107782506},{"$f":"D62*$U$24","v":489957.56607810699},761837.41314239078,45729.372833956659,-179651.10756197257,-228646.86416978325,-195983.02643124282,-81659.594346351165,-54439.729564234112,138821.31038879699,544941.69293798343,691384.56546577322,{"$f":"SUM(C24:N24)","v":2786717.1998512493},null,"Gain","Direct Recharge to 204",{"$f":"1145.35034424*10000","v":11453503.442399999},{"$f":"U24/S24","v":0.2433069683757228},{"$f":"R58","v":2786717.1998512489},null,"Climate"]
[{"$f":"$C$22&B25","v":"Hot/Dry (1989)Leakage down from 197"},"Leakage down from 197",{"$f":"C63*$U$25","v":126109.08872848202},{"$f":"D63*$U$25","v":116881.59443127601},129184.92016088402,127647.00444468301,133798.66730948701,129184.92016088402,133798.66730948701,132260.751593286,126109.08872848202,130722.83587708502,124571.17301228101,127647.00444468301,{"$f":"SUM(C25:N25)","v":1537915.7162010001},null,"Gain","Leakage down from 197",{"$f":"G135","v":5126385.7206700006},{"$f":"F135","v":0.3},{"$f":"M135","v":1537915.7162010001},null,null,"Nearest active EC weather station / distance / elevation",null,null,null,"EEC1015136 Mill Bay SW1 / 475 m to south                                                                                                                                                            EC1017230 Shawnigan Lake / 1.65 km to southwest  "]
["Hot/Dry (1989)Lateral Groundwater","Lateral Groundwater",{"$f":"C63*$U$26","v":-1066511.6913965328},{"$f":"D63*$U$26","v":-988474.25056264002},-1092524.171674497,-1079517.9315355148,-1131542.8920914431,-1092524.171674497,-1131542.8920914431,-1118536.6519524611,-1066511.6913965328,-1105530.4118134791,-1053505.4512575506,-1079517.9315355148,-13006240.138982106,null,"Loss","Lateral Groundwater","--","--",{"$f":"SUMIF(M82:M134, \"<0\")","v":-13006240.138982106},null,null,"IDF Curve",null,null,null,"Unknown"]
["Hot/Dry (1989)Lateral Groundwater","Lateral Groundwater",{"$f":"C63*$U$27","v":893825.10760699073},{"$f":"D63*$U$27","v":828423.27046501578},915625.71998764912,904725.41379731987,948326.63855863642,915625.71998764912,948326.63855863642,937426.33236830728,893825.10760699073,926526.02617797826,882924.80141666159,904725.41379731987,10900306.190329157,null,"Gain","Lateral Groundwater","--","--",{"$f":"SUMIF(M82:M134, \">0\")","v":10900306.190329155}]
["Hot/Dry (1989)Surface Water","Surface Water",{"$f":"$U$28*C64","v":0},{"$f":"$U$28*D64","v":0},0,0,0,0,0,0,0,0,0,0,0,null,"Loss","Surface Water","--","--",{"$f":"SUMIF(I140:I142, \"<0\")","v":0},null,"Physiography"]
["Hot/Dry (1989)Surface Water","Surface Water",{"$f":"$U$29*C64","v":215880.3319365202},{"$f":"$U$29*D64","v":189525.05215616347},136904.35308420821,66193.682924647015,23470.715903194381,9519.6851773746566,5653.5747596257934,1836.402448430711,1543.9972617718568,14171.252205311746,100153.05851498098,213394.61362777118,978246.72000000009,null,"Gain","Surface Water","--","--",{"$f":"SUMIF(I140:I142, \">0\")","v":978246.72000000009},null,null,"Physiographic zone",null,null,null,"Canadian Cordillera / Western System / Coastal Trough / Georgia Depression / Nanaimo Lowland"]
["Hot/Dry (1989)Well Water Usage","Well Water Usage",{"$f":"C65*$U$30","v":-36487.199999999997},{"$f":"D65*$U$30","v":-39527.800000000003},-45609,-48649.599999999999,-54730.799999999996,-60812,-66893.2,-69933.8,-60812,-48649.599999999999,-42568.4,-33446.6,-608120,null,"Loss"," Water Usage","--","--",{"$f":"E155","v":-608120},null,null,"Elevation range (m amsl)",null,null,null,"0 - 140 m amsl"]
["Hot/Dry (1989)Net Gain","Net Gain",{"$f":"SUMIF(C24:C30, \">0\")","v":2090240.1293498182},1624787.4831305621,1943552.4063751323,1144295.4740006067,1105596.0217713178,1054330.3253259079,1087778.8806277493,1071523.4864100239,1021478.1935972446,1210241.424649172,1652590.7258819072,1937151.5973355472,16943566.14845499,null,"Net Gain",null,null,null,{"$f":"SUMIF(U24:U30, \">0\")","v":16203185.826381406},null,null,"Distance to marine",null,null,null,"Abuts Mill Bay and Saanich Inlet along east edge"]
["Hot/Dry (1989)Net Loss","Net Loss",{"$f":"SUMIF(C24:C30, \"<0\")","v":-1102998.8913965328},-1028002.0505626401,-1138133.171674497,-1128167.5315355149,-1365924.7996534158,-1381983.0358442802,-1394419.1185226857,-1270130.0462988124,-1181763.420960767,-1154180.0118134792,-1096073.8512575505,-1112964.5315355149,-14354740.46105569,null,"Net Loss",null,null,null,{"$f":"SUMIF(U24:U30, \"<0\")","v":-13614360.138982106},null,null,"Geomorphological setting",null,null,null,"West end = + east -central area = hilly terrain / bedrock dominated?; central and east portions =                                           undulating glacial outwash fan"]
["Hot/Dry (1989)Net Total (Gain - Loss)","Net Total (Gain - Loss)",{"$f":"SUM(C31:C32)","v":987241.23795328545},{"$f":"SUM(D31:D32)","v":596785.43256792205},805419.23470063531,16127.942465091823,-260328.77788209799,-327652.71051837225,-306640.23789493646,-198606.5598887885,-160285.2273635224,56061.412835692754,556516.87462435663,824187.06580003235,2588825.6873992989,null,"Net Total (Gain - Loss)",null,null,null,{"$f":"SUM(U31:U32)","v":2588825.6873992998},null,null,"Topography",null,null,null,"Isolated, NW-trending, elongated conical hills within a planar to undulating area east of Shawnigan Creek mainstem.  Contains most of Shawnigan Creek's south-flowing tributaries"]
[null,null,null,null,null,null,null,null,null,null,null,null,null,null,null,null,null,null,null,null,null,null,null,"Terrain",null,null,null,"Undulating to hummocky at higher elevations; undulating to planar at lower elevations"]
[null,null,null,null,null,null,null,null,null,null,null,null,null,null,null,null,null,null,null,null,null,null,null,"Aspect",null,null,null,"West 3/4 = half-basinal, sloping to south and southwest towards Shawnigan Creek mainstem.                                                      East 1/4 = southwest, southeast, and northeast-facing slopes off elongated hill."]
[null,null,null,null,null,null,null,null,null,null,null,null,null,null,null,null,null,null,null,null,null,null,null,"Slope",null,null,null,"West 3/4 = variable, planar-concave towards Shawnigan Creek; East 1/4 = generally convex, except within minor stream / tributary catchments"]
[null,"Monthly Gains and Loses (m3)","Cold/Wet (1999)",null,null,null,null,null,null,null,null,null,null,null,null,null,"Summary - Wet/Cold (1999)",null,null,null,null,null,null,"XS max grade (m/m)",null,null,null,"0.035 to ESE towards Mill Bay / 0.057 east side SSE towards Mill Bay"]
[null,"Source","Jan","Feb","Mar","Apr","May","Jun","Jul","Aug","Sep","Oct","Nov","Dec","Total",null,"Gains and Losses","Source","Area (m2)","Infiltration Rate","Q (m3/yr)",null,null,"Roughness coefficient",null,null,null,"0.65 (partly cleared /  deciduous-coniferous cover)"]
[{"$f":"$C$37&B39","v":"Cold/Wet (1999)Direct Recharge to 204"},"Direct Recharge to 204",{"$f":"C69*$U$39","v":1933154.7968259531},{"$f":"D69*$U$39","v":1957211.2612558592},725861.93687141873,-87103.567302774565,-70771.648433504335,-185095.08051839593,-239534.81008263005,-97991.51321562138,-43551.783651387283,686484.98980499199,1109481.6885190911,1186241.7072046611,{"$f":"SUM(C39:N39)","v":6874387.9772776617},null,"Gain","Direct Recharge to 204",{"$f":"1145.35034424*10000","v":11453503.442399999},{"$f":"U39/S39","v":0.60019958188768696},{"$f":"T58","v":6874387.9772776626}]
[{"$f":"$C$37&B40","v":"Cold/Wet (1999)Leakage down from 197"},"Leakage down from 197",{"$f":"C70*$U$40","v":124571.17301228101},{"$f":"D70*$U$40","v":119957.42586367801},133798.66730948701,132260.751593286,138412.41445809,132260.751593286,133798.66730948701,130722.83587708502,124571.17301228101,126109.08872848202,119957.42586367801,121495.34157987901,{"$f":"SUM(C40:N40)","v":1537915.7162010001},null,"Gain","Leakage down from 197",{"$f":"G135","v":5126385.7206700006},{"$f":"F135","v":0.3},{"$f":"M135","v":1537915.7162010001},null,"Geology"]
["Cold/Wet (1999)Lateral Groundwater","Lateral Groundwater",{"$f":"C70*$U$41","v":-1053505.4512575506},{"$f":"D70*$U$41","v":-1014486.7308406043},-1131542.8920914431,-1118536.6519524611,-1170561.6125083894,-1118536.6519524611,-1131542.8920914431,-1105530.4118134791,-1053505.4512575506,-1066511.6913965328,-1014486.7308406043,-1027492.9709795864,-13006240.138982106,null,"Loss","Lateral Groundwater","--","--",{"$f":"SUMIF(M82:M134, \"<0\")","v":-13006240.138982106},null,null,"Terrane",null,null,null,"Wrangellia / Overlap"]
["Cold/Wet (1999)Lateral Groundwater","Lateral Groundwater",{"$f":"C70*$U$42","v":882924.80141666159},{"$f":"D70*$U$42","v":850223.88284567406},948326.63855863642,937426.33236830728,981027.55712962395,937426.33236830728,948326.63855863642,926526.02617797826,882924.80141666159,893825.10760699073,850223.88284567406,861124.1890360032,10900306.190329155,null,"Gain","Lateral Groundwater","--","--",{"$f":"SUMIF(M82:M134, \">0\")","v":10900306.190329155},null,null,"Bedrock (type ; age ; formation ; lithology)",null,null,null,"                                                                                                                                                                                                                                                                                                                                                      "]
["Cold/Wet (1999)Surface Water","Surface Water",{"$f":"$U$43*C71","v":0},{"$f":"$U$43*D71","v":0},0,0,0,0,0,0,0,0,0,0,0,null,"Loss","Surface Water","--","--",{"$f":"SUMIF(I140:I142, \"<0\")","v":0},null,null,null,"Primary",null,null,"East / southeast 2/3 = Early to Middle Jurassic Island Plutonic Suite (EMJIgd); granodioritic intrusive rocks (65%)       "]
["Cold/Wet (1999)Surface Water","Surface Water",{"$f":"$U$44*C71","v":215880.3319365202},{"$f":"$U$44*D71","v":189525.05215616347},136904.35308420821,66193.682924647015,23470.715903194381,9519.6851773746566,5653.5747596257934,1836.402448430711,1543.9972617718568,14171.252205311746,100153.05851498098,213394.61362777118,978246.72000000009,null,"Gain","Surface Water","--","--",{"$f":"SUMIF(I140:I142, \">0\")","v":978246.72000000009},null,null,null,"Secondary",null,null,"Northwest 1/3 = Middle to Upper Devonian Sicker Group Duck Lake Volcanics (muDSiD); basaltic volcanic rocks (25%)"]
["Cold/Wet (1999)Well Water Usage","Well Water Usage",{"$f":"C72*$U$45","v":-36487.199999999997},{"$f":"D72*$U$45","v":-39527.800000000003},-45609,-48649.599999999999,-54730.799999999996,-60812,-66893.2,-69933.8,-60812,-48649.599999999999,-42568.4,-33446.6,-608120,null,"Loss"," Water Usage","--","--",{"$f":"E155","v":-608120},null,null,null,"Tertiary",null,null,"Southwest corner = Jurassic Bonanza Group Volcanics (IJBca); basaltic-andesitic (5%)"]
["Cold/Wet (1999)Net Gain","Net Gain",{"$f":"SUMIF(C39:C45, \">0\")","v":3156531.1031914158},{"$f":"SUMIF(D39:D45, \">0\")","v":3116917.6221213746},1944891.5958237504,1135880.7668862403,1142910.6874909084,1079206.7691389679,1087778.8806277493,1059085.2645034939,1009039.9716907145,1720590.4383457764,2179816.0557434242,2382255.8514483147,21014905.007012133,null,"Net Gain",null,null,null,{"$f":"SUMIF(U39:U45, \">0\")","v":20290856.603807814},null,null,null,"Subsidiary",null,null,"Northeast corner / \"peninsula\" = Upper Cretaceous Nanaimo Group (uKN); shale (5%)                                                                        "]
["Cold/Wet (1999)Net Loss","Net Loss",{"$f":"SUMIF(C39:C45, \"<0\")","v":-1089992.6512575506},{"$f":"SUMIF(D39:D45, \"<0\")","v":-1054014.5308406043},-1177151.8920914431,-1254289.8192552358,-1296064.0609418938,-1364443.732470857,-1437970.902174073,-1273455.7250291007,-1157869.2349089379,-1115161.2913965329,-1057055.1308406042,-1060939.5709795863,-14338408.542186419,null,"Net Loss",null,null,null,{"$f":"SUMIF(U39:U45, \"<0\")","v":-13614360.138982106},null,null,"Structure",null,null,null,"East-northeast trending San Juan Fault  crosses AQ;                                                                                                                                                          AQ south of SJF  crossed by at least one west-northwest trending thrust fault that does not cross the SJF"]
["Cold/Wet (1999)Net Total (Gain - Loss)","Net Total (Gain - Loss)",{"$f":"SUM(C46:C47)","v":2066538.4519338652},{"$f":"SUM(D46:D47)","v":2062903.0912807703},767739.7037323073,-118409.0523689955,-153153.37345098541,-285236.96333188913,-350192.02154632378,-214370.46052560676,-148829.26321822347,605429.1469492435,1122760.92490282,1321316.2804687284,6676496.4648257103,null,"Net Total (Gain - Loss)",null,null,null,{"$f":"SUM(U46:U47)","v":6676496.4648257084},null,null,"Surficial (formation; lithology; thickness)",null,null,null,"Vashon Drift morainal; silt-sand; generally shallow to moderately deep blankets (3 - 10 m) / higher areas - locally colluvial veneers on steeper slopes at  mid-elevations.  Small blankets of  Capilano Formation glaciolacustrine materials in morainal hollows & at west end within Shawnigan Creek mainstem area / Salish Formation fluvial blankets and veneers along Shawnigan Creek & tributaries"]
[null,null,null,null,null,null,null,null,null,null,null,null,null,null,null,null,null,null,null,null,null,null,null,"Surficial designation (1993)",null,null,null,"Generally dMbh/$LGP//sgFGf.  isolated depressional  areas = $Op                                                                                                                                                                                                                                                                                                                                                                                                                                        "]
[null,null,null,null,null,null,null,null,null,null,null,null,null,null,null,null,null,null,null,null,null,null,null,"Soils (association; parent; texture; drainage; type; comments)",null,null,null,"Higher elevations = SE1v8DD1v1QU11/de (Somenos moraine /  Dashwood marine / Quamichan fluvial); predominantly gravelly-sandy loam D.DYB                                                                                                                                                                                                                    Lower elevations centred on Mill Bay = FF1v8TT72/de (Finlayson & Tagner marine ).  predominantly silty-clay loam GLE.DYB, stonefree"]
[null,null,null,null,null,null,null,null,null,null,null,null,null,null,null,null,"Table E-2.  Direct Recharge Calculation for AQ204",null,null,null,null,null,null,"Restrictive layers",null,null,null,"Yes - surface duric layer in morainal areas; low permeability soils in silt-clay-rich areas"]
[null,"Table E-5  Monthly  Coefficients used in Calculations for AQ204",null,null,null,null,null,null,null,null,null,null,null,null,null,null,null,"Direct Recharge Calculation",null,null,null,null,null,"Estimated permeability",null,null,null,"Low-moderate @ surface in duric morainal areas / low in silt-clay rich areas"]
[null,"Monthly Factors","30 Year Average",null,null,null,null,null,null,null,null,null,null,null,null,null,null,"Hot/Dry","Average","Cold/Wet"]
[null,null,"Jan","Feb","Mar","Apr","May","Jun","Jul","Aug","Sep","Oct","Nov","Dec",null,null,"Surplus (mm)",{"$f":"SUM('Climate Dashboard'!AA42:AL42)","v":511.89034592156941},{"$f":"SUM('Climate Dashboard'!C48:AL48)/3","v":760.90447463619182},{"$f":"SUM('Climate Dashboard'!AA54:AL54)","v":1262.7520438297711},null,null,"Hydrology"]
[null,"Surplus Water",{"$f":"'Monthly Factors'!B16","v":0.25146830548450599},{"$f":"'Monthly Factors'!C16","v":0.16379677075085},{"$f":"'Monthly Factors'!D16","v":0.1182073911233482},{"$f":"'Monthly Factors'!E16","v":2.8387626824061124E-2},{"$f":"'Monthly Factors'!F16","v":-3.4169860825738051E-2},{"$f":"'Monthly Factors'!G16","v":-5.3883242071356162E-2},{"$f":"'Monthly Factors'!H16","v":-5.2569016654981621E-2},{"$f":"'Monthly Factors'!I16","v":-2.3656057494741728E-2},{"$f":"'Monthly Factors'!J16","v":-7.8853524982472421E-3},{"$f":"'Monthly Factors'!K16","v":8.6453811443823317E-2},{"$f":"'Monthly Factors'!L16","v":0.26525988999485034},{"$f":"'Monthly Factors'!M16","v":0.25858973392362583},null,null,"Station Coeffiecient Factor",1.02,1.02,1.02,null,null,null,"GW / SW basin coincidence",null,null,null,"No - straddles catchment divide between Shawnigan Creek mainstem-tributaries and streams flowing direcrtly into Saanich Inlet.  Occupies north side of Shawnigan Creek catchment only."]
[null,"Leakance/\nLateral Ground Water",{"$f":"'Monthly Factors'!B42","v":8.1000000000000003E-2},{"$f":"'Monthly Factors'!C42","v":7.8E-2},{"$f":"'Monthly Factors'!D42","v":8.6999999999999994E-2},{"$f":"'Monthly Factors'!E42","v":8.5999999999999993E-2},{"$f":"'Monthly Factors'!F42","v":0.09},{"$f":"'Monthly Factors'!G42","v":8.5999999999999993E-2},{"$f":"'Monthly Factors'!H42","v":8.6999999999999994E-2},{"$f":"'Monthly Factors'!I42","v":8.5000000000000006E-2},{"$f":"'Monthly Factors'!J42","v":8.1000000000000003E-2},{"$f":"'Monthly Factors'!K42","v":8.2000000000000003E-2},{"$f":"'Monthly Factors'!L42","v":7.8E-2},{"$f":"'Monthly Factors'!M42","v":7.9000000000000001E-2},null,null,"Infiltration Coefficient",0.465990900993,0.465990900993,0.465990900993,null,null,null,"Catchments",null,null,null,"Shawnigan Creek / Saanich inlet streams"]
[null,"Surface Water",{"$f":"'Monthly Factors'!B26","v":0.22068086457424585},{"$f":"'Monthly Factors'!C26","v":0.19373952223030552},{"$f":"'Monthly Factors'!D26","v":0.13994869625957773},{"$f":"'Monthly Factors'!E26","v":6.7665632372012466E-2},{"$f":"'Monthly Factors'!F26","v":2.399263439717373E-2},{"$f":"'Monthly Factors'!G26","v":9.7313744914725147E-3},{"$f":"'Monthly Factors'!H26","v":5.7792933459831003E-3},{"$f":"'Monthly Factors'!I26","v":1.8772385441074731E-3},{"$f":"'Monthly Factors'!J26","v":1.5783311410150771E-3},{"$f":"'Monthly Factors'!K26","v":1.4486378451963268E-2},{"$f":"'Monthly Factors'!L26","v":0.10238016286421177},{"$f":"'Monthly Factors'!M26","v":0.21813987132793164},null,null,"Area (m2)",{"$f":"S9","v":11453503.442399999},{"$f":"S9","v":11453503.442399999},{"$f":"S9","v":11453503.442399999},null,null,null,"Drainage regime",null,null,null,"Dendritic within Shawnigan Creek catchment / radial in hilly areas"]
[null,"Water Usage",{"$f":"'Monthly Factors'!B31","v":0.06},{"$f":"'Monthly Factors'!C31","v":6.5000000000000002E-2},{"$f":"'Monthly Factors'!D31","v":7.4999999999999997E-2},{"$f":"'Monthly Factors'!E31","v":0.08},{"$f":"'Monthly Factors'!F31","v":0.09},{"$f":"'Monthly Factors'!G31","v":0.1},{"$f":"'Monthly Factors'!H31","v":0.11},{"$f":"'Monthly Factors'!I31","v":0.115},{"$f":"'Monthly Factors'!J31","v":0.1},{"$f":"'Monthly Factors'!K31","v":0.08},{"$f":"'Monthly Factors'!L31","v":7.0000000000000007E-2},{"$f":"'Monthly Factors'!M31","v":5.5E-2},null,null,"Q (m3/yr)",{"$f":"(R54/1000)*R55*R56*R57","v":2786717.1998512489},{"$f":"(S54/1000)*S55*S56*S57","v":4142343.3823409914},{"$f":"(T54/1000)*T55*T56*T57","v":6874387.9772776626},null,null,null,"Surface waters",null,null,null,"Shawnigan Creek (along south border); six unnamed streams directly flowing into Saanich Inlet and/or Mill Bay"]
[null,null,null,null,null,null,null,null,null,null,null,null,null,null,null,null,"Average Infiltration Rate",{"$f":"R58/R57","v":0.2433069683757228},{"$f":"S58/S57","v":0.36166605293943083},{"$f":"T58/T57","v":0.60019958188768696},null,null,null,"Runoff coefficient",null,null,null,"~50% cleared-agricultural / ~30% forested / 20% rural residential / moderate slope =   0.55"]
[null,"Monthly Factors","Hot/Dry (1989)",null,null,null,null,null,null,null,null,null,null,null,null,null,null,null,null,null,null,null,null,"Nearest Active EC hydrometric station; distance; type",null,null,null,"Shawnigan Creek @ Mill Bay; south border of AQ (inactive);                                                                                                                                                                  EC 08HA003 Koksilah River  @ Cowichan Station; 6.8 km NW; active realtime;                                                                                                      "]
[null,null,"Jan","Feb","Mar","Apr","May","Jun","Jul","Aug","Sep","Oct","Nov","Dec",null,null,null,null,null,null,null,null,null,"Surface water diversions ; relevance",null,null,null,"> 20 licences along Shawnigan Creek & south side of AQ / >15 within AQ along unnamed steams;  Generally low relevancy due to high overburden thicknesses, elevated along incised sections of Shawnigan Creek"]
[null,"Surplus Water",{"$f":"'Monthly Factors'!B11","v":0.30660649782598431},{"$f":"'Monthly Factors'!C11","v":0.17581890480464263},{"$f":"'Monthly Factors'!D11","v":0.27338167402959174},{"$f":"'Monthly Factors'!E11","v":1.6409764448433315E-2},{"$f":"'Monthly Factors'!F11","v":-6.4466931761702304E-2},{"$f":"'Monthly Factors'!G11","v":-8.2048822242166558E-2},{"$f":"'Monthly Factors'!H11","v":-7.032756192185706E-2},{"$f":"'Monthly Factors'!I11","v":-2.9303150800773774E-2},{"$f":"'Monthly Factors'!J11","v":-1.9535433867182515E-2},{"$f":"'Monthly Factors'!K11","v":4.9815356361315413E-2},{"$f":"'Monthly Factors'!L11","v":0.19554969301049696},{"$f":"'Monthly Factors'!M11","v":0.24810001011321794}]
[null,"Leakance/\nLateral Ground Water",{"$f":"'Monthly Factors'!B43","v":8.2000000000000003E-2},{"$f":"'Monthly Factors'!C43","v":7.5999999999999998E-2},{"$f":"'Monthly Factors'!D43","v":8.4000000000000005E-2},{"$f":"'Monthly Factors'!E43","v":8.3000000000000004E-2},{"$f":"'Monthly Factors'!F43","v":8.6999999999999994E-2},{"$f":"'Monthly Factors'!G43","v":8.4000000000000005E-2},{"$f":"'Monthly Factors'!H43","v":8.6999999999999994E-2},{"$f":"'Monthly Factors'!I43","v":8.5999999999999993E-2},{"$f":"'Monthly Factors'!J43","v":8.2000000000000003E-2},{"$f":"'Monthly Factors'!K43","v":8.5000000000000006E-2},{"$f":"'Monthly Factors'!L43","v":8.1000000000000003E-2},{"$f":"'Monthly Factors'!M43","v":8.3000000000000004E-2},null,null,null,null,null,null,null,null,null,"Vegetation zone",null,null,null,"Cgf-wC"]
[null,"Surface Water",{"$f":"'Monthly Factors'!B26","v":0.22068086457424585},{"$f":"'Monthly Factors'!C26","v":0.19373952223030552},{"$f":"'Monthly Factors'!D26","v":0.13994869625957773},{"$f":"'Monthly Factors'!E26","v":6.7665632372012466E-2},{"$f":"'Monthly Factors'!F26","v":2.399263439717373E-2},{"$f":"'Monthly Factors'!G26","v":9.7313744914725147E-3},{"$f":"'Monthly Factors'!H26","v":5.7792933459831003E-3},{"$f":"'Monthly Factors'!I26","v":1.8772385441074731E-3},{"$f":"'Monthly Factors'!J26","v":1.5783311410150771E-3},{"$f":"'Monthly Factors'!K26","v":1.4486378451963268E-2},{"$f":"'Monthly Factors'!L26","v":0.10238016286421177},{"$f":"'Monthly Factors'!M26","v":0.21813987132793164},null,null,null,null,null,null,null,null,null,"Primary land uses",null,null,null,"Cgf-wC "]
[null,"Water Usage",{"$f":"'Monthly Factors'!B31","v":0.06},{"$f":"'Monthly Factors'!C31","v":6.5000000000000002E-2},{"$f":"'Monthly Factors'!D31","v":7.4999999999999997E-2},{"$f":"'Monthly Factors'!E31","v":0.08},{"$f":"'Monthly Factors'!F31","v":0.09},{"$f":"'Monthly Factors'!G31","v":0.1},{"$f":"'Monthly Factors'!H31","v":0.11},{"$f":"'Monthly Factors'!I31","v":0.115},{"$f":"'Monthly Factors'!J31","v":0.1},{"$f":"'Monthly Factors'!K31","v":0.08},{"$f":"'Monthly Factors'!L31","v":7.0000000000000007E-2},{"$f":"'Monthly Factors'!M31","v":5.5E-2},null,null,null,null,null,null,null,null,null,"Degree of development",null,null,null,"Extensive rural residential / agricultural development.  Very low impervious cover"]
[null,null,null,null,null,null,null,null,null,null,null,null,null,null,null,null,null,null,null,null,null,null,null,"Evapotranspiration potential",null,null,null,"High"]
[null,"Monthly Factors","Cold/Wet (1999)",null,null,null,null,null,null,null,null,null,null,null,null,null,null,null,null,null,null,null,null,"Relative environmental sensitivity",null,null,null,"Moderate  in terrestrial areas, high along Shawnigan  Creek corridor"]
[null,null,"Jan","Feb","Mar","Apr","May","Jun","Jul","Aug","Sep","Oct","Nov","Dec"]
[null,"Surplus Water",{"$f":"'Monthly Factors'!B21","v":0.28121118610350893},{"$f":"'Monthly Factors'!C21","v":0.28471061972718881},{"$f":"'Monthly Factors'!D21","v":0.1055893178084587},{"$f":"'Monthly Factors'!E21","v":-1.2670737757409583E-2},{"$f":"'Monthly Factors'!F21","v":-1.0294974427895285E-2},{"$f":"'Monthly Factors'!G21","v":-2.6925317734495361E-2},{"$f":"'Monthly Factors'!H21","v":-3.4844528832876351E-2},{"$f":"'Monthly Factors'!I21","v":-1.425457997708578E-2},{"$f":"'Monthly Factors'!J21","v":-6.3353688787047913E-3},{"$f":"'Monthly Factors'!K21","v":9.9861251950584262E-2},{"$f":"'Monthly Factors'!L21","v":0.16139352218500455},{"$f":"'Monthly Factors'!M21","v":0.17255960983372176},null,null,null,null,null,null,null,null,"Hydrogeology"]
[null,"Leakance/\nLateral Ground Water",{"$f":"'Monthly Factors'!B44","v":8.1000000000000003E-2},{"$f":"'Monthly Factors'!C44","v":7.8E-2},{"$f":"'Monthly Factors'!D44","v":8.6999999999999994E-2},{"$f":"'Monthly Factors'!E44","v":8.5999999999999993E-2},{"$f":"'Monthly Factors'!F44","v":0.09},{"$f":"'Monthly Factors'!G44","v":8.5999999999999993E-2},{"$f":"'Monthly Factors'!H44","v":8.6999999999999994E-2},{"$f":"'Monthly Factors'!I44","v":8.5000000000000006E-2},{"$f":"'Monthly Factors'!J44","v":8.1000000000000003E-2},{"$f":"'Monthly Factors'!K44","v":8.2000000000000003E-2},{"$f":"'Monthly Factors'!L44","v":7.8E-2},{"$f":"'Monthly Factors'!M44","v":7.9000000000000001E-2},null,null,null,null,null,null,null,null,null,"Groundwater occurrence (primary / secondary)",null,null,null,"Void infillings - bedrock fractures & faults"]
[null,"Surface Water",{"$f":"'Monthly Factors'!B26","v":0.22068086457424585},{"$f":"'Monthly Factors'!C26","v":0.19373952223030552},{"$f":"'Monthly Factors'!D26","v":0.13994869625957773},{"$f":"'Monthly Factors'!E26","v":6.7665632372012466E-2},{"$f":"'Monthly Factors'!F26","v":2.399263439717373E-2},{"$f":"'Monthly Factors'!G26","v":9.7313744914725147E-3},{"$f":"'Monthly Factors'!H26","v":5.7792933459831003E-3},{"$f":"'Monthly Factors'!I26","v":1.8772385441074731E-3},{"$f":"'Monthly Factors'!J26","v":1.5783311410150771E-3},{"$f":"'Monthly Factors'!K26","v":1.4486378451963268E-2},{"$f":"'Monthly Factors'!L26","v":0.10238016286421177},{"$f":"'Monthly Factors'!M26","v":0.21813987132793164},null,null,null,null,null,null,null,null,null,"Primary porosity",null,null,null,"Low to negligible"]
[null,"Water Usage",{"$f":"'Monthly Factors'!B31","v":0.06},{"$f":"'Monthly Factors'!C31","v":6.5000000000000002E-2},{"$f":"'Monthly Factors'!D31","v":7.4999999999999997E-2},{"$f":"'Monthly Factors'!E31","v":0.08},{"$f":"'Monthly Factors'!F31","v":0.09},{"$f":"'Monthly Factors'!G31","v":0.1},{"$f":"'Monthly Factors'!H31","v":0.11},{"$f":"'Monthly Factors'!I31","v":0.115},{"$f":"'Monthly Factors'!J31","v":0.1},{"$f":"'Monthly Factors'!K31","v":0.08},{"$f":"'Monthly Factors'!L31","v":7.0000000000000007E-2},{"$f":"'Monthly Factors'!M31","v":5.5E-2},null,null,null,null,null,null,null,null,null,"Secondary porosity",null,null,null,"Low to moderate in Sicker Volcanics  & Island Intrusives area; higher in fractue zones & faults, especially along SJF; low in Bonanza Volcanics areas due to ductile rock"]
[null,null,null,null,null,null,null,null,null,null,null,null,null,null,null,null,null,null,null,null,null,null,null,"Confinement",null,null,null,"                           Morainal blanket areas locally semi-confined by duric till blankets;                                                                                                                         WP = 0 - 62.5, avg 3.0 m                                                                                                                                                          "]
[null,null,null,null,null,null,null,null,null,null,null,null,null,null,null,null,null,null,null,null,null,null,null,"Aquifer thickness",null,null,null,"Bedrock aquifer / assume < 150 m"]
[null,null,null,null,null,null,null,null,null,null,null,null,null,null,null,null,null,null,null,null,null,null,null,"Hydraulic anisotropy",null,null,null,"High"]
[null,null,null,null,null,null,null,null,null,null,null,null,null,null,null,null,null,null,null,null,null,null,null,"Hydraulic gradient",null,null,null,"Low to moderate based on terrain"]
[null,"TABLE E-6",null,null,null,null,null,null,null,null,null,null,null,null,null,null,null,null,null,null,null,null,null,"Storage potential",null,null,null,"Low - secondary voids only"]
[null,"Groundwater Flow Components: Aquifer #0204, Cobble Hill (Bedrock)",null,null,null,null,null,null,null,null,null,null,null,null,null,null,null,null,null,null,null,null,null,"Yield potential",null,null,null,"Low-moderate; WP = 0.03 - 8.52 L/s / average 0.25 L/s"]
[null,null,null,null,null,null,null,null,null,null,null,null,null,null,null,null,null,null,null,null,null,null,null,"Flow velocities",null,null,null,"Low - moderate"]
[null,"Groundwater Flow","Direction of Flow","Source or Receptor of Water","Length (m)","Depth (m)","Area (m)","Hydraulic Conductivity (m/s) - K","Distance (m) - dL","Hydraulic Head (m) - dh",null,null,"GW Flow (m3/yr)",null,null,null,null,null,null,null,null,null,null,"Flow directions",null,null,null,"Generally south and southeast towards Shawnigan Creek and Mill Bay / Saanich Inlet.  East edge flow possible to east towards Saanich Inlet (i.e. east of surface water divide)"]
[null,null,null,null,null,null,null,null,null,"Year 1","Year 2","Year 3","Year 1","Year 2","Year 3",null,null,null,null,null,null,null,null,"Static water levels",null,null,null,"WP = variable 0 - 50.3 m bgs / avg 5.2 m bgs"]
[null,"QGW1","Out","Shawnigan Creek",{"$f":"1.5*345","v":517.5},80,{"$f":"E82*F82","v":41400},9.9999999999999995E-7,315,20,null,null,{"$f":"-(G82*H82*(J82/I82))*60*60*24*365","v":-82894.628571428562},null,null,null,null,null,null,null,null,null,null,"Hydraulic connection with surface waters",null,null,null,"Generally low to moderate due to deep overburden cover, high in areas where Shawnigan Creek is deeply incised"]
[null,"QGW2","Out","Shawnigan Creek",{"$f":"0.6*345","v":207},80,{"$f":"E83*F83","v":16560},5.0000000000000002E-5,345,40,null,null,{"$f":"-(G83*H83*(J83/I83))*60*60*24*365","v":-3027456.0000000005},null,null,null,null,null,null,null,null,null,null,"Hydraulic connection to adjacent AQ"]
[null,"QGW3","Out","Shawnigan Creek",{"$f":"5*345","v":1725},80,138000,1.0000000000000001E-9,255,40,null,null,-682.66164705882363,null,null,null,null,null,null,null,null,null,null,null,"Over / Under",null,null,"North 1/4 partly overlain by surficial AQ197"]
[null,"QGW4","In","Shawnigan Creek",{"$f":"0.5*345","v":172.5},80,13800,1E-8,"--","--",null,null,{"$f":"-'Bedrock 207'!M119","v":112.58351999999998},null,null,null,null,null,null,null,null,null,null,null,"Upgradient",null,null,"Upgradient contact to north with undeveloped extension of bedrock AQ204; upgradient contact to west with bedrock AQ202; cross-gradient? contacts along south border with bedrock AQ207, surficial AQ 205, & surficial AQ206 "]
[null,"QGW5","Out","Shawnigan Creek",{"$f":"0.5*345","v":172.5},80,13800,1.0000000000000001E-9,215,20,null,null,-40.483423255813953,null,null,null,null,null,null,null,null,null,null,null,"Downgradient",null,null,"None - discharge to marine"]
[null,"QGW6","In","Shawnigan Creek",{"$f":"0.7*345","v":241.49999999999997},80,19319.999999999996,9.9999999999999995E-8,"--","--",null,null,{"$f":"-'Bedrock 207'!M118","v":72.053452799999988},null,null,null,null,null,null,null,null,null,null,"Vulnerability to surface contamination",null,null,null,"Low-moderate due to deep overburden cover"]
[null,"QGW7","Out","Shawnigan Creek",{"$f":"0.5*345","v":172.5},20,3450,1.0000000000000001E-9,765,10,null,null,-1.4222117647058825,null,null,null,null,null,null,null,null,null,null,"Recharge"]
[null,"QGW8","Out","Shawnigan Creek",{"$f":"5.3*345","v":1828.5},20,36570,9.9999999999999995E-7,765,10,null,null,-15075.44470588235,null,null,null,null,null,null,null,null,null,null,null,"Vertical inflow",null,null,"Moderate recharge from Shawnigan Creek stream losses in deeply incised areas.  Limited recharge from precipitation / irrigation-sewerage return due to deep overburden cover.  Negligible recharge from snowmelt due to low elevation"]
[null,"QGW9","In","Shawnigan Creek",{"$f":"0.5*345","v":172.5},20,3450,1E-4,"--","--",null,null,{"$f":"-'Bedrock 207'!M116","v":500371.20000000001},null,null,null,null,null,null,null,null,null,null,null,"Lateral inflow",null,null,"Low - moderate lateral inflow from upgradient bedrock sources                                                                                                                          "]
[null,"QGW10","Out","Shawnigan Creek",{"$f":"3.5*3454","v":12089},20,241780,9.9999999999999995E-7,620,20,null,null,-245960.45419354833,null,null,null,null,null,null,null,null,null,null,null,"Temporal variability",null,null,"Low - moderate due to deep overburden cover"]
[null,"QGW11","In","Shawnigan Creek",{"$f":"0.5*345","v":172.5},20,3450,1E-4,"--","--",null,null,{"$f":"-'Bedrock 207'!M110","v":16564.012137931037},null,null,null,null,null,null,null,null,null,null,null,"MBR",null,null,"Moderate at west end of AQ only from Cobble Hill "]
[null,"QGW12","Out","Shawnigan Creek",{"$f":"3.4*345","v":1173},20,23460,9.9999999999999995E-7,150,20,"-","-",-98644.607999999993,null,null,null,null,null,null,null,null,null,null,"Discharge"]
[null,"QGW13","Out","Ocean",{"$f":"0.4*345","v":138},60,8280,1E-4,240,20,null,null,-2175984,null,null,null,null,null,null,null,null,null,null,null,"Evapotranspiration",null,null,"High"]
[null,"QGW14","Out","Ocean",{"$f":"4*345","v":1380},60,82800,9.9999999999999995E-7,315,40,null,null,-331578.51428571425,null,null,null,null,null,null,null,null,null,null,null,"Outflow to marine",null,null,"Low-moderate - may be below base of Saanich Inlet due to deep overburden cover"]
[null,"QGW15","Out","Ocean",{"$f":"4.8*345","v":1656},80,132480,9.9999999999999995E-7,260,40,null,null,-642752.19692307687,null,null,null,null,null,null,null,null,null,null,null,"Outflow to surface waters",null,null,"High to Shawnigan Creek & tributaries in deeply incised areas"]
[null,"QGW16","Out","Ocean",{"$f":"0.5*345","v":172.5},80,13800,1.0000000000000001E-5,360,40,null,null,-483552.00000000006,null,null,null,null,null,null,null,null,null,null,null,"Outflow to other AQ",null,null,"None"]
[null,"QGW17","Out","Ocean",{"$f":"1.8*345","v":621},80,49680,9.9999999999999995E-7,1090,80,null,null,-114987.77834862386,null,null,null,null,null,null,null,null,null,null,null,"Temporal variability",null,null,"Low - moderate due to deep overburden cover"]
[null,"QGW18","Out","Ocean",{"$f":"0.3*345","v":103.5},80,8280,1.0000000000000001E-5,105,20,null,null,-497367.77142857143]
[null,"QGW19","Out","Ocean",{"$f":"2.7*345","v":931.50000000000011},80,74520.000000000015,9.9999999999999995E-7,850,40,null,null,-110591.18682352944,null,null,null,null,null,null,null,null,null,"Groundwater Development"]
[null,"QGW20","Zero","Ocean",{"$f":"0.4*345","v":138},60,8280,1.0000000000000001E-5,1,0,null,null,0,null,null,null,null,null,null,null,null,null,null,null,"Nearest BCMOE Observation Wells; distance; completion / relevance",null,null,"Well #345 = within pocket created by AQ's northeast \"horn; Well #320 = 500 m east of north end of AQ;  both completed in surficial materials; irrelevant"]
[null,"QGW21","Out","Ocean",{"$f":"0.8*345","v":276},60,16560,9.9999999999999995E-7,205,40,null,null,-101899.73853658537,null,null,null,null,null,null,null,null,null,null,null,"Total Annual Water Use (m3/yr) as reported by Hatfield (2015)",null,null,null,"  SUMS"]
[null,"QGW22","Out","Ocean",{"$f":"0.2*345","v":69},60,4140,9.9999999999999995E-8,145,40,null,null,-3601.6286896551728,null,null,null,null,null,null,null,null,null,null,null,null,"Industrial",null,36500,"Total Commercial and Industrial"]
[null,"QGW22b","Out","Ocean",{"$f":"7.5*345","v":2587.5},60,155250,1.0000000000000001E-9,210,60,null,null,-1398.8468571428571,null,null,null,null,null,null,null,null,null,null,null,null,"Commercial",null,25550,{"$f":"AB103+AB104","v":62050}]
[null,"QGW23","Out","Ocean",{"$f":"4.5*345","v":1552.5},200,310500,1.0000000000000001E-9,455,60,null,null,{"$f":"-(G105*H104*(J105/I105))*60*60*24*365","v":-1291.2432527472529},null,null,null,null,null,null,null,null,null,null,null,null,"Domestic",null,263671,"Total Irrigation"]
[null,"QGW24","Out","Under AQ 197",{"$f":"0.5*345","v":172.5},200,34500,9.9999999999999995E-8,175,20,null,null,{"$f":"-(G106*H105*(J106/I106))*60*60*24*365","v":-124.3419428571429},null,null,null,null,null,null,null,null,null,null,null,null,"Irrigation from groundwater (Ministry of AGRICULTURE)",null,236911,{"$f":"AB106","v":236911}]
[null,"QGW25","In","Under AQ 197",{"$f":"4.4*345","v":1518.0000000000002},200,303600.00000000006,1.0000000000000001E-9,445,40,null,null,{"$f":"(G107*H106*(J107/I107))*60*60*24*365","v":86061.389662921356},null,null,null,null,null,null,null,null,null,null,null,null,"BCMOE Obs",null,0]
[null,"QGW26","Out","Under AQ 197",{"$f":"0.5*345","v":172.5},200,34500,9.9999999999999995E-8,215,20,null,null,{"$f":"-(G108*H107*(J108/I108))*60*60*24*365","v":-101.20855813953489},null,null,null,null,null,null,null,null,null,null,null,null,"Other",null,29200,"Total Domestic + Water Systems + Other"]
[null,"QGW27","In","Under AQ 197",{"$f":"5.4*345","v":1863.0000000000002},200,372600.00000000006,1.0000000000000001E-9,1345,6,null,null,{"$f":"(G109*H108*(J109/I109))*60*60*24*365","v":5241.7755836431234},null,null,null,null,null,null,null,null,null,null,null,null,"Water Supply Systems",null,16288,{"$f":"AB105+AB108+AB109","v":309159}]
[null,"QGW28","In","Under AQ 197",{"$f":"0.4*345","v":138},200,27600,9.9999999999999995E-8,145,40,null,null,{"$f":"(G110*H109*(J110/I110))*60*60*24*365","v":240.10857931034485}]
[null,"QGW29","In","Under AQ 197",{"$f":"1.8*345","v":621},200,124200,9.9999999999999995E-7,205,40,null,null,{"$f":"(G111*H110*(J111/I111))*60*60*24*365","v":76424.803902439031}]
[null,"QGW30","Zero","Under AQ 197",{"$f":"0.3*345","v":103.5},200,20700,1.0000000000000001E-5,1,0,null,null,{"$f":"(G112*H112*(J112/I112))*60*60*24*365","v":0}]
[null,"QGW31","Zero","Under AQ 197",{"$f":"1.5*345","v":517.5},200,103500,9.9999999999999995E-7,1,0,null,null,{"$f":"-(G113*H113*(J113/I113))*60*60*24*365","v":0}]
[null,"QGW32","Out","Under AQ 197",{"$f":"1.2*345","v":414},200,82800,5.0000000000000002E-5,515,20,"-","-",{"$f":"-(G114*H114*(J114/I114))*60*60*24*365","v":-5070253.9805825241}]
[null,"QGW33","In","Under AQ 197",{"$f":"3.5*345","v":1207.5},200,241500,9.9999999999999995E-7,505,20,"-","-",{"$f":"(G115*H115*(J115/I115))*60*60*24*365","v":301621.54455445544}]
[null,"QGW34","Zero","Under AQ 197",{"$f":"0.5*345","v":172.5},200,34500,1.0000000000000001E-5,1,0,"-","-",{"$f":"-(G116*H116*(J116/I116))*60*60*24*365","v":0}]
[null,"QGW35","In","Under AQ 197",{"$f":"2*345","v":690},200,138000,9.9999999999999995E-7,845,40,"-","-",{"$f":"(G117*H117*(J117/I117))*60*60*24*365","v":206010.31952662722}]
[null,"QGW36","In","Under AQ 197",{"$f":"0.3*345","v":103.5},200,20700,1.0000000000000001E-5,845,40,null,null,309015.47928994085]
[null,"QGW37","In","Under AQ 197",{"$f":"0.7*345","v":241.49999999999997},200,48299.999999999993,9.9999999999999995E-7,845,40,null,null,72103.611834319498]
[null,"QGW38","In","Under AQ 197",{"$f":"0.2*345","v":69},200,13800,1.0000000000000001E-5,845,40,null,null,206010.31952662722]
[null,"QGW39","In","Under AQ 197",{"$f":"1.9*345","v":655.5},200,131100,9.9999999999999995E-7,185,20,null,null,446958.87567567569]
[null,"QGW40","In","Under AQ 197",{"$f":"0.3*345","v":103.5},200,20700,1.0000000000000001E-5,185,20,null,null,705724.54054054071]
[null,"QGW41","In","Under AQ 197",{"$f":"1*345","v":345},200,69000,9.9999999999999995E-7,185,20,null,null,235241.51351351352]
[null,"QGW42","In","Under AQ 197",{"$f":"0.3*345","v":103.5},200,20700,1.0000000000000001E-5,185,20,null,null,705724.54054054071]
[null,"QGW43","In","Under AQ 197",{"$f":"0.9*345","v":310.5},200,62100,9.9999999999999995E-7,185,20,null,null,211717.36216216214]
[null,"QGW44","In","Under AQ 197",{"$f":"0.4*345","v":138},200,27600,1E-4,1010,20,null,null,1723551.6831683167]
[null,"QGW45 & 47","In","AQ 202 (QGW30)",{"$f":"'Bedrock 202'!E111","v":1285.2},{"$f":"'Bedrock 202'!F111","v":200},{"$f":"'Bedrock 202'!G111","v":257040},{"$f":"'Bedrock 202'!H111","v":9.9999999999999995E-7},{"$f":"'Bedrock 202'!I111","v":525},{"$f":"'Bedrock 202'!J111","v":140},{"$f":"'Bedrock 202'!K111","v":0},{"$f":"'Bedrock 202'!L111","v":0},{"$f":"-'Bedrock 202'!M111","v":2161603.5840000003}]
[null,"QGW46","Zero","N/A",{"$f":"0.4*345","v":138},200,27600,1.0000000000000001E-5,1,0,null,null,{"$f":"-(G128*H128*(J128/I128))*60*60*24*365","v":0}]
[null,"QGW48","In","AQ 202 (QGW31)",{"$f":"'Bedrock 202'!E112","v":178.5},{"$f":"'Bedrock 202'!F112","v":200},{"$f":"'Bedrock 202'!G112","v":35700},{"$f":"'Bedrock 202'!H112","v":1.0000000000000001E-5},{"$f":"'Bedrock 202'!I112","v":150},{"$f":"'Bedrock 202'!J112","v":20},{"$f":"'Bedrock 202'!K112","v":0},{"$f":"'Bedrock 202'!L112","v":0},{"$f":"-'Bedrock 202'!M112","v":1501113.6},{"$f":"'Bedrock 202'!N112","v":0},{"$f":"'Bedrock 202'!O112","v":0}]
[null,"QGW49","In","AQ 202 (QGW32)",{"$f":"'Bedrock 202'!E113","v":821.09999999999991},{"$f":"'Bedrock 202'!F113","v":200},{"$f":"'Bedrock 202'!G113","v":164219.99999999997},{"$f":"'Bedrock 202'!H113","v":9.9999999999999995E-7},{"$f":"'Bedrock 202'!I113","v":555},{"$f":"'Bedrock 202'!J113","v":80},{"$f":"'Bedrock 202'!K113","v":"-"},{"$f":"'Bedrock 202'!L113","v":"-"},{"$f":"-'Bedrock 202'!M113","v":746499.736216216}]
[null,"QGW50","In","AQ 197",{"$f":"'Surficial AQ 197'!E92","v":750},{"$f":"'Surficial AQ 197'!F92","v":10},{"$f":"'Surficial AQ 197'!G92","v":7500},{"$f":"'Surficial AQ 197'!H92","v":1.0000000000000001E-5},{"$f":"'Surficial AQ 197'!I92","v":680},{"$f":"'Surficial AQ 197'!J92","v":10},null,null,{"$f":"-'Surficial AQ 197'!M92","v":34782.352941176476}]
[null,"QGW51","In","AQ 197",{"$f":"'Surficial AQ 197'!E93","v":625},{"$f":"'Surficial AQ 197'!F93","v":10},{"$f":"'Surficial AQ 197'!G93","v":6250},{"$f":"'Surficial AQ 197'!H93","v":1.0000000000000001E-5},{"$f":"'Surficial AQ 197'!I93","v":600},{"$f":"'Surficial AQ 197'!J93","v":5},null,null,{"$f":"-'Surficial AQ 197'!M93","v":16425}]
[null,"QGW52","In","AQ 197",{"$f":"'Surficial AQ 197'!E94","v":150},{"$f":"'Surficial AQ 197'!F94","v":10},{"$f":"'Surficial AQ 197'!G94","v":1500},{"$f":"'Surficial AQ 197'!H94","v":9.9999999999999995E-7},{"$f":"'Surficial AQ 197'!I94","v":600},{"$f":"'Surficial AQ 197'!J94","v":5},null,null,{"$f":"-'Surficial AQ 197'!M94","v":394.20000000000005}]
[null,"QGW53","In","AQ 197",{"$f":"'Surficial AQ 197'!E95","v":750},{"$f":"'Surficial AQ 197'!F95","v":10},{"$f":"'Surficial AQ 197'!G95","v":7500},{"$f":"'Surficial AQ 197'!H95","v":1E-4},{"$f":"'Surficial AQ 197'!I95","v":1500},{"$f":"'Surficial AQ 197'!J95","v":40},null,null,{"$f":"-'Surficial AQ 197'!M95","v":630720}]
[null,"QGW54","In","Leakage from AQ 197","Leakance Factor (m/yr) = ",{"$f":"'Surficial AQ 197'!T10","v":0.3},{"$f":"'Surficial AQ 197'!S10","v":5126385.7206700006},"--","--","--",null,null,{"$f":"F135*G135","v":1537915.7162010001}]
[null,"Total",null,null,null,null,null,null,null,null,null,null,{"$f":"SUM(M82:M135)","v":-568018.23245194671}]
[]
[null,"Surface Water Contributions","Cold Water Creek?","Observed Vertical Gradient","Percent Permeable","Length (m)","Width (m)","Flux (m/s)","SW Flow (m3/yr)",null,null,"Comment"]
[null,null,null,null,null,null,null,null,"Year 1","Year 2","Year 3"]
[null,"Nott Creek","Unknown","Downward",0.1,870,2,3.0000000000000001E-5,{"$f":"(E140*F140*G140)*(H140*60*60*24*365)","v":164617.92000000001}]
[null,"Eddy Kilman Creek","Unknown","Downward",0.1,3700,2,3.0000000000000001E-5,{"$f":"(E141*F141*G141)*(H141*60*60*24*365)","v":700099.20000000007}]
[null,"Prellwire Creek","Unknown","Downward",0.1,600,2,3.0000000000000001E-5,{"$f":"(E142*F142*G142)*(H142*60*60*24*365)","v":113529.60000000001}]
[null,"Total",null,null,null,null,null,null,{"$f":"SUM(I140:I142)","v":978246.72000000009},{"$f":"SUM(J140:J142)","v":0},{"$f":"SUM(K140:K142)","v":0}]
[]
[null,"Water Well Usage","Water Well Usage Volume (m3/yr)",null,null,null,null,null,null,null,null,"Comments"]
[null,null,"Year 1",null,null,"Year 2",null,null,"Year 3"]
[null,null,"Total Volume Removed","Adjustment Factor","Adjusted Volume Removed","Total Volume Removed","Adjustment Factor","Adjusted Volume Removed","Total Volume Removed","Adjustment Factor","Adjusted Volume Removed"]
[null,"Industrial",{"$f":"AB103","v":36500},1,{"$f":"C148*D148","v":36500},null,null,null,null,null,null,"Assuming 100% consumptive"]
[null,"Commercial",25550,1,25550,null,null,null,null,null,null,"Assuming 100% consumptive"]
[null,"Domestic",263671,1,263671,null,null,null,null,null,null,"Assuming 100% consumptive"]
[null,"Irrigation",236911,1,236911,null,null,null,null,null,null,"Assuming 100% consumptive"]
[null,"BCMOE Obs",0,1,0,null,null,null,null,null,null,"Assuming 100% consumptive"]
[null,"Other",29200,1,29200]
[null,"Water Supply Systems",16288,1,16288]
[null,"Total",null,null,{"$f":"-SUM(E148:E154)","v":-608120},null,null,{"$f":"-SUM(H148:H154)","v":0},null,null,{"$f":"-SUM(K148:K154)","v":0}]

{"sheet":"Bedrock 207","index":11,"n_rows":147,"n_cols":29,"rows_kept":147,"cut":false,"hidden":false,"merged":[[4,2,4,4],[3,2,3,4],[2,2,2,4],[1,2,1,4],[128,6,129,6],[128,7,129,7],[128,8,128,10],[128,11,129,11],[136,1,138,1],[136,2,136,10],[137,2,137,4],[137,5,137,7],[137,8,137,10],[128,1,129,1],[128,2,129,2],[128,3,129,3],[128,4,129,4],[128,5,129,5],[51,17,51,19],[6,16,6,20],[21,16,21,20],[36,16,36,20],[79,1,80,1],[79,2,80,2],[79,3,80,3],[79,4,80,4],[79,5,80,5],[79,6,80,6],[79,7,80,7],[79,8,80,8],[79,9,79,11],[79,12,79,14]]}
[null,"CHM Aquifer Criteria: Aquifer #0207, Bamberton (Bedrock)",null,null,null,null,null,null,null,null,null,null,null,null,null,null,null,null,null,null,null,null,"TABLE F-1"]
[null,"AQ tag","207 Bamberton",null,null,null,null,null,null,null,null,null,null,null,null,null,null,null,null,null,null,null,"CHM Aquifer Criteria: Aquifer #0207, Bamberton (Bedrock)"]
[null,"Perimeter (km)",38.03]
[null,"Area (km2)","25.1  (probably larger since bedrock zone below surficial AQ205 has not been defined as part of AQ 207)",null,null,null,null,null,null,null,null,null,null,null,null,null,null,null,null,null,null,null,"BCMOE Criteria"]
[null,"Aquifer materials","Bedrock / Bonanza Group & Lower to Middle Island Intrusions",null,null,null,null,null,null,null,null,null,null,null,null,null,null,null,null,null,null,null,null,"AQ tag",null,null,null,"207 Bamberton"]
[null,"Table F-4 Monthly  Summary of AQ207 Water Budgets",null,null,null,null,null,null,null,null,null,null,null,null,null,null,"Table F-3 Annual Summary of AQ207 Water Budgets",null,null,null,null,null,null,"AQ classification",null,null,null,"IIB (12)"]
[null,"Monthly Gains and Loses (m3)","Average Year",null,null,null,null,null,null,null,null,null,null,null,null,null,"Summary - 30 Year Average",null,null,null,null,null,null,"AQ type",null,null,null,"BCMOE Classsification = 6b (SLR Classification = 6a / 6b)"]
[null,"Source","Jan","Feb","Mar","Apr","May","Jun","Jul","Aug","Sep","Oct","Nov","Dec","Total",null,"Gains and Losses","Source","Area (m2)","Infiltration Rate","Q (m3/yr)",null,null,"Location",null,null,null,"Mill Bay / Shawnigan Lake"]
[{"$f":"$C$7&B9","v":"Average YearDirect Recharge to 207"},"Direct Recharge to 207",{"$f":"C55*$U$9","v":2427822.7007789486},1581390.2176538943,1141243.5734840673,274070.82054300263,-329895.9033240694,-520220.4629341095,-507532.15896010684,-228389.47153204808,-76129.82384401602,834675.86735342897,2560974.7570168604,2496577.1531269532,{"$f":"SUM(C9:N9)","v":9654587.2693628054},null,"Gain","Direct Recharge to 207",{"$f":"2253.00408525*10000","v":22530040.852500003},{"$f":"U9/S9","v":0.42852062863842977},{"$f":"S58","v":9654587.2693628054},null,null,"Perimeter (km)",null,null,null,38.03]
[{"$f":"$C$7&B10","v":"Average YearLeakage down from 205"},"Leakage down from 205",{"$f":"C56*$U$10","v":44204.803841916008},42567.588884808007,47479.233756132002,46933.495437096004,49116.448713240003,46933.495437096004,47479.233756132002,46387.757118060006,44204.803841916008,44750.542160952005,42567.588884808007,43113.327203844005,{"$f":"SUM(C10:N10)","v":545738.31903600006},null,"Gain","Leakage down from 205",{"$f":"H125","v":2728691.5951800002},{"$f":"G125","v":0.2},{"$f":"M125","v":545738.31903600006},null,null,"Area (km2)",null,null,null,"25.1  (probably larger since bedrock zone below surficial AQ205 has not been defined as part of AQ 207)"]
["Average YearLeakage down from 206","Leakage down from 206",{"$f":"C56*$U$11","v":62536.311195353999},60220.151521451997,67168.630543157997,66396.577318523996,69484.790217059999,66396.577318523996,67168.630543157997,65624.52409389001,62536.311195353999,63308.364419988,60220.151521451997,60992.204746085998,772053.22463399998,null,"Gain","Leakage down from 206",{"$f":"H126","v":2573510.74878},{"$f":"G126","v":0.3},{"$f":"M126","v":772053.22463399998},null,null,"Aquifer materials",null,null,null,"Bedrock / Bonanza Group & Lower to Middle Island Intrusions"]
["Average YearLateral Groundwater","Lateral Groundwater",{"$f":"C56*$U$12","v":-767521.344247845},-739094.62779422116,-824374.77715509268,-814899.20500388474,-852801.49360871664,-814899.20500388474,-824374.77715509268,-805423.63285267691,-767521.344247845,-776996.91639905295,-739094.62779422116,-748570.19994542911,-9475572.1512079649,null,"Loss","Lateral Groundwater","--","--",{"$f":"SUMIF(M82:M124, \"<0\")","v":-9475572.151207963},null,null,"Productivity",null,null,null,"Moderate"]
["Average YearLateral Groundwater","Lateral Groundwater",{"$f":"C57*$U$13","v":6735.8737823899464},5913.5393135312524,4271.6741926547493,2065.3678330598086,732.33063192036411,297.03214381632353,176.40220236155139,57.299222191016803,48.175628517697,442.16981388310978,3124.9644422244014,6658.3146799181532,30523.14388646837,null,"Gain","Lateral Groundwater","--","--",{"$f":"SUMIF(M82:M124, \">0\")","v":30523.14388646837},null,null,"Vulnerability",null,null,null,"Moderate"]
["Average YearSurface Water","Surface Water",{"$f":"C57*$U$14","v":0},0,0,0,0,0,0,0,0,0,0,0,0,null,"Loss","Surface Water","--","--",{"$f":"SUMIF(I131:I134, \"<0\")","v":0},null,null,"Demand",null,null,null,"Moderate"]
["Average YearSurface Water","Surface Water",{"$f":"C57*$U$15","v":395850.20246773917},347523.69331536361,251035.44820856745,121376.42439567771,43037.212139706528,17455.825044779835,10366.709617263545,3367.3298280702402,2831.1593890903678,25985.197467380145,183646.22721895931,391292.25090740249,1793767.6800000004,null,"Gain","Surface Water","--","--",{"$f":"SUMIF(I131:I134, \">0\")","v":1793767.6800000002},null,null,"Use",null,null,null,"Multiple"]
["Average YearWater Supply Systems","Water Supply Systems",{"$f":"C58*$U$16","v":-24783.42},-26848.705000000002,-30979.274999999998,-33044.559999999998,-37175.129999999997,-41305.700000000004,-45436.27,-47501.555,-41305.700000000004,-33044.559999999998,-28913.99,-22718.134999999998,-413057,null,"Loss","Water Usage","--","--",{"$f":"E147","v":-413057}]
["Average YearNet Gain","Net Gain",{"$f":"SUMIF(C9:C16, \">0\")","v":2937149.8920663474},{"$f":"SUMIF(D9:D16, \">0\")","v":2037615.1906890492},1511198.5601845793,510842.68552736012,162370.7817019269,131082.92994421616,125190.9761189151,{"$f":"SUMIF(J9:J16, \">0\")","v":115436.91026221127},109620.45005487808,969162.1412156322,2850533.689084304,{"$f":"SUMIF(N9:N16, \">0\")","v":2998633.2506642044},14458837.457513625,null,"Net Gain",null,null,null,{"$f":"SUMIF(U9:U16, \">0\")","v":12796669.636919271},null,"Location"]
["Average YearNet Loss","Net Loss",{"$f":"SUMIF(C9:C16, \"<0\")","v":-792304.76424784504},{"$f":"SUMIF(D9:D16, \"<0\")","v":-765943.33279422112},-855354.05215509271,-847943.76500388468,-1219872.526932786,-1376425.3679379942,-1377343.2061151995,{"$f":"SUMIF(J9:J16, \"<0\")","v":-1081314.6593847249},-884956.86809186102,-810041.47639905289,-768008.61779422115,{"$f":"SUMIF(N9:N16, \"<0\")","v":-771288.33494542912},-11550796.971802313,null,"Net Loss",null,null,null,{"$f":"SUMIF(U9:U16, \"<0\")","v":-9888629.151207963},null,null,"NTS 50000",null,null,null,"092B/12"]
["Average YearNet Total (Gain - Loss)","Net Total (Gain - Loss)",{"$f":"SUM(C17:C18)","v":2144845.1278185025},{"$f":"SUM(D17:D18)","v":1271671.8578948281},655844.50802948663,-337101.07947652455,-1057501.7452308591,-1245342.4379937779,-1252152.2299962845,-965877.74912251369,-775336.41803698288,159120.66481657932,2082525.0712900828,2227344.9157187752,2908040.4857113119,null,"Net Total (Gain - Loss)",null,null,null,{"$f":"SUM(U17:U18)","v":2908040.4857113082},null,null,"TRIM 20000",null,null,null,"Straddles 092B.062 & 092B.063"]
[null,null,null,null,null,null,null,null,null,null,null,null,null,null,null,null,null,null,null,null,null,null,null,"Lat / Long (Centre)",null,null,null,"48o38'20\" / 123o34'43\""]
[null,null,null,null,null,null,null,null,null,null,null,null,null,null,null,null,null,null,null,null,null,null,null,"UTM Zone 10 (Centre)",null,null,null,"457397E / 5387490N"]
[null,"Monthly Gains and Loses (m3)","Hot/Dry (1989)",null,null,null,null,null,null,null,null,null,null,null,null,null,"Summary - Hot/Dry (1989)"]
[null,"Source","Jan","Feb","Mar","Apr","May","Jun","Jul","Aug","Sep","Oct","Nov","Dec","Total",null,"Gains and Losses","Source","Area (m2)","Infiltration Rate","Q (m3/yr)",null,"Climate"]
[{"$f":"$C$22&B24","v":"Hot/Dry (1989)Direct Recharge to 207"},"Direct Recharge to 207",{"$f":"C62*$U$24","v":1991415.4306835243},{"$f":"D62*$U$24","v":1141947.3576602403},1775619.5253161527,106581.75338162243,-418714.03114208812,-532908.7669081121,-456778.94306409609,-190324.55961004004,-126883.03974002668,323551.75133706804,1270099.227797667,1611414.604698339,{"$f":"SUM(C24:N24)","v":6495020.3104102518},null,"Gain","Direct Recharge to 207",{"$f":"2253.00408525*10000","v":22530040.852500003},{"$f":"U24/S24","v":0.28828266903428817},{"$f":"R58","v":6495020.31041025},null,null,"Nearest active EC weather station / distance / elevation",null,null,null,"AQ Contains EEC1015136 Mill Bay SW1  at its north end                                                                                                                                                            EC1017230 Shawnigan Lake adjacent to AQ's northwest side                                                                                                                                EC104820 Malahat  2.2 km to the south"]
[{"$f":"$C$22&B25","v":"Hot/Dry (1989)Leakage down from 205"},"Leakage down from 205",{"$f":"C63*$U$25","v":44750.542160952005},{"$f":"D63*$U$25","v":41476.112246736004},45842.018799024008,45296.28047998801,47479.233756132002,45842.018799024008,47479.233756132002,46933.495437096004,44750.542160952005,46387.757118060006,44204.803841916008,45296.28047998801,{"$f":"SUM(C25:N25)","v":545738.31903600006},null,"Gain","Leakage down from 205",{"$f":"H140","v":0},{"$f":"G140","v":0},{"$f":"M125","v":545738.31903600006},null,null,"IDF Curve",null,null,null,"Unknown"]
["Hot/Dry (1989)Leakage down from 206","Leakage down from 206",{"$f":"C63*$U$26","v":63308.364419988},{"$f":"D63*$U$26","v":58676.045072183995},64852.470869256002,64080.417644622001,67168.630543157997,64852.470869256002,67168.630543157997,66396.577318523996,63308.364419988,65624.52409389001,62536.311195353999,64080.417644622001,772053.22463399998,null,"Gain","Leakage down from 206",{"$f":"H141","v":0},{"$f":"G141","v":0},{"$f":"M126","v":772053.22463399998}]
["Hot/Dry (1989)Lateral Groundwater","Lateral Groundwater",{"$f":"C63*$U$27","v":-776996.91639905295},{"$f":"D63*$U$27","v":-720143.48349180515},-795948.06070146896,-786472.48855026101,-824374.77715509268,-795948.06070146896,-824374.77715509268,-814899.20500388474,-776996.91639905295,-805423.63285267691,-767521.344247845,-786472.48855026101,-9475572.1512079649,null,"Loss","Lateral Groundwater","--","--",{"$f":"SUMIF(M82:M124, \"<0\")","v":-9475572.151207963},null,"Physiography"]
["Hot/Dry (1989)Lateral Groundwater","Lateral Groundwater",{"$f":"C63*$U$28","v":2502.8977986904065},{"$f":"D63*$U$28","v":2319.7589353715962},2563.9440864633434,2533.4209425768749,2655.5135181227479,2563.9440864633434,2655.5135181227479,2624.9903742362794,2502.8977986904065,2594.4672303498114,2472.374654803938,2533.4209425768749,30523.143886468373,null,"Gain","Lateral Groundwater","--","--",{"$f":"SUMIF(M82:M124, \">0\")","v":30523.14388646837},null,null,"Physiographic zone",null,null,null,"Canadian Cordillera / Western System / Outer Mountain Area / Insular Mountains / Vancouver Island Ranges"]
["Hot/Dry (1989)Surface Water","Surface Water",{"$f":"C64*$U$29","v":0},{"$f":"D64*$U$29","v":0},0,0,0,0,0,0,0,0,0,0,0,null,"Loss","Surface Water","--","--",{"$f":"SUMIF(I131:I134, \"<0\")","v":0},null,null,"Elevation range (m amsl)",null,null,null,"0 - 360 m amsl"]
["Hot/Dry (1989)Surface Water","Surface Water",{"$f":"C64*$U$30","v":395850.20246773917},{"$f":"D64*$U$30","v":347523.69331536361},251035.44820856745,121376.42439567771,43037.212139706528,17455.825044779835,10366.709617263545,3367.3298280702402,2831.1593890903678,25985.197467380145,183646.22721895931,391292.25090740249,1793767.6800000004,null,"Gain","Surface Water","--","--",{"$f":"SUMIF(I131:I134, \">0\")","v":1793767.6800000002},null,null,"Distance to marine",null,null,null,"Abuts Mill Bay and Saanich Inlet along east edge"]
["Hot/Dry (1989)Water Supply Systems","Water Supply Systems",{"$f":"$U$31*C65","v":-24783.42},{"$f":"$U$31*D65","v":-26848.705000000002},-30979.274999999998,-33044.559999999998,-37175.129999999997,-41305.700000000004,-45436.27,-47501.555,-41305.700000000004,-33044.559999999998,-28913.99,-22718.134999999998,-413057,null,"Loss","Water Usage","--","--",{"$f":"E147","v":-413057},null,null,"Geomorphological setting",null,null,null,"Northeast-facing flank of Malahat Ridge, containing  several NW-trending, elongated hills.  Large morainal blanket with subordinate colluvial component in steeper areas.  North end of AQ adjacent to Mill Bay = glaciofluvial outwash fan?"]
["Hot/Dry (1989)Net Gain","Net Gain",{"$f":"SUMIF(C24:C31, \">0\")","v":2497827.4375308938},{"$f":"SUMIF(D24:D31, \">0\")","v":1591942.9672298953},2139913.4072794635,339868.29684448702,160340.58995711929,130714.25879952317,127670.0874346763,{"$f":"SUMIF(J24:J31, \">0\")","v":119322.39295792652},{"$f":"SUMIF(K24:K31, \">0\")","v":113392.96376872077},{"$f":"SUMIF(L24:L31, \">0\")","v":464143.69724674802},{"$f":"SUMIF(M24:M31, \">0\")","v":1562958.9447087001},{"$f":"SUMIF(N24:N31, \">0\")","v":2114616.9746729285},11362712.018431082,null,"Net Gain",null,null,null,{"$f":"SUMIF(U24:U31, \">0\")","v":9637102.6779667195},null,null,"Topography",null,null,null,"Broad, northwest-trending sidehill containing elongated domes, bisected by a northeast-trending, V- to U-shaped valley lineament running from the south side of Old Baldy Mountain towards Mill Bay (Shawnigan Lake Fault trace)"]
["Hot/Dry (1989)Net Loss","Net Loss",{"$f":"SUMIF(C24:C31, \"<0\")","v":-801780.33639905299},{"$f":"SUMIF(D24:D31, \"<0\")","v":-746992.18849180511},-826927.33570146898,-819517.04855026095,-1280263.9382971807,-1370162.5276095809,-1326589.9902191889,{"$f":"SUMIF(J24:J31, \"<0\")","v":-1052725.3196139247},{"$f":"SUMIF(K24:K31, \"<0\")","v":-945185.6561390796},{"$f":"SUMIF(L24:L31, \"<0\")","v":-838468.19285267685},{"$f":"SUMIF(M24:M31, \"<0\")","v":-796435.33424784499},{"$f":"SUMIF(N24:N31, \"<0\")","v":-809190.62355026102},-11614238.491672326,null,"Net Loss",null,null,null,{"$f":"SUMIF(U24:U31, \"<0\")","v":-9888629.151207963},null,null,"Terrain",null,null,null,"Undulating to hummocky at higher elevations; undulating at lower elevations.  Common short ravines at southeast corner into Saanich Inlet"]
["Hot/Dry (1989)Net Total (Gain - Loss)","Net Total (Gain - Loss)",{"$f":"SUM(C32:C33)","v":1696047.1011318408},{"$f":"SUM(D32:D33)","v":844950.77873809019},1312986.0715779946,-479648.75170577393,-1119923.3483400615,-1239448.2688100578,-1198919.9027845126,-933402.92665599822,-831792.69237035885,-374324.49560592882,766523.61046085507,1305426.3511226675,-251526.47324124398,null,"Net Total (Gain - Loss)",null,null,null,{"$f":"SUM(U32:U33)","v":-251526.47324124351},null,null,"Aspect",null,null,null,"Overall slope towards the northeast and Saanich Inlet / Mill Bay.  Local areas in southeast protion with elongated hills have radial aspects.  "]
[null,null,null,null,null,null,null,null,null,null,null,null,null,null,null,null,null,null,null,null,null,null,null,"Slope",null,null,null,"Generally variably moderate to steep (convex  & radial), apart from around Mill Bay area (low to moderate concave)"]
[null,null,null,null,null,null,null,null,null,null,null,null,null,null,null,null,null,null,null,null,null,null,null,"XS max grade (m/m)",null,null,null,"0.066 ENE from Old Baldy Mopuntain towards Mill Bay"]
[null,"Monthly Gains and Loses (m3)","Cold/Wet (1999)",null,null,null,null,null,null,null,null,null,null,null,null,null,"Summary - Wet/Cold (1999)",null,null,null,null,null,null,"Roughness coefficient",null,null,null,"0.60 (generally coniferous cover with extensive logged areas)"]
[null,"Source","Jan","Feb","Mar","Apr","May","Jun","Jul","Aug","Sep","Oct","Nov","Dec","Total",null,"Gains and Losses","Source","Area (m2)","Infiltration Rate","Q (m3/yr)"]
[{"$f":"$C$37&B39","v":"Cold/Wet (1999)Direct Recharge to 207"},"Direct Recharge to 207",{"$f":"C69*$U$39","v":4505616.7411683472},{"$f":"D69*$U$39","v":4561685.3027996616},1691771.2435209574,-203012.8635840427,-164947.95166203467,-431402.33511609072,-558285.37485611741,-228389.47153204802,-101506.43179202135,1599995.1311217363,2585876.3499017437,2764781.4359351816,{"$f":"SUM(C39:N39)","v":16022181.775905274},null,"Gain","Direct Recharge to 207",{"$f":"2253.00408525*10000","v":22530040.852500003},{"$f":"U39/S39","v":0.71114747997127603},{"$f":"T58","v":16022181.775905276},null,"Geology"]
[{"$f":"$C$37&B40","v":"Cold/Wet (1999)Leakage down from 205"},"Leakage down from 205",{"$f":"C70*$U$40","v":44204.803841916008},{"$f":"D70*$U$40","v":42567.588884808007},47479.233756132002,46933.495437096004,49116.448713240003,46933.495437096004,47479.233756132002,46387.757118060006,44204.803841916008,44750.542160952005,42567.588884808007,43113.327203844005,{"$f":"SUM(C40:N40)","v":545738.31903600006},null,"Gain","Leakage down from 205",{"$f":"H178","v":0},{"$f":"G178","v":0},{"$f":"M125","v":545738.31903600006},null,null,"Terrane",null,null,null,"Wrangellia"]
["Cold/Wet (1999)Leakage down from 206","Leakage down from 206",{"$f":"C70*$U$41","v":62536.311195353999},{"$f":"D70*$U$41","v":60220.151521451997},67168.630543157997,66396.577318523996,69484.790217059999,66396.577318523996,67168.630543157997,65624.52409389001,62536.311195353999,63308.364419988,60220.151521451997,60992.204746085998,772053.22463399998,null,"Gain","Leakage down from 206",{"$f":"H179","v":0},{"$f":"G179","v":0},{"$f":"M126","v":772053.22463399998},null,null,"Bedrock (type ; age ; formation ; lithology)",null,null,null,"                                                                                                                                                                                                                                                                                                                                                      "]
["Cold/Wet (1999)Lateral Groundwater","Lateral Groundwater",{"$f":"C70*$U$42","v":-767521.344247845},{"$f":"D70*$U$42","v":-739094.62779422116},-824374.77715509268,-814899.20500388474,-852801.49360871664,-814899.20500388474,-824374.77715509268,-805423.63285267691,-767521.344247845,-776996.91639905295,-739094.62779422116,-748570.19994542911,-9475572.1512079649,null,"Loss","Lateral Groundwater","--","--",{"$f":"SUMIF(M82:M124, \"<0\")","v":-9475572.151207963},null,null,null,"Primary",null,null,"Southwest half = Jurassic Bonanza Group Volcanics (IJBca); basaltic-andesitic (60%) - suspected more lithologies present than identified by BCGS - (limestone?)"]
["Cold/Wet (1999)Lateral Groundwater","Lateral Groundwater",{"$f":"C70*$U$43","v":2472.374654803938},{"$f":"D70*$U$43","v":2380.8052231445326},2655.5135181227479,2624.9903742362794,2747.0829497821533,2624.9903742362794,2655.5135181227479,2594.4672303498114,2472.374654803938,2502.8977986904065,2380.8052231445326,2411.3283670310011,30523.14388646837,null,"Gain","Lateral Groundwater","--","--",{"$f":"SUMIF(M82:M124, \">0\")","v":30523.14388646837},null,null,null,"Secondary",null,null,"East / southeast 2/3 = Early to Middle Jurassic Island Plutonic Suite (EMJIgd); granodioritic intrusive rocks (40%)       "]
["Cold/Wet (1999)Surface Water","Surface Water",{"$f":"C71*$U$44","v":0},{"$f":"D71*$U$44","v":0},0,0,0,0,0,0,0,0,0,0,0,null,"Loss","Surface Water","--","--",{"$f":"SUMIF(I131:I134, \"<0\")","v":0},null,null,"Structure",null,null,null,"Northeast-trending Shawnigan Fault bisects AQ, only mapped 1/2 across AQ but suspected to reach Mill Bay shoreline;                                                                                                                                         Assumed fracture zones along Bonanza Group / Island Intrusions contact zone due to rock competency contrasts; possible NNW-trending fault zone west of surficial AQ 205 (strong lineament) within Bonanza Volcanics"]
["Cold/Wet (1999)Surface Water","Surface Water",{"$f":"C71*$U$45","v":395850.20246773917},{"$f":"D71*$U$45","v":347523.69331536361},251035.44820856745,121376.42439567771,43037.212139706528,17455.825044779835,10366.709617263545,3367.3298280702402,2831.1593890903678,25985.197467380145,183646.22721895931,391292.25090740249,1793767.6800000004,null,"Gain","Surface Water","--","--",{"$f":"SUMIF(I131:I134, \">0\")","v":1793767.6800000002},null,null,"Surficial (formation; lithology; thickness)",null,null,null,"Primarily Vashon Drift morainal; silt-sand; generally shallow to moderately deep blankets and veneers (> 10 m).  Local colluvial veneers on steeper slopes at  mid-elevations.  Capilano Formation glaciofluvial blankets adjacent to Mill Bay.  Capilano glaciolacustrine blanket in northwest corner (northeast of Old Baldy Mountain).  Salish Formation fluvial blankets and veneers along Handysen and Hollings Creeks"]
["Cold/Wet (1999)Water Supply Systems","Water Supply Systems",{"$f":"$U$46*C72","v":-24783.42},{"$f":"$U$46*D72","v":-26848.705000000002},-30979.274999999998,-33044.559999999998,-37175.129999999997,-41305.700000000004,-45436.27,-47501.555,-41305.700000000004,-33044.559999999998,-28913.99,-22718.134999999998,-413057,null,"Loss","Water Usage","--","--",{"$f":"E147","v":-413057},null,null,"Surficial designation (1993)",null,null,null,"Generally dMb/Cb//R; isolated depressional area in northwest corner (northeast of Old Baldy Mountain) = $LGp                                                                                                                                                                                                                                                                                                                                                                                                                                        "]
["Cold/Wet (1999)Net Gain","Net Gain",{"$f":"SUMIF(C39:C46, \">0\")","v":5010680.433328161},{"$f":"SUMIF(D39:D46, \">0\")","v":5014377.5417444296},2060110.0695469375,237331.487525534,164385.53401978867,133410.88817463611,127670.0874346763,{"$f":"SUMIF(J39:J46, \">0\")","v":117974.07827037007},{"$f":"SUMIF(K39:K46, \">0\")","v":112044.6490811643},{"$f":"SUMIF(L39:L46, \">0\")","v":1736542.1329687468},{"$f":"SUMIF(M39:M46, \">0\")","v":2874691.1227501077},{"$f":"SUMIF(N39:N46, \">0\")","v":3262590.5471595456},20851808.572004098,null,"Net Gain",null,null,null,{"$f":"SUMIF(U39:U46, \">0\")","v":19164264.143461745},null,null,"Soils (association; parent; texture; drainage; type; comments)",null,null,null,"Mainly SE5v8RJ52/fe (Somenos moraine /  Ragbark colluvium).  gravelly-sandy loam, DU.DYB / O.DYB.shli;                                 Area around Mill Bay = DD1w/de and QU1w/ce ( Dashwood Creek marine / Quamichan fluvial, gravelly-sandy loam, DU.DYB;                                                                               Area in northwest corner (northeast of Old Baldy Mountain) = CH78AR12/b (Chemainus fluvial), loam, O.DYB, stonefree                                                                                                                                                                                "]
["Cold/Wet (1999)Net Loss","Net Loss",{"$f":"SUMIF(C39:C46, \"<0\")","v":-792304.76424784504},{"$f":"SUMIF(D39:D46, \"<0\")","v":-765943.33279422112},-855354.05215509271,-1050956.6285879274,-1054924.5752707513,-1287607.2401199753,-1428096.4220112101,{"$f":"SUMIF(J39:J46, \"<0\")","v":-1081314.6593847249},{"$f":"SUMIF(K39:K46, \"<0\")","v":-910333.47603986633},{"$f":"SUMIF(L39:L46, \"<0\")","v":-810041.47639905289},{"$f":"SUMIF(M39:M46, \"<0\")","v":-768008.61779422115},{"$f":"SUMIF(N39:N46, \"<0\")","v":-771288.33494542912},-11576173.579750318,null,"Net Loss",null,null,null,{"$f":"SUMIF(U39:U46, \"<0\")","v":-9888629.151207963},null,null,"Restrictive layers",null,null,null,"Yes - surface duric layer in Somenos (morainal) and Dashwood Creek (marine) areas"]
["Cold/Wet (1999)Net Total (Gain - Loss)","Net Total (Gain - Loss)",{"$f":"SUM(C47:C48)","v":4218375.6690803161},{"$f":"SUM(D47:D48)","v":4248434.2089502085},1204756.0173918447,-813625.14106239344,-890539.04125096253,-1154196.3519453392,-1300426.3345765339,-963340.58111435489,-798288.82695870206,926500.65656969394,2106682.5049558864,2491302.2122141165,9275634.9922537804,null,"Net Total (Gain - Loss)",null,null,null,{"$f":"SUM(U47:U48)","v":9275634.9922537822},null,null,"Estimated permeability",null,null,null,"Low - moderate @ surface in duric morainal areas ; higher in colluvial  fluvial areas"]
[]
[null,null,null,null,null,null,null,null,null,null,null,null,null,null,null,null,"Table F-2.  Direct Recharge Calculation for AQ207",null,null,null,null,null,"Hydrology"]
[null,"Table F-5  Monthly  Coefficients used in Calculations for AQ207",null,null,null,null,null,null,null,null,null,null,null,null,null,null,null,"Direct Recharge Calculation",null,null,null,null,null,"GW / SW basin coincidence",null,null,null,"No - straddles catchment divide between Shawnigan Creek mainstem & tributaries (including Hollings and handeysen Creeks) and streams flowing direcrtly into Saanich Inlet.  Occupies south side of Shawnigan Creek catchment only "]
[null,"Monthly Factors","30 Year Average",null,null,null,null,null,null,null,null,null,null,null,null,null,null,"Hot/Dry","Average","Cold/Wet",null,null,null,"Catchments",null,null,null,"Shawnigan Creek / Saanich inlet streams"]
[null,null,"Jan","Feb","Mar","Apr","May","Jun","Jul","Aug","Sep","Oct","Nov","Dec",null,null,"Surplus (mm)",{"$f":"SUM('Climate Dashboard'!AA42:AL42)","v":511.89034592156941},{"$f":"SUM('Climate Dashboard'!C48:AL48)/3","v":760.90447463619182},{"$f":"SUM('Climate Dashboard'!AA54:AL54)","v":1262.7520438297711},null,null,null,"Drainage regime",null,null,null,"Dendritic within Shawnigan Creek catchment / radial in hilly areas"]
[null,"Surplus Water",{"$f":"'Monthly Factors'!B16","v":0.25146830548450599},{"$f":"'Monthly Factors'!C16","v":0.16379677075085},{"$f":"'Monthly Factors'!D16","v":0.1182073911233482},{"$f":"'Monthly Factors'!E16","v":2.8387626824061124E-2},{"$f":"'Monthly Factors'!F16","v":-3.4169860825738051E-2},{"$f":"'Monthly Factors'!G16","v":-5.3883242071356162E-2},{"$f":"'Monthly Factors'!H16","v":-5.2569016654981621E-2},{"$f":"'Monthly Factors'!I16","v":-2.3656057494741728E-2},{"$f":"'Monthly Factors'!J16","v":-7.8853524982472421E-3},{"$f":"'Monthly Factors'!K16","v":8.6453811443823317E-2},{"$f":"'Monthly Factors'!L16","v":0.26525988999485034},{"$f":"'Monthly Factors'!M16","v":0.25858973392362583},null,null,"Station Coeffiecient Factor",1.06,1.06,1.06,null,null,null,"Surface waters",null,null,null,"Shawnigan Creek (along north border); Hollings and Handysen Creeks (tributaries of Shawnigan Creek), Malahat and Bamberton-John's Creeks (flowing directly flowing into Saanich Inlet at southeast corner of AQ)"]
[null,"Leakance/\nLateral Ground Water",{"$f":"'Monthly Factors'!B42","v":8.1000000000000003E-2},{"$f":"'Monthly Factors'!C42","v":7.8E-2},{"$f":"'Monthly Factors'!D42","v":8.6999999999999994E-2},{"$f":"'Monthly Factors'!E42","v":8.5999999999999993E-2},{"$f":"'Monthly Factors'!F42","v":0.09},{"$f":"'Monthly Factors'!G42","v":8.5999999999999993E-2},{"$f":"'Monthly Factors'!H42","v":8.6999999999999994E-2},{"$f":"'Monthly Factors'!I42","v":8.5000000000000006E-2},{"$f":"'Monthly Factors'!J42","v":8.1000000000000003E-2},{"$f":"'Monthly Factors'!K42","v":8.2000000000000003E-2},{"$f":"'Monthly Factors'!L42","v":7.8E-2},{"$f":"'Monthly Factors'!M42","v":7.9000000000000001E-2},null,null,"Infiltration Coefficient",0.53129500150700004,0.53129500150700004,0.53129500150700004,null,null,null,"Runoff coefficient",null,null,null,"~65% cleared-forested / ~20% forested / 15% rural residential / moderate slope =   0.55"]
[null,"Surface Water",{"$f":"'Monthly Factors'!B26","v":0.22068086457424585},{"$f":"'Monthly Factors'!C26","v":0.19373952223030552},{"$f":"'Monthly Factors'!D26","v":0.13994869625957773},{"$f":"'Monthly Factors'!E26","v":6.7665632372012466E-2},{"$f":"'Monthly Factors'!F26","v":2.399263439717373E-2},{"$f":"'Monthly Factors'!G26","v":9.7313744914725147E-3},{"$f":"'Monthly Factors'!H26","v":5.7792933459831003E-3},{"$f":"'Monthly Factors'!I26","v":1.8772385441074731E-3},{"$f":"'Monthly Factors'!J26","v":1.5783311410150771E-3},{"$f":"'Monthly Factors'!K26","v":1.4486378451963268E-2},{"$f":"'Monthly Factors'!L26","v":0.10238016286421177},{"$f":"'Monthly Factors'!M26","v":0.21813987132793164},null,null,"Area (m2)",{"$f":"S9","v":22530040.852500003},{"$f":"S9","v":22530040.852500003},{"$f":"S9","v":22530040.852500003},null,null,null,"Nearest Active EC hydrometric station; distance; type",null,null,null,"Shawnigan Creek @ Mill Bay; notheast corner of AQ (inactive);                                                                                                                                                                  EC 08HA003 Koksilah River  @ Cowichan Station; 7.4 km NW; active realtime;                                                                                                      "]
[null,"Water Usage",{"$f":"'Monthly Factors'!B31","v":0.06},{"$f":"'Monthly Factors'!C31","v":6.5000000000000002E-2},{"$f":"'Monthly Factors'!D31","v":7.4999999999999997E-2},{"$f":"'Monthly Factors'!E31","v":0.08},{"$f":"'Monthly Factors'!F31","v":0.09},{"$f":"'Monthly Factors'!G31","v":0.1},{"$f":"'Monthly Factors'!H31","v":0.11},{"$f":"'Monthly Factors'!I31","v":0.115},{"$f":"'Monthly Factors'!J31","v":0.1},{"$f":"'Monthly Factors'!K31","v":0.08},{"$f":"'Monthly Factors'!L31","v":7.0000000000000007E-2},{"$f":"'Monthly Factors'!M31","v":5.5E-2},null,null,"Q (m3/yr)",{"$f":"(R54/1000)*R55*R56*R57","v":6495020.31041025},{"$f":"(S54/1000)*S55*S56*S57","v":9654587.2693628054},{"$f":"(T54/1000)*T55*T56*T57","v":16022181.775905276},null,null,null,"Surface water diversions ; relevance",null,null,null,"> 30 licences along Hollings, Handeysen, & Shawnigan Creeks @ north part of AQ / >5 within AQ along unnamed steams; 7 along Malahat & Bamberton-John's Creeks at southeast end of AQ.  Moderate to high relevancy due to low-moderate overburden thicknesses"]
[null,null,null,null,null,null,null,null,null,null,null,null,null,null,null,null,"Average Infiltration Rate",{"$f":"R58/R57","v":0.28828266903428817},{"$f":"S58/S57","v":0.42852062863842977},{"$f":"T58/T57","v":0.71114747997127603}]
[null,"Monthly Factors","Hot/Dry (1989)",null,null,null,null,null,null,null,null,null,null,null,null,null,null,null,null,null,null,null,"Land Cover"]
[null,null,"Jan","Feb","Mar","Apr","May","Jun","Jul","Aug","Sep","Oct","Nov","Dec",null,null,null,null,null,null,null,null,null,"Vegetation zone",null,null,null,"Cgf-wC "]
[null,"Surplus Water",{"$f":"'Monthly Factors'!B11","v":0.30660649782598431},{"$f":"'Monthly Factors'!C11","v":0.17581890480464263},{"$f":"'Monthly Factors'!D11","v":0.27338167402959174},{"$f":"'Monthly Factors'!E11","v":1.6409764448433315E-2},{"$f":"'Monthly Factors'!F11","v":-6.4466931761702304E-2},{"$f":"'Monthly Factors'!G11","v":-8.2048822242166558E-2},{"$f":"'Monthly Factors'!H11","v":-7.032756192185706E-2},{"$f":"'Monthly Factors'!I11","v":-2.9303150800773774E-2},{"$f":"'Monthly Factors'!J11","v":-1.9535433867182515E-2},{"$f":"'Monthly Factors'!K11","v":4.9815356361315413E-2},{"$f":"'Monthly Factors'!L11","v":0.19554969301049696},{"$f":"'Monthly Factors'!M11","v":0.24810001011321794},null,null,null,null,null,null,null,null,null,"Primary land uses",null,null,null,"Forestry, rural residential"]
[null,"Leakance/\nLateral Ground Water",{"$f":"'Monthly Factors'!B43","v":8.2000000000000003E-2},{"$f":"'Monthly Factors'!C43","v":7.5999999999999998E-2},{"$f":"'Monthly Factors'!D43","v":8.4000000000000005E-2},{"$f":"'Monthly Factors'!E43","v":8.3000000000000004E-2},{"$f":"'Monthly Factors'!F43","v":8.6999999999999994E-2},{"$f":"'Monthly Factors'!G43","v":8.4000000000000005E-2},{"$f":"'Monthly Factors'!H43","v":8.6999999999999994E-2},{"$f":"'Monthly Factors'!I43","v":8.5999999999999993E-2},{"$f":"'Monthly Factors'!J43","v":8.2000000000000003E-2},{"$f":"'Monthly Factors'!K43","v":8.5000000000000006E-2},{"$f":"'Monthly Factors'!L43","v":8.1000000000000003E-2},{"$f":"'Monthly Factors'!M43","v":8.3000000000000004E-2},null,null,null,null,null,null,null,null,null,"Degree of development",null,null,null,"Extensive forestry clearing / localized rural residential & commercial development at northeast corner at Mill Bay.  Generally very low impervious cover, elevated in developed area at Mill Bay"]
[null,"Surface Water",{"$f":"'Monthly Factors'!B26","v":0.22068086457424585},{"$f":"'Monthly Factors'!C26","v":0.19373952223030552},{"$f":"'Monthly Factors'!D26","v":0.13994869625957773},{"$f":"'Monthly Factors'!E26","v":6.7665632372012466E-2},{"$f":"'Monthly Factors'!F26","v":2.399263439717373E-2},{"$f":"'Monthly Factors'!G26","v":9.7313744914725147E-3},{"$f":"'Monthly Factors'!H26","v":5.7792933459831003E-3},{"$f":"'Monthly Factors'!I26","v":1.8772385441074731E-3},{"$f":"'Monthly Factors'!J26","v":1.5783311410150771E-3},{"$f":"'Monthly Factors'!K26","v":1.4486378451963268E-2},{"$f":"'Monthly Factors'!L26","v":0.10238016286421177},{"$f":"'Monthly Factors'!M26","v":0.21813987132793164},null,null,null,null,null,null,null,null,null,"Evapotranspiration potential",null,null,null,"Cgf-wC "]
[null,"Water Usage",{"$f":"'Monthly Factors'!B31","v":0.06},{"$f":"'Monthly Factors'!C31","v":6.5000000000000002E-2},{"$f":"'Monthly Factors'!D31","v":7.4999999999999997E-2},{"$f":"'Monthly Factors'!E31","v":0.08},{"$f":"'Monthly Factors'!F31","v":0.09},{"$f":"'Monthly Factors'!G31","v":0.1},{"$f":"'Monthly Factors'!H31","v":0.11},{"$f":"'Monthly Factors'!I31","v":0.115},{"$f":"'Monthly Factors'!J31","v":0.1},{"$f":"'Monthly Factors'!K31","v":0.08},{"$f":"'Monthly Factors'!L31","v":7.0000000000000007E-2},{"$f":"'Monthly Factors'!M31","v":5.5E-2},null,null,null,null,null,null,null,null,null,"Relative environmental sensitivity",null,null,null,"Moderate in terrestrial areas, high along Hollings/Handeysen/Shawnigan  Creek corridors"]
[]
[null,"Monthly Factors","Cold/Wet (1999)",null,null,null,null,null,null,null,null,null,null,null,null,null,null,null,null,null,null,null,"Hydrogeology"]
[null,null,"Jan","Feb","Mar","Apr","May","Jun","Jul","Aug","Sep","Oct","Nov","Dec",null,null,null,null,null,null,null,null,null,"Groundwater occurrence (primary / secondary)",null,null,null,"Void infillings - bedrock fractures & faults"]
[null,"Surplus Water",{"$f":"'Monthly Factors'!B21","v":0.28121118610350893},{"$f":"'Monthly Factors'!C21","v":0.28471061972718881},{"$f":"'Monthly Factors'!D21","v":0.1055893178084587},{"$f":"'Monthly Factors'!E21","v":-1.2670737757409583E-2},{"$f":"'Monthly Factors'!F21","v":-1.0294974427895285E-2},{"$f":"'Monthly Factors'!G21","v":-2.6925317734495361E-2},{"$f":"'Monthly Factors'!H21","v":-3.4844528832876351E-2},{"$f":"'Monthly Factors'!I21","v":-1.425457997708578E-2},{"$f":"'Monthly Factors'!J21","v":-6.3353688787047913E-3},{"$f":"'Monthly Factors'!K21","v":9.9861251950584262E-2},{"$f":"'Monthly Factors'!L21","v":0.16139352218500455},{"$f":"'Monthly Factors'!M21","v":0.17255960983372176},null,null,null,null,null,null,null,null,null,"Primary porosity",null,null,null,"Low to negligible"]
[null,"Leakance/\nLateral Ground Water",{"$f":"'Monthly Factors'!B44","v":8.1000000000000003E-2},{"$f":"'Monthly Factors'!C44","v":7.8E-2},{"$f":"'Monthly Factors'!D44","v":8.6999999999999994E-2},{"$f":"'Monthly Factors'!E44","v":8.5999999999999993E-2},{"$f":"'Monthly Factors'!F44","v":0.09},{"$f":"'Monthly Factors'!G44","v":8.5999999999999993E-2},{"$f":"'Monthly Factors'!H44","v":8.6999999999999994E-2},{"$f":"'Monthly Factors'!I44","v":8.5000000000000006E-2},{"$f":"'Monthly Factors'!J44","v":8.1000000000000003E-2},{"$f":"'Monthly Factors'!K44","v":8.2000000000000003E-2},{"$f":"'Monthly Factors'!L44","v":7.8E-2},{"$f":"'Monthly Factors'!M44","v":7.9000000000000001E-2},null,null,null,null,null,null,null,null,null,"Secondary porosity",null,null,null,"Moderate in Island Intrusives areas; higher in fracture zones & faults, especially along & south of Shawnigan Fault; low in Bonanza Volcanics areas due to ductile rock"]
[null,"Surface Water",{"$f":"'Monthly Factors'!B26","v":0.22068086457424585},{"$f":"'Monthly Factors'!C26","v":0.19373952223030552},{"$f":"'Monthly Factors'!D26","v":0.13994869625957773},{"$f":"'Monthly Factors'!E26","v":6.7665632372012466E-2},{"$f":"'Monthly Factors'!F26","v":2.399263439717373E-2},{"$f":"'Monthly Factors'!G26","v":9.7313744914725147E-3},{"$f":"'Monthly Factors'!H26","v":5.7792933459831003E-3},{"$f":"'Monthly Factors'!I26","v":1.8772385441074731E-3},{"$f":"'Monthly Factors'!J26","v":1.5783311410150771E-3},{"$f":"'Monthly Factors'!K26","v":1.4486378451963268E-2},{"$f":"'Monthly Factors'!L26","v":0.10238016286421177},{"$f":"'Monthly Factors'!M26","v":0.21813987132793164},null,null,null,null,null,null,null,null,null,"Confinement",null,null,null,"                           Morainal blanket areas locally semi-confined by duric till blankets;                                                                                                                         WP = 0 - 64.3, avg 4.6 m                                                                                                                                                          "]
[null,"Water Usage",{"$f":"'Monthly Factors'!B31","v":0.06},{"$f":"'Monthly Factors'!C31","v":6.5000000000000002E-2},{"$f":"'Monthly Factors'!D31","v":7.4999999999999997E-2},{"$f":"'Monthly Factors'!E31","v":0.08},{"$f":"'Monthly Factors'!F31","v":0.09},{"$f":"'Monthly Factors'!G31","v":0.1},{"$f":"'Monthly Factors'!H31","v":0.11},{"$f":"'Monthly Factors'!I31","v":0.115},{"$f":"'Monthly Factors'!J31","v":0.1},{"$f":"'Monthly Factors'!K31","v":0.08},{"$f":"'Monthly Factors'!L31","v":7.0000000000000007E-2},{"$f":"'Monthly Factors'!M31","v":5.5E-2},null,null,null,null,null,null,null,null,null,"Aquifer thickness",null,null,null,"Bedrock aquifer / assume < 150 m"]
[null,null,null,null,null,null,null,null,null,null,null,null,null,null,null,null,null,null,null,null,null,null,null,"Hydraulic anisotropy",null,null,null,"High"]
[null,null,null,null,null,null,null,null,null,null,null,null,null,null,null,null,null,null,null,null,null,null,null,"Hydraulic gradient",null,null,null,"Moderate to high based on terrain"]
[null,null,null,null,null,null,null,null,null,null,null,null,null,null,null,null,null,null,null,null,null,null,null,"Storage potential",null,null,null,"Low - secondary voids only"]
[null,null,null,null,null,null,null,null,null,null,null,null,null,null,null,null,null,null,null,null,null,null,null,"Yield potential",null,null,null,"Low-moderate; WP = 0.02 - 12.62 L/s / average 0.25 L/s"]
[null,"TABLE F-6",null,null,null,null,null,null,null,null,null,null,null,null,null,null,null,null,null,null,null,null,null,"Flow velocities",null,null,null,"Low - moderate"]
[null,"Groundwater Flow Components: Aquifer #0207, Bamberton (Bedrock)",null,null,null,null,null,null,null,null,null,null,null,null,null,null,null,null,null,null,null,null,null,"Flow directions",null,null,null,"Northwest half of AQ (i.e. NW of surface water divide) = notheast towards Shawnigan Creek and Mill Bay / Saanich Inlet.  Southeast half of AQ (i.e. SE of surface water divide) =  radial flow possible to southeast and towards Saanich Inlet "]
[null,null,null,null,null,null,null,null,null,null,null,null,null,null,null,null,null,null,null,null,null,null,null,"Static water levels",null,null,null,"WP = variable 0 - 61 m bgs / avg 7.6 m bgs"]
[null,"Groundwater Flow","Direction of Flow","Source or Receptor of Water","Length (m)","Depth (m)","Area (m)","Hydraulic Conductivity (m/s) - K","Distance (m) - dL","Hydraulic Head (m) - dh",null,null,"GW Flow (m3/yr)",null,null,null,null,null,null,null,null,null,null,"Hydraulic connection with surface waters",null,null,null,"Generally moderate to high due to shallow overburden cover & deeply incised creeks / lower in areas with thick overburden (near Mill Bay)"]
[null,null,null,null,null,null,null,null,null,"Year 1","Year 2","Year 3","Year 1","Year 2","Year 3",null,null,null,null,null,null,null,null,"Hydraulic connection to adjacent AQ"]
[null,"QGW1","Zero","AQ 202",{"$f":"2*476","v":952},20,{"$f":"E82*F82","v":19040},1.0000000000000001E-5,1,0,null,null,{"$f":"-(G82*H82*(J82/I82))*60*60*24*365","v":0},null,null,null,null,null,null,null,null,null,null,null,"Over / Under",null,null,"North portion overlain by surficial AQ 205 and surficial AQ206 "]
[null,"QGW2","Out","AQ 202",{"$f":"0.6*476","v":285.59999999999997},20,{"$f":"E83*F83","v":5711.9999999999991},1.0000000000000001E-9,340,20,null,null,{"$f":"-(G83*H83*(J83/I83))*60*60*24*365","v":-10.596095999999999},null,null,null,null,null,null,null,null,null,null,null,"Upgradient",null,null,"Upgradient contact at northwest corner with bedrock AQ202.Upgradient contact with bedrock AQ203, may receive recharge across sw divide from Shawnigan Fault; cross-gradient? contact along noth border with bedrock AQ204 "]
[null,"QGW3","Out","AQ 202",{"$f":"0.3*476","v":142.79999999999998},20,2855.9999999999995,1E-8,545,20,null,null,-33.052042568807337,null,null,null,null,null,null,null,null,null,null,null,"Downgradient",null,null,"None - discharge to marine"]
[null,"QGW4","Out","AQ 202",{"$f":"1.1*476","v":523.6},20,10472,1.0000000000000001E-9,545,20,null,null,-12.11908227522936,null,null,null,null,null,null,null,null,null,null,"Vulnerability to surface contamination",null,null,null,"Low-moderate due to variably thick overburden cover"]
[null,"QGW5","Zero","AQ 203",{"$f":"2.8*476","v":1332.8},200,266560,1.0000000000000001E-9,1,0,null,null,0,null,null,null,null,null,null,null,null,null,null,"Recharge"]
[null,"QGW6","In","AQ 203",{"$f":"0.3*476","v":142.79999999999998},200,28559.999999999996,9.9999999999999995E-8,"--","--",null,null,{"$f":"-'Bedrock 203'!M116","v":5458.5949090909089},null,null,null,null,null,null,null,null,null,null,null,"Vertical inflow",null,null,"High recharge from precipitation, subordinate from snowmelt due to high elevations.  Moderate to high recharge at north end  from overlying surficial AQ 205 & surficial AQ 206. Moderate recharge from Hollings/Handysen/Shawnigan Creek stream losses in deeply incised areas.  Low-moderate recharge from irrigation-sewerage return due to low degree of urban / agricultural development"]
[null,"QGW7","Zero","AQ 203",{"$f":"1.7*476","v":809.19999999999993},200,161840,1.0000000000000001E-9,1,0,null,null,0,null,null,null,null,null,null,null,null,null,null,null,"Lateral inflow",null,null,"Low - moderate lateral inflow from upgradient bedrock sources                                                                                                                          "]
[null,"QGW8","Zero","AQ 203",{"$f":"0.3*476","v":142.79999999999998},200,28559.999999999996,1E-8,1,0,null,null,0,null,null,null,null,null,null,null,null,null,null,null,"Temporal variability",null,null,"Moderate to high due to vaiable overburden cover"]
[null,"QGW9","Zero","AQ 203",{"$f":"1.4*476","v":666.4},200,133280,1.0000000000000001E-9,1,0,null,null,0,null,null,null,null,null,null,null,null,null,null,null,"MBR",null,null,"Moderate - high along south and southwest borders of AQ from Malahat Ridge rocky hills "]
[null,"QGW10","Zero","AQ 203",{"$f":"0.2*476","v":95.2},200,19040,1E-8,1,0,null,null,0,null,null,null,null,null,null,null,null,null,null,"Discharge"]
[null,"QGW11","Zero","AQ 203",{"$f":"3.9*476","v":1856.3999999999999},200,371280,1.0000000000000001E-9,1,0,null,null,0,null,null,null,null,null,null,null,null,null,null,null,"Evapotranspiration",null,null,"High"]
[null,"QGW12","Zero","N/A ",{"$f":"2*476","v":952},200,190400,1.0000000000000001E-9,1,0,"-","-",0,null,null,null,null,null,null,null,null,null,null,null,"Outflow to marine",null,null,"Moderate to high due to variable overburden cover & high elevations"]
[null,"QGW13","In","N/A ",{"$f":"0.5*476","v":238},200,47600,9.9999999999999995E-8,610,60,null,null,{"$f":"(G94*H94*(J94/I94))*60*60*24*365","v":14765.051803278686},null,null,null,null,null,null,null,null,null,null,null,"Outflow to surface waters",null,null,"High to Hollings/Handeysen/Shawnigan/Malahat/Bamberton-John's Creeks & tributaries in deeply incised areas"]
[null,"QGW14","In","N/A ",{"$f":"3.8*476","v":1808.8},200,361760,1.0000000000000001E-9,590,100,null,null,1933.6378576271188,null,null,null,null,null,null,null,null,null,null,null,"Outflow to other AQ",null,null,"None"]
[null,"QGW15","In","N/A ",{"$f":"0.7*476","v":333.2},200,66640,1E-8,640,100,null,null,3283.6860000000006,null,null,null,null,null,null,null,null,null,null,null,"Temporal variability",null,null,"Moderate to high due to variable overburden cover, low in deep overburden area adjacent to Mill Bay"]
[null,"QGW16","In","N/A ",{"$f":"1.3*476","v":618.80000000000007},200,123760.00000000001,1.0000000000000001E-9,995,40,null,null,156.90031597989952]
[null,"QGW17","In","N/A ",{"$f":"0.3*476","v":142.79999999999998},200,28559.999999999996,1E-8,870,40,null,null,414.10030344827578,null,null,null,null,null,null,null,null,null,"Groundwater Development"]
[null,"QGW18","In","N/A ",{"$f":"6*476","v":2856},200,571200,1.0000000000000001E-9,500,60,null,null,2161.603584,null,null,null,null,null,null,null,null,null,null,null,"Nearest BCMOE Observation Wells; distance; completion / relevance",null,null,"Well #345 = 2.5 km northeast of AQ;  completed in surficial materials; irrelevant"]
[null,"QGW19","Out","N/A ",{"$f":"0.7*476","v":333.2},200,66640,9.9999999999999995E-8,1280,40,null,null,-6567.3719999999994,null,null,null,null,null,null,null,null,null,null,null,"Total Annual Water Use (m3/yr) as reported by Hatfield (2015)",null,null,null,"  SUMS"]
[null,"QGW20","In","N/A ",{"$f":"4.5*476","v":2142},200,428400,1.0000000000000001E-9,230,40,null,null,{"$f":"(G101*H101*(J101/I101))*60*60*24*365","v":2349.5691130434784},null,null,null,null,null,null,null,null,null,null,null,null,"Industrial",null,14600,"Total Commercial and Industrial"]
[null,"QGW21","Out","Ocean",{"$f":"0.2*476","v":95.2},100,9520,1E-8,335,40,null,null,-358.47488955223872,null,null,null,null,null,null,null,null,null,null,null,null,"Commercial",null,32850,{"$f":"AB101+AB102","v":47450}]
[null,"QGW22","Out","Ocean",{"$f":"2.4*476","v":1142.3999999999999},100,114239.99999999999,1.0000000000000001E-9,790,100,null,null,-456.03451139240508,null,null,null,null,null,null,null,null,null,null,null,null,"Domestic",null,194146,"Total Irrigation"]
[null,"QGW23","Out","Ocean",{"$f":"0.2*476","v":95.2},100,9520,1E-8,635,60,null,null,-283.67501102362212,null,null,null,null,null,null,null,null,null,null,null,null,"Irrigation from groundwater (Ministry of AGRICULTURE)",null,100596,{"$f":"AB104","v":100596}]
[null,"QGW24","Out","Ocean",{"$f":"1.3*476","v":618.80000000000007},100,61880.000000000007,1.0000000000000001E-9,625,12,null,null,-37.467795456000005,null,null,null,null,null,null,null,null,null,null,null,null,"BCMOE Obs",null,0]
[null,"QGW25","Out","Ocean",{"$f":"9.4*476","v":4474.4000000000005},100,447440.00000000006,9.9999999999999995E-7,545,80,null,null,-2071261.334311927,null,null,null,null,null,null,null,null,null,null,null,null,"Other",null,40150,"Total Domestic + Water Systems + Other"]
[null,"QGW26","Out","Ocean",{"$f":"0.3*476","v":142.79999999999998},100,14279.999999999998,1E-4,570,20,null,null,-1580119.5789473683,null,null,null,null,null,null,null,null,null,null,null,null,"Water Supply Systems",null,30715,{"$f":"AB103+AB106+AB107","v":265011}]
[null,"QGW27","Out","Ocean",{"$f":"0.8*476","v":380.8},100,38080,1.0000000000000001E-5,75,20,null,null,-3202375.6800000006]
[null,"QGW28","Out","Shawnigan Creek",{"$f":"2.2*476","v":1047.2},20,20944,9.9999999999999995E-7,75,20,null,null,{"$f":"-(G109*H108*(J109/I109))*60*60*24*365","v":-1761306.6239999998}]
[null,"QGW29","Out","Shawnigan Creek",{"$f":"0.4*476","v":190.4},20,3808,1E-4,145,20,null,null,{"$f":"-(G110*H109*(J110/I110))*60*60*24*365","v":-16564.012137931037}]
[null,"QGW30","Out","Shawnigan Creek",{"$f":"0.3*476","v":142.79999999999998},20,2855.9999999999995,1.0000000000000001E-5,130,20,null,null,{"$f":"-(G111*H111*(J111/I111))*60*60*24*365","v":-138564.3323076923}]
[null,"QGW31","Out","Shawnigan Creek",{"$f":"0.2*476","v":95.2},20,1904,1.0000000000000001E-5,370,20,null,null,-32456.510270270275]
[null,"QGW32","Out","Shawnigan Creek",{"$f":"1.5*476","v":714},20,14280,9.9999999999999995E-7,205,20,"-","-",-43935.032195121952]
[null,"QGW33","Out","Shawnigan Creek",{"$f":"0.2*476","v":95.2},20,1904,1.0000000000000001E-5,225,20,"-","-",-53372.928000000007]
[null,"QGW34","Out","Shawnigan Creek",{"$f":"0.9*476","v":428.40000000000003},20,8568,9.9999999999999995E-7,520,40,"-","-",-20784.649846153843]
[null,"QGW35","Out","Shawnigan Creek",{"$f":"0.2*476","v":95.2},20,1904,1E-4,240,20,"-","-",-500371.20000000001]
[null,"QGW36","Out","Shawnigan Creek",{"$f":"4*476","v":1904},20,38080,9.9999999999999995E-7,260,10,null,null,-46188.110769230771]
[null,"QGW37","Out","Shawnigan Creek",{"$f":"1.5*476","v":714},20,14280,1.0000000000000001E-9,125,20,null,null,-72.053452799999988]
[null,"QGW38","Out","Shawnigan Creek",{"$f":"0.3*476","v":142.79999999999998},20,2855.9999999999995,1E-8,320,40,null,null,-112.58351999999998]
[null,"QGW39","Out","Shawnigan Creek",{"$f":"0.8*476","v":380.8},20,7616,1.0000000000000001E-9,140,20,null,null,-34.311167999999995]
[null,"QGW40","Out","Shawnigan Creek",{"$f":"0.3*476","v":142.79999999999998},20,2855.9999999999995,1E-8,435,20,null,null,-41.410030344827582]
[null,"QGW41","Out","Shawnigan Creek",{"$f":"1.5*476","v":714},20,14280,1.0000000000000001E-9,85,20,null,null,-105.96096]
[null,"QGW42","Out","Shawnigan Creek",{"$f":"0.5*476","v":238},20,4760,1E-8,245,20,null,null,-122.5398857142857]
[null,"QGW43","Out","Shawnigan Creek",{"$f":"1*476","v":476},20,9520,1.0000000000000001E-9,245,20,null,null,-24.507977142857143]
[null,"QGW44","In","AQ 205","Leakage from 205","Leakance Factor (m/yr) = ",{"$f":"'Surficial AQ 205'!F84","v":0.2},{"$f":"'Surficial AQ 205'!G84","v":2728691.5951800002},"--","--","--",null,{"$f":"G125*H125","v":545738.31903600006}]
[null,"QGW45","In","AQ 206","Leakage from 206","Leakance Factor (m/yr) = ",{"$f":"'Surficial AQ 206'!F84","v":0.3},{"$f":"'Surficial AQ 206'!G84","v":2573510.74878},"--","--",null,null,{"$f":"G126*H126","v":772053.22463399998}]
[null,"Total",null,null,null,null,null,null,null,null,null,null,{"$f":"SUM(M82:M126)","v":-8127257.463651496}]
[]
[null,"Surface Water Contributions","Cold Water Creek?","Observed Vertical Gradient","Percent Permeable","Length (m)","Width (m)","Flux (m/s)","SW Flow (m3/yr)",null,null,"Comment"]
[null,null,null,null,null,null,null,null,"Year 1","Year 2","Year 3"]
[null,"Hollings Creek","Unknown","Downward",0.1,5000,2,3.0000000000000001E-5,{"$f":"(E131*F131*G131)*(H131*60*60*24*365)","v":946080},null,null,"A portion of Hollings Creek runs over a thick layer of overburden therefore those sections are considered to be conveyance features."]
[null,"Handysen Creek","Unknown","Downward",0,2200,2,3.0000000000000001E-5,{"$f":"(E132*F132*G132)*(H132*60*60*24*365)","v":0}]
[null,"Unnamed creek","Unknown","Zero",0.1,480,2,3.0000000000000001E-5,{"$f":"(E133*F133*G133)*(H133*60*60*24*365)","v":90823.680000000008},null,null,"Over a thick layer of overburden therefore it is considered a conveyance feature."]
[null,"Johns Creek","Unknown","Downward",0.1,4000,2,3.0000000000000001E-5,{"$f":"(E134*F134*G134)*(H134*60*60*24*365)","v":756864}]
[null,"Total",null,null,null,null,null,null,{"$f":"SUM(I131:I134)","v":1793767.6800000002},{"$f":"SUM(J134:J134)","v":0},{"$f":"SUM(K134:K134)","v":0}]
[]
[null,"Water Well Usage","Water Well Usage Volume (m3/yr)",null,null,null,null,null,null,null,null,"Comments"]
[null,null,"Year 1",null,null,"Year 2",null,null,"Year 3"]
[null,null,"Total Volume Removed","Adjustment Factor","Adjusted Volume Removed","Total Volume Removed","Adjustment Factor","Adjusted Volume Removed","Total Volume Removed","Adjustment Factor","Adjusted Volume Removed"]
[null,"Industrial",{"$f":"AB101","v":14600},1,{"$f":"C140*D140","v":14600},null,null,null,null,null,null,"Assuming 100% consumptive"]
[null,"Commercial",32850,1,{"$f":"C141*D141","v":32850},null,null,null,null,null,null,"Assuming 100% consumptive"]
[null,"Domestic",194146,1,194146,null,null,null,null,null,null,"Assuming 100% consumptive"]
[null,"Irrigation",100596,1,100596,null,null,null,null,null,null,"Assuming 100% consumptive"]
[null,"BCMOE Obs",0,1,0,null,null,null,null,null,null,"Assuming 100% consumptive"]
[null,"Other",40150,1,40150,null,null,null,null,null,null,"Assuming 100% consumptive"]
[null,"Water Supply Systems",30715,1,30715,null,null,null,null,null,null,"Assuming 100% consumptive"]
[null,"Total",{"$f":"-SUM(C140:C146)","v":-413057},null,{"$f":"-SUM(E140:E146)","v":-413057},null,null,{"$f":"-SUM(H140:H146)","v":0},null,null,{"$f":"-SUM(K140:K146)","v":0}]

{"sheet":"Surficial AQ 197","index":12,"n_rows":113,"n_cols":29,"rows_kept":113,"cut":false,"hidden":false,"merged":[[4,2,4,4],[3,2,3,4],[2,2,2,4],[1,2,1,4],[80,12,80,14],[102,1,104,1],[97,3,98,3],[6,16,6,20],[21,16,21,20],[36,16,36,20],[102,2,102,10],[97,7,98,7],[51,16,51,19],[97,4,98,4],[97,5,98,5],[97,6,98,6],[103,2,103,4],[103,5,103,7],[103,8,103,10],[80,1,81,1],[80,2,81,2],[97,1,98,1],[97,2,98,2],[97,8,97,10],[97,11,98,11],[80,6,81,6],[80,7,81,7],[80,8,81,8],[80,9,80,11],[80,3,81,3],[80,4,81,4],[80,5,81,5]]}
[null,"CHM Aquifer Criteria: Aquifer #0197, Cherry Point (Surficial)",null,null,null,null,null,null,null,null,null,null,null,null,null,null,null,null,null,null,null,null,"TABLE G-1"]
[null,"AQ tag","197 Cherry Point",null,null,null,null,null,null,null,null,null,null,null,null,null,null,null,null,null,null,null,"CHM Aquifer Criteria: Aquifer #0197, Cherry Point (Surficial)"]
[null,"Perimeter (km)",42.05]
[null,"Area (km2)",39.479999999999997,null,null,null,null,null,null,null,null,null,null,null,null,null,null,null,null,null,null,null,"BCMOE Criteria"]
[null,"Aquifer materials","Sand and gravel ",null,null,null,null,null,null,null,null,null,null,null,null,null,null,null,null,null,null,null,null,"AQ tag",null,null,null,"197 Cherry Point"]
[null,"Table G-4 Monthly  Summary of AQ197 Water Budgets",null,null,null,null,null,null,null,null,null,null,null,null,null,null,"Table G-3 Annual Summary of AQ197 Water Budgets",null,null,null,null,null,null,"AQ classification",null,null,null,"IIC (11)"]
[null,"Monthly Gains and Loses (m3) - ","Average Year",null,null,null,null,null,null,null,null,null,null,null,null,null,"Summary - 30 Year Average",null,null,null,null,null,null,"AQ type",null,null,null,"BCMOE Classification = 4b (SLR Classification = 4a / 4b / 4c)"]
[null,null,"Jan","Feb","Mar","Apr","May","Jun","Jul","Aug","Sep","Oct","Nov","Dec","Total",null,"Gains and Losses","Source","Area (m2)","Infiltration Rate","Q (m3/yr)",null,null,"Location",null,null,null,"Cowichan Bay / Cobble Hill"]
[{"$f":"$C$7&B9","v":"Average YearDirect Recharge to 197"},{"$f":"R9","v":"Direct Recharge to 197"},{"$f":"C55*$U$9","v":2702771.6161821685},1760481.353523782,1270488.4654770717,305109.11457814439,-367256.34187084489,-579135.00064248627,-565009.75672437681,-254254.39052596956,-84751.46350865651,929202.21986196935,2851003.0328011229,2779312.4534651856,{"$f":"SUM(C9:N9)","v":10747961.30261711},null,"Gain","Direct Recharge to 197",{"$f":"10000*(2920.58172234+14.58)","v":29351617.2234},{"$f":"U9/S9","v":0.36617952669567078},{"$f":"D75","v":10747961.30261711},null,null,"Perimeter (km)",null,null,null,42.05]
["Average YearLeakage down  to 204","Leakage down  to 204",{"$f":"C56*$U$10","v":-124571.17301228101},-119957.42586367801,-133798.66730948701,-132260.751593286,-138412.41445809,-132260.751593286,-133798.66730948701,-130722.83587708502,-124571.17301228101,-126109.08872848202,-119957.42586367801,-121495.34157987901,{"$f":"SUM(C10:N10)","v":-1537915.7162010001},null,"Loss","Leakage down  to 204",{"$f":"10000*512.638572067","v":5126385.7206700006},0.3,{"$f":"-S10*T10","v":-1537915.7162010001},null,null,"Area (km2)",null,null,null,39.479999999999997]
["Average YearLeakage down to 198","Leakage down to 198",{"$f":"C56*$U$11","v":-40499.86236318},-38999.867460839996,-43499.852167859994,-42999.853867079997,-44999.847070199998,-42999.853867079997,-43499.852167859994,-42499.855566300001,-40499.86236318,-40999.860663960004,-38999.867460839996,-39499.86576162,-499998.30077999999,null,"Loss","Leakage down to 198",{"$f":"10000*499.99830078","v":4999983.0077999998},0.1,{"$f":"-S11*T11","v":-499998.30077999999},null,null,"Aquifer materials",null,null,null,"Sand and gravel "]
["Average YearLeakage to depth","Leakage to depth",{"$f":"C56*$U$12","v":-155724.51280893301},-149956.93826045399,-167259.66190589097,-165337.13705639797,-173027.23645437,-165337.13705639797,-167259.66190589097,-163414.612206905,-155724.51280893301,-157647.03765842601,-149956.93826045399,-151879.46310994698,-1922524.8494929997,null,"Loss","Leakage to depth",{"$f":"S9-S10-S11","v":19225248.494929999},0.1,{"$f":"-S12*T12","v":-1922524.849493},null,null,"Lithostratographic unit",null,null,null,"Vashon Drift"]
["Average YearLateral Groundwater","Lateral Groundwater",{"$f":"C56*$U$13","v":-476398.73463635572},-458754.3370572314,-511687.52979460423,-505806.06393489614,-529331.92737372848,-505806.06393489614,-511687.52979460423,-499924.59807518811,-476398.73463635572,-482280.2004960638,-458754.3370572314,-464635.80291693949,-5881465.859708094,null,"Loss","Lateral Groundwater","--","--",{"$f":"SUMIF(M83:M95,\"<0\")","v":-5881465.859708095},null,null,"Productivity",null,null,null,"Moderate"]
["Average YearLateral Groundwater","Lateral Groundwater",{"$f":"C56*$U$14","v":22005.505229292648},21190.486517096626,23635.542653684694,23363.869749619353,24450.56136588072,23363.869749619353,23635.542653684694,23092.196845554015,22005.505229292648,22277.178133357989,21190.486517096626,21462.159421161967,271672.90406534134,null,"Gain","Lateral Groundwater","--","--",{"$f":"SUMIF(M83:M95,\">0\")","v":271672.90406534134},null,null,"Vulnerability",null,null,null,"Low"]
["Average YearSurface Water","Surface Water",{"$f":"C57*$U$15","v":-163597.94117316001},-143625.44311170239,-103748.54485959266,-50162.745943551403,-17786.524437769673,-7214.1861264744457,-4284.3791402696852,-1391.658318447262,-1170.0684862627877,-10739.226051015748,-75897.76256256584,-161714.21978918815,-741332.70000000007,null,"Loss","Surface Water","--","--",{"$f":"SUMIF(I100,\"<0\")","v":-741332.7},null,null,"Demand",null,null,null,"Moderate"]
["Average YearSurface Water","Surface Water",{"$f":"C57*$U$16","v":0},0,0,0,0,0,0,0,0,0,0,0,0,null,"Gain","Surface Water","--","--",{"$f":"SUMIF(I100,\">0\")","v":0},null,null,"Use",null,null,null,"Multiple"]
["Average YearWater Usage","Water Usage",{"$f":"C58*$U$17","v":-274594.86},-297477.76500000001,-343243.57500000001,-366126.48,-411892.29,-457658.10000000003,-503423.91,-526306.81500000006,-457658.10000000003,-366126.48,-320360.67000000004,-251711.95499999999,-4576581,null,"Loss","Water Usage","--","--",{"$f":"E113","v":-4576581}]
["Average YearNet Gain",{"$f":"Q18","v":"Net Gain"},{"$f":"SUMIF(C9:C17, \">0\")","v":2724777.1214114609},1781671.8400408786,1294124.0081307564,328472.98432776373,24450.56136588072,23363.869749619353,23635.542653684694,23092.196845554015,22005.505229292648,951479.39799532737,2872193.5193182193,2800774.6128863473,12870041.159954784,null,"Net Gain",null,null,null,{"$f":"SUMIF(U9:U17, \">0\")","v":11019634.206682451},null,"Location"]
["Average YearNet Loss",{"$f":"Q19","v":"Net Loss"},{"$f":"SUMIF(C9:C17, \"<0\")","v":-1235387.0839939099},-1208771.7767539057,-1303237.831037435,-1262693.0323952115,-1682706.5816650032,-1890411.0932206211,-1928963.7570424888,-1618514.765569895,-1340773.9148156692,-1183901.8935979474,-1163927.0012047694,-1190936.6481575735,-17010225.37945443,null,"Net Loss",null,null,null,{"$f":"SUMIF(U9:U17, \"<0\")","v":-15159818.426182095},null,null,"NTS 50000",null,null,null,"Mostly within 092B/12, north end within 092B/13"]
["Average YearNet Total (Gain - Loss)",{"$f":"Q20","v":"Net Total (Gain - Loss)"},{"$f":"SUM(C18:C19)","v":1489390.037417551},572900.06328697293,-9113.8229066785425,-934220.04806744773,-1658256.0202991224,-1867047.2234710017,-1905328.214388804,-1595422.568724341,-1318768.4095863765,-232422.49560262007,1708266.5181134499,1609837.9647287738,-4140184.2194996439,null,"Net Total (Gain - Loss)",null,null,null,{"$f":"SUM(U18:U19)","v":-4140184.2194996439},null,null,"TRIM 20000",null,null,null,"Straddles 092B.062, 092B.063, 092B.072, and 092B.073"]
[null,null,null,null,null,null,null,null,null,null,null,null,null,null,null,null,null,null,null,null,null,null,null,"Lat / Long (Centre)",null,null,null,"48o43'08\" / 123o36'09\""]
[null,"Monthly Gains and Loses (m3) - ","Hot/Dry (1989)",null,null,null,null,null,null,null,null,null,null,null,null,null,"Summary - Hot/Dry (1989)",null,null,null,null,null,null,"UTM Zone 10 (Centre)",null,null,null,"455660E / 5396386N"]
[null,null,"Jan","Feb","Mar","Apr","May","Jun","Jul","Aug","Sep","Oct","Nov","Dec","Total",null,"Gains and Losses","Source","Area (m2)","Infiltration Rate","Q (m3/yr)"]
[{"$f":"$C$22&B24","v":"Hot/Dry (1989)Direct Recharge to 197"},{"$f":"R24","v":"Direct Recharge to 197"},{"$f":"C62*$U$24","v":2216941.5832349434},1271271.9526298477,1976706.9698391075,118652.04891211915,-466133.04929761088,-593260.2445605956,-508508.78105193918,-211878.65877164129,-141252.4391810942,360193.71991179022,1413936.9162027529,1793905.9775998963,{"$f":"SUM(C24:N24)","v":7230575.9954675753},null,"Gain","Direct Recharge to 197",{"$f":"10000*(2920.58172234+14.58)","v":29351617.2234},{"$f":"U24/S24","v":0.24634335956463552},{"$f":"C75","v":7230575.9954675753},null,"Climate"]
["Hot/Dry (1989)Leakage down  to 204","Leakage down  to 204",{"$f":"C63*$U$25","v":-126109.08872848202},{"$f":"D63*$U$25","v":-116881.59443127601},-129184.92016088402,-127647.00444468301,-133798.66730948701,-129184.92016088402,-133798.66730948701,-132260.751593286,-126109.08872848202,-130722.83587708502,-124571.17301228101,-127647.00444468301,{"$f":"SUM(C25:N25)","v":-1537915.7162010001},null,"Loss","Leakage down  to 204",{"$f":"10000*512.638572067","v":5126385.7206700006},0.3,{"$f":"-S25*T25","v":-1537915.7162010001},null,null,"Nearest active EC weather station / distance / elevation",null,null,null,"EC1012573 Duncan Kelvin Creek / 3.7 km to west (north end of AQ);                                                                                                                             EC1017230 Shawnigan Lake / 2.8 km to southwest (south end of AQ)"]
["Hot/Dry (1989)Leakage down to 198","Leakage down to 198",{"$f":"C63*$U$26","v":-40999.860663960004},{"$f":"D63*$U$26","v":-37999.870859279996},-41999.857265520004,-41499.85896474,-43499.852167859994,-41999.857265520004,-43499.852167859994,-42999.853867079997,-40999.860663960004,-42499.855566300001,-40499.86236318,-41499.85896474,-499998.30077999999,null,"Loss","Leakage down to 198",{"$f":"10000*499.99830078","v":4999983.0077999998},0.1,{"$f":"-S26*T26","v":-499998.30077999999},null,null,"IDF Curve",null,null,null,"Unknown"]
["Hot/Dry (1989)Leakage to depth","Leakage to depth",{"$f":"C63*$U$27","v":-157647.03765842601},{"$f":"D63*$U$27","v":-146111.88856146799},-161492.08735741201,-159569.56250791901,-167259.66190589097,-161492.08735741201,-167259.66190589097,-165337.13705639797,-157647.03765842601,-163414.612206905,-155724.51280893301,-159569.56250791901,-1922524.8494929997,null,"Loss","Leakage to depth",{"$f":"S24-S25-S26","v":19225248.494929999},0.1,{"$f":"-S27*T27","v":-1922524.849493}]
["Hot/Dry (1989)Lateral Groundwater","Lateral Groundwater",{"$f":"C63*$U$28","v":-482280.2004960638},{"$f":"D63*$U$28","v":-446991.40533781523},-494043.13221548003,-488161.66635577189,-511687.52979460423,-494043.13221548003,-511687.52979460423,-505806.06393489614,-482280.2004960638,-499924.59807518811,-476398.73463635572,-488161.66635577189,-5881465.859708095,null,"Loss","Lateral Groundwater","--","--",{"$f":"SUMIF(M83:M95,\"<0\")","v":-5881465.859708095},null,"Physiography"]
["Hot/Dry (1989)Lateral Groundwater","Lateral Groundwater",{"$f":"C63*$U$29","v":22277.178133357989},{"$f":"D63*$U$29","v":20647.140708965941},22820.523941488675,22548.851037423334,23635.542653684694,22820.523941488675,23635.542653684694,23363.869749619353,22277.178133357989,23092.196845554015,22005.505229292648,22548.851037423334,271672.90406534134,null,"Gain","Lateral Groundwater","--","--",{"$f":"SUMIF(M83:M95,\">0\")","v":271672.90406534134},null,null,"Physiographic zone",null,null,null,"Canadian Cordillera / Western System / Coastal Trough / Georgia Depression / Nanaimo Lowland"]
["Hot/Dry (1989)Surface Water","Surface Water",{"$f":"C64*$U$30","v":-163597.94117316001},{"$f":"D64*$U$30","v":-143625.44311170239},-103748.54485959266,-50162.745943551403,-17786.524437769673,-7214.1861264744457,-4284.3791402696852,-1391.658318447262,-1170.0684862627877,-10739.226051015748,-75897.76256256584,-161714.21978918815,-741332.70000000007,null,"Loss","Surface Water","--","--",{"$f":"SUMIF(I100,\"<0\")","v":-741332.7},null,null,"Elevation range (m amsl)",null,null,null,"0 - 140 m amsl"]
["Hot/Dry (1989)Surface Water","Surface Water",{"$f":"C64*$U$31","v":0},{"$f":"D64*$U$31","v":0},0,0,0,0,0,0,0,0,0,0,0,null,"Gain","Surface Water","--","--",{"$f":"SUMIF(I100,\">0\")","v":0},null,null,"Distance to marine",null,null,null,"Abuts Cowichan Bay along northeast edge"]
["Hot/Dry (1989)Water Usage","Water Usage",{"$f":"C65*$U$32","v":-274594.86},{"$f":"D65*$U$32","v":-297477.76500000001},-343243.57500000001,-366126.48,-411892.29,-457658.10000000003,-503423.91,-526306.81500000006,-457658.10000000003,-366126.48,-320360.67000000004,-251711.95499999999,-4576581,null,"Loss","Water Usage","--","--",{"$f":"E113","v":-4576581},null,null,"Geomorphological setting",null,null,null,"Plateau-like bench flanked to west and northwest by the west-northwest trending Koksilah River / Dougan's Lake valley and Glenora / Kelvin hillslopes, southwest by the Cobble Hill uplands, and northeast-east by steep bluffs along the marine shoreline.  Deep, short ravines commonly developed along Cowichan Bay bluffs.  Deep, stratigraphically complex morainal  / glaciofluvial outwash blanket on south side of the NW-trending Cowichan River regional lineament, contains four subplanar surface depressions aligned roughly northwest within in the southeast corner of the AQ that may be former glacial kettles (lakes)"]
["Hot/Dry (1989)Net Gain",{"$f":"Q33","v":"Net Gain"},{"$f":"SUMIF(C24:C32, \">0\")","v":2239218.7613683012},1291919.0933388136,1999527.4937805962,141200.89994954248,23635.542653684694,22820.523941488675,23635.542653684694,23363.869749619353,22277.178133357989,383285.91675734421,1435942.4214320455,1816454.8286373196,9423282.0723957978,null,"Net Gain",null,null,null,{"$f":"SUMIF(U24:U32, \">0\")","v":7502248.899532917},null,null,"Topography",null,null,null,"Broad, plateau-like, west-northwest trending domed area.  Isolated  northwest-trending conical hills at south end.  Low, chaotic-outline hills at centre east of Dougan's Lake (glaciofluvial outwash / kame deposits from Dougan's-Koksilah lineament).  Local, irregular depressional areas in southeast 1/4 aligned northwest.  Short ravines along Cowichan Bay shoreline"]
["Hot/Dry (1989)Net Loss",{"$f":"Q34","v":"Net Loss"},{"$f":"SUMIF(C24:C32, \"<0\")","v":-1245228.9887200918},-1189087.9673015415,-1273712.1168588889,-1233167.3182166652,-1752057.574913223,-1884852.5276863663,-1872462.781370051,-1585980.9385417486,-1407116.7952142889,-1213427.6077764938,-1193452.7153833157,-1230304.267062302,-17080851.599044975,null,"Net Loss",null,null,null,{"$f":"SUMIF(U24:U32, \"<0\")","v":-15159818.426182095},null,null,"Terrain",null,null,null,"Generally planar to undulating, hummocky east of Dougan's Lake. Irregular, planar depressions southeast of Dougan's Lake. Common short ravines along Cowichan bay shoreline"]
["Hot/Dry (1989)Net Total (Gain - Loss)",{"$f":"Q35","v":"Net Total (Gain - Loss)"},{"$f":"SUM(C33:C34)","v":993989.77264820947},102831.12603727216,725815.3769217073,-1091966.4182671227,-1728422.0322595383,-1862032.0037448776,-1848827.2387163662,-1562617.0687921292,-1384839.6170809309,-830141.6910191495,242489.70604872983,586150.56157501764,-7657569.526649178,null,"Net Total (Gain - Loss)",null,null,null,{"$f":"SUM(U33:U34)","v":-7657569.526649178},null,null,"Aspect",null,null,null,"Low, west-northwest trending dome, northeast / southeast / southwest, northwest aspects along  peripheral flanks"]
[]
[null,"Monthly Gains and Loses (m3) - ","Cold/Wet (1999)",null,null,null,null,null,null,null,null,null,null,null,null,null,"Summary - Cold/Wet (1999)",null,null,null,null,null,null,"Slope",null,null,null,"Generally low to moderate ground slopes, convex  & radial apart from east of Dougan's Lake (chaotic) and along the Cowichan Bay shoreline (steep, locally incised bluffs)"]
[null,null,"Jan","Feb","Mar","Apr","May","Jun","Jul","Aug","Sep","Oct","Nov","Dec","Total",null,"Gains and Losses","Source","Area (m2)","Infiltration Rate","Q (m3/yr)",null,null,"XS max grade (m/m)",null,null,null,"0.046 ENE at south end of AQ from Braithwaite / Gallier Rd area to Cowichan Bay shoreline"]
[{"$f":"$C$37&B39","v":"Cold/Wet (1999)Direct Recharge to 197"},{"$f":"R39","v":"Direct Recharge to 197"},{"$f":"$U$39*C69","v":5015874.1153206546},{"$f":"$U$39*D69","v":5078292.395242271},1883362.9393919962,-226003.90268975071,-183628.17093542244,-480258.29321572022,-621510.73239681439,-254254.39052596953,-113001.95134487536,1781193.2580735974,2878724.7105106995,3077890.6497560428,{"$f":"SUM(C39:N39)","v":17836680.627186712},null,"Gain","Direct Recharge to 197",{"$f":"10000*(2920.58172234+14.58)","v":29351617.2234},{"$f":"U39/S39","v":0.60768987587391843},{"$f":"E75","v":17836680.627186712},null,null,"Roughness coefficient",null,null,null,"0.50 (isolated, open deciduous-coniferous tree stands, extensive cleared agricultural / rural residential areas)"]
["Cold/Wet (1999)Leakage down  to 204","Leakage down  to 204",{"$f":"$U$40*C$70","v":-124571.17301228101},{"$f":"$U$40*D$70","v":-119957.42586367801},-133798.66730948701,-132260.751593286,-138412.41445809,-132260.751593286,-133798.66730948701,-130722.83587708502,-124571.17301228101,-126109.08872848202,-119957.42586367801,-121495.34157987901,{"$f":"SUM(C40:N40)","v":-1537915.7162010001},null,"Loss","Leakage down  to 204",{"$f":"10000*512.638572067","v":5126385.7206700006},0.3,{"$f":"-S40*T40","v":-1537915.7162010001}]
["Cold/Wet (1999)Leakage down to 198","Leakage down to 198",{"$f":"$U$41*C$70","v":-40499.86236318},{"$f":"$U$41*D$70","v":-38999.867460839996},-43499.852167859994,-42999.853867079997,-44999.847070199998,-42999.853867079997,-43499.852167859994,-42499.855566300001,-40499.86236318,-40999.860663960004,-38999.867460839996,-39499.86576162,-499998.30077999999,null,"Loss","Leakage down to 198",{"$f":"10000*499.99830078","v":4999983.0077999998},0.1,{"$f":"-S41*T41","v":-499998.30077999999},null,"Geology"]
["Cold/Wet (1999)Leakage to depth","Leakage to depth",{"$f":"$U$42*C$70","v":-155724.51280893301},{"$f":"$U$42*D$70","v":-149956.93826045399},-167259.66190589097,-165337.13705639797,-173027.23645437,-165337.13705639797,-167259.66190589097,-163414.612206905,-155724.51280893301,-157647.03765842601,-149956.93826045399,-151879.46310994698,-1922524.8494929997,null,"Loss","Leakage to depth",{"$f":"S39-S40-S41","v":19225248.494929999},0.1,{"$f":"-S42*T42","v":-1922524.849493},null,null,"Terrane",null,null,null,"Overlap / Wrangellia"]
["Cold/Wet (1999)Lateral Groundwater","Lateral Groundwater",{"$f":"$U$43*C$70","v":-476398.73463635572},{"$f":"$U$43*D$70","v":-458754.3370572314},-511687.52979460423,-505806.06393489614,-529331.92737372848,-505806.06393489614,-511687.52979460423,-499924.59807518811,-476398.73463635572,-482280.2004960638,-458754.3370572314,-464635.80291693949,-5881465.859708094,null,"Loss","Lateral Groundwater","--","--",{"$f":"SUMIF(M83:M95,\"<0\")","v":-5881465.859708095},null,null,"Bedrock (type ; age ; formation ; lithology)",null,null,null,"                                                                                                                                                                                                                                                                                                                                                      "]
["Cold/Wet (1999)Lateral Groundwater","Lateral Groundwater",{"$f":"$U$44*C70","v":22005.505229292648},{"$f":"$U$44*D70","v":21190.486517096626},23635.542653684694,23363.869749619353,24450.56136588072,23363.869749619353,23635.542653684694,23092.196845554015,22005.505229292648,22277.178133357989,21190.486517096626,21462.159421161967,271672.90406534134,null,"Gain","Lateral Groundwater","--","--",{"$f":"SUMIF(M83:M95,\">0\")","v":271672.90406534134},null,null,null,"Primary",null,null," Northern 5/6 of AQ underlain by Upper Cretaceous; Nanaimo Group (uKN); mainly shale + subordinate sandstone"]
["Cold/Wet (1999)Surface Water","Surface Water",{"$f":"$U$45*C$71","v":-163597.94117316001},{"$f":"$U$45*D$71","v":-143625.44311170239},-103748.54485959266,-50162.745943551403,-17786.524437769673,-7214.1861264744457,-4284.3791402696852,-1391.658318447262,-1170.0684862627877,-10739.226051015748,-75897.76256256584,-161714.21978918815,-741332.70000000007,null,"Loss","Surface Water","--","--",{"$f":"SUMIF(I100,\"<0\")","v":-741332.7},null,null,null,"Secondary",null,null,"Southern 1/6 of AQ underlain by Middle to Upper Devonian Sicker Group Duck Lake Volcanics (muDSiD); basaltic volcanic rocks (80%) / Triassic Karmutsen Volcanics (uTrVK); basaltic (15%) / Carboniferous Buttle Lake Group (PnPBM); limestone (5%) "]
["Cold/Wet (1999)Surface Water","Surface Water",{"$f":"$U$46*C$71","v":0},{"$f":"$U$46*D$71","v":0},0,0,0,0,0,0,0,0,0,0,0,null,"Gain","Surface Water","--","--",{"$f":"SUMIF(I100,\">0\")","v":0},null,null,null,"Tertiary",null,null,"Southeast tip of AQ underlain by Early to Middle Jurassic Island Plutonic Suite (EMJIgd); granodioritic intrusive rocks (south of San Juan Fault)"]
["Cold/Wet (1999)Water Usage","Water Usage",{"$f":"$U$47*C72","v":-274594.86},{"$f":"$U$47*D72","v":-297477.76500000001},-343243.57500000001,-366126.48,-411892.29,-457658.10000000003,-503423.91,-526306.81500000006,-457658.10000000003,-366126.48,-320360.67000000004,-251711.95499999999,-4576581,null,"Loss","Water Usage","--","--",{"$f":"E113","v":-4576581},null,null,"Structure",null,null,null,"Southern tip of AQ underlain by east-northeast trending San Juan Fault ;                                                                                                                  Northeast portion of AQ underlain by two southernmost splays of theCowichan Lake Thrust zone"]
["Cold/Wet (1999)Net Gain",{"$f":"Q48","v":"Net Gain"},{"$f":"SUMIF(C39:C47, \">0\")","v":5037879.620549947},5099482.8817593679,1906998.482045681,23363.869749619353,24450.56136588072,23363.869749619353,23635.542653684694,23092.196845554015,22005.505229292648,1803470.4362069555,2899915.1970277959,3099352.8091772045,19987010.9723606,null,"Net Gain",null,null,null,{"$f":"SUMIF(U39:U47, \">0\")","v":18108353.531252053},null,null,"Surficial (formation; lithology; thickness)",null,null,null,"Primarily Vashon Drift morainal / glaciofluvial / glaciomarine over basal Quadra Sands glaciofluvial; silt-sand; generally deep blankets (50 - 100 m).  Capilano Formation glaciofluvial-glaciolacustrine kame / kettle deposits within an arcuate linear zone east and southeast of Dougan's Lake.  Salish Formation fluvial veneers along Garnett and Manley Creeks"]
["Cold/Wet (1999)Net Loss",{"$f":"Q49","v":"Net Loss"},{"$f":"SUMIF(C39:C47, \"<0\")","v":-1235387.0839939099},-1208771.7767539057,-1303237.831037435,-1488696.9350849623,-1499078.4107295808,-1791534.3857938547,-1985464.7327149264,-1618514.765569895,-1369024.4026518881,-1183901.8935979474,-1163927.0012047694,-1190936.6481575735,-17038475.86729065,null,"Net Loss",null,null,null,{"$f":"SUMIF(U39:U47, \"<0\")","v":-15159818.426182095},null,null,"Surficial designation (1993)",null,null,null,"Generally dMbh/$LGp//sgFGf; isolated depressional areas in northeast part of Aq = $LGp and $Op.  Unmapped sgFG kame deposits east of Dougan's Lake"]
["Cold/Wet (1999)Net Total (Gain - Loss)",{"$f":"Q50","v":"Net Total (Gain - Loss)"},{"$f":"SUM(C48:C49)","v":3802492.5365560371},3890711.1050054622,603760.651008246,-1465333.0653353429,-1474627.8493637,-1768170.5160442353,-1961829.1900612416,-1595422.568724341,-1347018.8974225954,619568.54260900803,1735988.1958230266,1908416.161019631,2948535.1050699553,null,"Net Total (Gain - Loss)",null,null,null,{"$f":"SUM(U48:U49)","v":2948535.1050699577},null,null,"Soils (association; parent; texture; drainage; type; comments)",null,null,null,"Northern 4/5 = FF2 and FF1v8TT71QU1/d (Finlayson & Tagner marine, subordinate Quamichan fluvial), generally silt-clay loam to clay loam, GLE.DYB / O.HG;                                                                                                                                                                                                                    Southern 1/5 with elevated topographic areas = SE1v8DD1v1QU11/de (Somenos moraine / subordinate Dashwood Creek marine & Quamichan fluvial), generally gravelly-sandy loam, DU.DYB;                                                                                                                               Small area  south of Cherry Point = QU1 (Quamichan fluvial); very gravelly-sandy loam; DU.DYB                                                                                                                                                                            "]
[null,null,null,null,null,null,null,null,null,null,null,null,null,null,null,null,"Table G-2.  Direct Recharge Calculation for AQ197"]
[null,"Table G-5  Monthly  Coefficients used in Calculations for AQ197",null,null,null,null,null,null,null,null,null,null,null,null,null,null,"Direct Recharge Calculation"]
[null,"Monthly Factors","30 Year Average",null,null,null,null,null,null,null,null,null,null,null,null,null,null,"Hot/Dry","Average","Cold/Wet",null,null,null,"Restrictive layers",null,null,null,"Yes - low permeability due to near surface silt-clay soils in Finlayson/Tagner soil areas / low permeability due to surface duric layers in Somenos (morainal) and Dashwood Creek (marine) soil areas"]
[null,null,"Jan","Feb","Mar","Apr","May","Jun","Jul","Aug","Sep","Oct","Nov","Dec",null,null,"Surplus (mm)",{"$f":"SUM('Climate Dashboard'!AA42:AL42)","v":511.89034592156941},{"$f":"SUM('Climate Dashboard'!C48:AL48)/3","v":760.90447463619182},{"$f":"SUM('Climate Dashboard'!AA54:AL54)","v":1262.7520438297711},null,null,null,"Estimated permeability",null,null,null,"Generally low throughout AQ"]
[null,"Surplus Water",{"$f":"'Monthly Factors'!B16","v":0.25146830548450599},{"$f":"'Monthly Factors'!C16","v":0.16379677075085},{"$f":"'Monthly Factors'!D16","v":0.1182073911233482},{"$f":"'Monthly Factors'!E16","v":2.8387626824061124E-2},{"$f":"'Monthly Factors'!F16","v":-3.4169860825738051E-2},{"$f":"'Monthly Factors'!G16","v":-5.3883242071356162E-2},{"$f":"'Monthly Factors'!H16","v":-5.2569016654981621E-2},{"$f":"'Monthly Factors'!I16","v":-2.3656057494741728E-2},{"$f":"'Monthly Factors'!J16","v":-7.8853524982472421E-3},{"$f":"'Monthly Factors'!K16","v":8.6453811443823317E-2},{"$f":"'Monthly Factors'!L16","v":0.26525988999485034},{"$f":"'Monthly Factors'!M16","v":0.25858973392362583},null,null,"Station Coeffiecient Factor",1.03,1.03,1.03]
[null,"Leakance/\nLateral Ground Water",{"$f":"'Monthly Factors'!B42","v":8.1000000000000003E-2},{"$f":"'Monthly Factors'!C42","v":7.8E-2},{"$f":"'Monthly Factors'!D42","v":8.6999999999999994E-2},{"$f":"'Monthly Factors'!E42","v":8.5999999999999993E-2},{"$f":"'Monthly Factors'!F42","v":0.09},{"$f":"'Monthly Factors'!G42","v":8.5999999999999993E-2},{"$f":"'Monthly Factors'!H42","v":8.6999999999999994E-2},{"$f":"'Monthly Factors'!I42","v":8.5000000000000006E-2},{"$f":"'Monthly Factors'!J42","v":8.1000000000000003E-2},{"$f":"'Monthly Factors'!K42","v":8.2000000000000003E-2},{"$f":"'Monthly Factors'!L42","v":7.8E-2},{"$f":"'Monthly Factors'!M42","v":7.9000000000000001E-2},null,null,"Infiltration Coefficient",0.46722567081499999,0.46722567081499999,0.46722567081499999,null,null,"Hydrology"]
[null,"Surface Water",{"$f":"'Monthly Factors'!B26","v":0.22068086457424585},{"$f":"'Monthly Factors'!C26","v":0.19373952223030552},{"$f":"'Monthly Factors'!D26","v":0.13994869625957773},{"$f":"'Monthly Factors'!E26","v":6.7665632372012466E-2},{"$f":"'Monthly Factors'!F26","v":2.399263439717373E-2},{"$f":"'Monthly Factors'!G26","v":9.7313744914725147E-3},{"$f":"'Monthly Factors'!H26","v":5.7792933459831003E-3},{"$f":"'Monthly Factors'!I26","v":1.8772385441074731E-3},{"$f":"'Monthly Factors'!J26","v":1.5783311410150771E-3},{"$f":"'Monthly Factors'!K26","v":1.4486378451963268E-2},{"$f":"'Monthly Factors'!L26","v":0.10238016286421177},{"$f":"'Monthly Factors'!M26","v":0.21813987132793164},null,null,"Area (m2)",{"$f":"S9","v":29351617.2234},{"$f":"S9","v":29351617.2234},{"$f":"S9","v":29351617.2234},null,null,null,"GW / SW basin coincidence",null,null,null,"No - straddles three separate catchments: (1)  northeast 1/2 of AQ with streams flowing directly into Cowichan Bay (including Garnett Creek, Manley Creek, and numerous short, unnamed streams; (2) south part of AQ containing Hutchinson Lake & south-flowing tributaries of Shawnigan Creek; and (3) southwest-central part of AQ containing Dougan's Lake and headwaters of Patrolas Creek that drain west towards the Koksilah River + northwest border of AQ approximately defined by Koksilah River"]
[null,"Water Usage",{"$f":"'Monthly Factors'!B31","v":0.06},{"$f":"'Monthly Factors'!C31","v":6.5000000000000002E-2},{"$f":"'Monthly Factors'!D31","v":7.4999999999999997E-2},{"$f":"'Monthly Factors'!E31","v":0.08},{"$f":"'Monthly Factors'!F31","v":0.09},{"$f":"'Monthly Factors'!G31","v":0.1},{"$f":"'Monthly Factors'!H31","v":0.11},{"$f":"'Monthly Factors'!I31","v":0.115},{"$f":"'Monthly Factors'!J31","v":0.1},{"$f":"'Monthly Factors'!K31","v":0.08},{"$f":"'Monthly Factors'!L31","v":7.0000000000000007E-2},{"$f":"'Monthly Factors'!M31","v":5.5E-2},null,null,"Q (m3/yr)",{"$f":"(R54/1000)*R55*R56*R57","v":7230575.9954675753},{"$f":"(S54/1000)*S55*S56*S57","v":10747961.30261711},{"$f":"(T54/1000)*T55*T56*T57","v":17836680.627186712},null,null,null,"Catchments",null,null,null,"Cowichan Bay / Shawnigan Creek / Koksilah River"]
[null,null,null,null,null,null,null,null,null,null,null,null,null,null,null,null,"Average Infiltration Rate",{"$f":"R58/R57","v":0.24634335956463552},{"$f":"S58/S57","v":0.36617952669567078},{"$f":"T58/T57","v":0.60768987587391843},null,null,null,"Drainage regime",null,null,null,"Generally radial off central topographic dome.  Dendretic to trellised within southeast portion and around Dougan's Lake"]
[null,"Monthly Factors","Hot/Dry (1989)",null,null,null,null,null,null,null,null,null,null,null,null,null,null,null,null,null,null,null,null,"Surface waters",null,null,null,"Garnett Creek, Manley Creek, dozens of short streams flowing directly into Cowichan Bay / Dougan's lake and Patrolas Creek flowing towards Koksilah River / Hutchinson Lake & northern headwater streams of Shawnigan Creek"]
[null,null,"Jan","Feb","Mar","Apr","May","Jun","Jul","Aug","Sep","Oct","Nov","Dec",null,null,null,null,null,null,null,null,null,"Runoff coefficient",null,null,null,"~50% cleared-agricultural / ~30% forested / 20% rural residential / moderate slope =   0.55"]
[null,"Surplus Water",{"$f":"'Monthly Factors'!B11","v":0.30660649782598431},{"$f":"'Monthly Factors'!C11","v":0.17581890480464263},{"$f":"'Monthly Factors'!D11","v":0.27338167402959174},{"$f":"'Monthly Factors'!E11","v":1.6409764448433315E-2},{"$f":"'Monthly Factors'!F11","v":-6.4466931761702304E-2},{"$f":"'Monthly Factors'!G11","v":-8.2048822242166558E-2},{"$f":"'Monthly Factors'!H11","v":-7.032756192185706E-2},{"$f":"'Monthly Factors'!I11","v":-2.9303150800773774E-2},{"$f":"'Monthly Factors'!J11","v":-1.9535433867182515E-2},{"$f":"'Monthly Factors'!K11","v":4.9815356361315413E-2},{"$f":"'Monthly Factors'!L11","v":0.19554969301049696},{"$f":"'Monthly Factors'!M11","v":0.24810001011321794},null,null,null,null,null,null,null,null,null,"Nearest Active EC hydrometric station; distance; type",null,null,null,"Shawnigan Creek @ Mill Bay 2.04 km south of AQ (inactive);                                                                                                                                                                  EC 08HA003 Koksilah River  @ Cowichan Station adjacent to northwest corner of AQ, active realtime;                                                                                                      "]
[null,"Leakance/\nLateral Ground Water",{"$f":"'Monthly Factors'!B43","v":8.2000000000000003E-2},{"$f":"'Monthly Factors'!C43","v":7.5999999999999998E-2},{"$f":"'Monthly Factors'!D43","v":8.4000000000000005E-2},{"$f":"'Monthly Factors'!E43","v":8.3000000000000004E-2},{"$f":"'Monthly Factors'!F43","v":8.6999999999999994E-2},{"$f":"'Monthly Factors'!G43","v":8.4000000000000005E-2},{"$f":"'Monthly Factors'!H43","v":8.6999999999999994E-2},{"$f":"'Monthly Factors'!I43","v":8.5999999999999993E-2},{"$f":"'Monthly Factors'!J43","v":8.2000000000000003E-2},{"$f":"'Monthly Factors'!K43","v":8.5000000000000006E-2},{"$f":"'Monthly Factors'!L43","v":8.1000000000000003E-2},{"$f":"'Monthly Factors'!M43","v":8.3000000000000004E-2},null,null,null,null,null,null,null,null,null,"Surface water diversions ; relevance",null,null,null,"> 50 licences within Cowichan Bay catchment, accessing streams and springs flowing directly into Cowichan Bay; moderate to high relevance for upper AQ zones;                                                                                                                                                                                                    > 15 licences within Dougan's Lake and Patrolas Creek flowing towards Koksilah River - moderate to high relevance for upper AQ zones"]
[null,"Surface Water",{"$f":"'Monthly Factors'!B26","v":0.22068086457424585},{"$f":"'Monthly Factors'!C26","v":0.19373952223030552},{"$f":"'Monthly Factors'!D26","v":0.13994869625957773},{"$f":"'Monthly Factors'!E26","v":6.7665632372012466E-2},{"$f":"'Monthly Factors'!F26","v":2.399263439717373E-2},{"$f":"'Monthly Factors'!G26","v":9.7313744914725147E-3},{"$f":"'Monthly Factors'!H26","v":5.7792933459831003E-3},{"$f":"'Monthly Factors'!I26","v":1.8772385441074731E-3},{"$f":"'Monthly Factors'!J26","v":1.5783311410150771E-3},{"$f":"'Monthly Factors'!K26","v":1.4486378451963268E-2},{"$f":"'Monthly Factors'!L26","v":0.10238016286421177},{"$f":"'Monthly Factors'!M26","v":0.21813987132793164}]
[null,"Water Usage",{"$f":"'Monthly Factors'!B31","v":0.06},{"$f":"'Monthly Factors'!C31","v":6.5000000000000002E-2},{"$f":"'Monthly Factors'!D31","v":7.4999999999999997E-2},{"$f":"'Monthly Factors'!E31","v":0.08},{"$f":"'Monthly Factors'!F31","v":0.09},{"$f":"'Monthly Factors'!G31","v":0.1},{"$f":"'Monthly Factors'!H31","v":0.11},{"$f":"'Monthly Factors'!I31","v":0.115},{"$f":"'Monthly Factors'!J31","v":0.1},{"$f":"'Monthly Factors'!K31","v":0.08},{"$f":"'Monthly Factors'!L31","v":7.0000000000000007E-2},{"$f":"'Monthly Factors'!M31","v":5.5E-2},null,null,null,null,null,null,null,null,"Land Cover"]
[null,null,null,null,null,null,null,null,null,null,null,null,null,null,null,null,null,null,null,null,null,null,null,"Vegetation zone",null,null,null,"Cgf-wC "]
[null,"Monthly Factors","Cold/Wet (1999)",null,null,null,null,null,null,null,null,null,null,null,null,null,null,null,null,null,null,null,null,"Primary land uses",null,null,null,"Mainly agricultural and rural residential, subordinate forestry"]
[null,null,"Jan","Feb","Mar","Apr","May","Jun","Jul","Aug","Sep","Oct","Nov","Dec",null,null,null,null,null,null,null,null,"Degree of development",null,null,null,null,"Extensive agricultural / rural residential clearing.  Very low impervious cover"]
[null,"Surplus Water",{"$f":"'Monthly Factors'!B21","v":0.28121118610350893},{"$f":"'Monthly Factors'!C21","v":0.28471061972718881},{"$f":"'Monthly Factors'!D21","v":0.1055893178084587},{"$f":"'Monthly Factors'!E21","v":-1.2670737757409583E-2},{"$f":"'Monthly Factors'!F21","v":-1.0294974427895285E-2},{"$f":"'Monthly Factors'!G21","v":-2.6925317734495361E-2},{"$f":"'Monthly Factors'!H21","v":-3.4844528832876351E-2},{"$f":"'Monthly Factors'!I21","v":-1.425457997708578E-2},{"$f":"'Monthly Factors'!J21","v":-6.3353688787047913E-3},{"$f":"'Monthly Factors'!K21","v":9.9861251950584262E-2},{"$f":"'Monthly Factors'!L21","v":0.16139352218500455},{"$f":"'Monthly Factors'!M21","v":0.17255960983372176},null,null,null,null,null,null,null,null,"Evapotranspiration potential",null,null,null,null,"High"]
[null,"Leakance/\nLateral Ground Water",{"$f":"'Monthly Factors'!B44","v":8.1000000000000003E-2},{"$f":"'Monthly Factors'!C44","v":7.8E-2},{"$f":"'Monthly Factors'!D44","v":8.6999999999999994E-2},{"$f":"'Monthly Factors'!E44","v":8.5999999999999993E-2},{"$f":"'Monthly Factors'!F44","v":0.09},{"$f":"'Monthly Factors'!G44","v":8.5999999999999993E-2},{"$f":"'Monthly Factors'!H44","v":8.6999999999999994E-2},{"$f":"'Monthly Factors'!I44","v":8.5000000000000006E-2},{"$f":"'Monthly Factors'!J44","v":8.1000000000000003E-2},{"$f":"'Monthly Factors'!K44","v":8.2000000000000003E-2},{"$f":"'Monthly Factors'!L44","v":7.8E-2},{"$f":"'Monthly Factors'!M44","v":7.9000000000000001E-2},null,null,null,null,null,null,null,null,"Relative environmental sensitivity",null,null,null,null,"Moderate in terrestrial areas, high along creeks, lakes, and depressional wetlands"]
[null,"Surface Water",{"$f":"'Monthly Factors'!B26","v":0.22068086457424585},{"$f":"'Monthly Factors'!C26","v":0.19373952223030552},{"$f":"'Monthly Factors'!D26","v":0.13994869625957773},{"$f":"'Monthly Factors'!E26","v":6.7665632372012466E-2},{"$f":"'Monthly Factors'!F26","v":2.399263439717373E-2},{"$f":"'Monthly Factors'!G26","v":9.7313744914725147E-3},{"$f":"'Monthly Factors'!H26","v":5.7792933459831003E-3},{"$f":"'Monthly Factors'!I26","v":1.8772385441074731E-3},{"$f":"'Monthly Factors'!J26","v":1.5783311410150771E-3},{"$f":"'Monthly Factors'!K26","v":1.4486378451963268E-2},{"$f":"'Monthly Factors'!L26","v":0.10238016286421177},{"$f":"'Monthly Factors'!M26","v":0.21813987132793164}]
[null,"Water Usage",{"$f":"'Monthly Factors'!B31","v":0.06},{"$f":"'Monthly Factors'!C31","v":6.5000000000000002E-2},{"$f":"'Monthly Factors'!D31","v":7.4999999999999997E-2},{"$f":"'Monthly Factors'!E31","v":0.08},{"$f":"'Monthly Factors'!F31","v":0.09},{"$f":"'Monthly Factors'!G31","v":0.1},{"$f":"'Monthly Factors'!H31","v":0.11},{"$f":"'Monthly Factors'!I31","v":0.115},{"$f":"'Monthly Factors'!J31","v":0.1},{"$f":"'Monthly Factors'!K31","v":0.08},{"$f":"'Monthly Factors'!L31","v":7.0000000000000007E-2},{"$f":"'Monthly Factors'!M31","v":5.5E-2}]
[null,null,null,null,null,null,null,null,null,null,null,null,null,null,null,null,null,null,null,null,null,null,"Groundwater occurrence (primary / secondary)",null,null,null,null,"Granular pore space infillings"]
[null,"Area (m2)",{"$f":"S9","v":29351617.2234},{"$f":"S9","v":29351617.2234},{"$f":"S9","v":29351617.2234},null,null,null,null,null,null,null,null,null,null,null,null,null,null,null,null,null,"Primary porosity",null,null,null,null,"Variable: low in morainal & glaciomarine materials, moderate to high in glaciofluvial materials.  Suspected  multiple stacked AQ zones separated by aquitards, moderate  lateral continuity along northwest-southeast axis due to glacial outwash wasting patterns"]
[null,"Q (m3/yr)",{"$f":"(R54/1000)*R55*R56*C74","v":7230575.9954675753},{"$f":"(S54/1000)*S55*S56*D74","v":10747961.30261711},{"$f":"(T54/1000)*T55*T56*E74","v":17836680.627186712},null,null,null,null,null,null,null,null,null,null,null,null,null,null,null,null,null,"Secondary porosity",null,null,null,null,"Generally not applicable - surficial AQ; increased secondary porosity in morainal areas with near-surface prismatic structure"]
[null,"Average Infiltration Rate",{"$f":"C75/C74","v":0.24634335956463552},{"$f":"D75/D74","v":0.36617952669567078},{"$f":"E75/E74","v":0.60768987587391843},null,null,null,null,null,null,null,null,null,null,null,null,null,null,null,null,null,"Confinement",null,null,null,null,"                           Suspected variable degrees of confinement based on the composite nature of the AQ: (1)  surface and near-surface glaciofluvial and morainal components may be unconfined to semi-confined by duric till blankets;                                                                                                                          (2) subsurface morainal and glaciofluvial components may be semi-confined to confined due to overlying unstructured, dense moraine and/or glaciomarine-glaciolacustrine aquitards (3) deep morainal and glaciofluvial components may be confined due to their depth below ground (including locations where water-bearing zones are below seas level)                                                                                                            WP = 0 - 87.8 m, avg 20.0 m                                                                                                                                                          "]
[null,null,null,null,null,null,null,null,null,null,null,null,null,null,null,null,null,null,null,null,null,null,"Aquifer thickness",null,null,null,null,"Thickness of composite AQ  highly variable - locally > 100 m.                                                                                                                                                   Individual \"sub-aquifer\" water-bearing zones likely much thinner (<5 m)"]
[null,"TABLE G-6",null,null,null,null,null,null,null,null,null,null,null,null,null,null,null,null,null,null,null,null,"Hydraulic anisotropy",null,null,null,null,"Moderate to high due to probable stratigraphic complexity"]
[null,"Groundwater Flow Components: Aquifer #0197, Cherry Point (Surficial)",null,null,null,null,null,null,null,null,null,null,null,null,null,null,null,null,null,null,null,null,"Hydraulic gradient",null,null,null,null,"Variable, likely low to moderate based on local terrain"]
[null,null,null,null,null,null,null,null,null,null,null,null,null,null,null,null,null,null,null,null,null,null,"Storage potential",null,null,null,null,"Variably low to high due to probable stratigraphic complexity"]
[null,"Groundwater Flow","Direction of Flow","Source or Receptor of Water","Length (m)","Depth (m)","Area (m)","Hydraulic Conductivity (m/s) - K","Distance (m) - dL","Hydraulic Head (m) - dh",null,null,"GW Flow (m3/yr)",null,null,null,null,null,null,null,null,null,"Yield potential",null,null,null,null,"Variable low-high depending on AQ host materials; WP = 0.01 - 17.35 L/s / average 0.63 L/s"]
[null,null,null,null,null,null,null,null,null,"Year 1","Year 2","Year 3","Year 1","Year 2","Year 3",null,null,null,null,null,null,null,"Flow velocities",null,null,null,null,"Variably low to moderate due to probable stratigraphic complexity"]
[null,"QGW1 (A1)","Out","Ocean",3000,5,{"$f":"E83*F83","v":15000},{"$f":"10^-4","v":1E-4},700,30,null,null,{"$f":"-G83*H83*(J83/I83)*(3600*24*365)","v":-2027314.2857142854},null,null,null,null,null,null,null,null,null,null,"Flow directions",null,null,null,"Near-surface unconfined / semi-confined AQ zones: flow likely mirrors topography, radially to the south, southwest, and northeast                                                                                                                                                                                                                                                                  Deeper semi-confined to confined AQ zones: flow direction uncertain, may be driven by upgradient heads northeast towards Cowichan Bay and/or southeast along axis of assumed glacial outwash direction.                                                                                                                             Deep confined AQ zones at bedrock interface: flow may be influenced by bedrock surface irregularities + regional northwest-trending structural and stratigraphic fabrics "]
[null,"QGW2 (A2)","Out","Ocean",8700,10,{"$f":"8700*10","v":87000},{"$f":"10^-5","v":1.0000000000000001E-5},1900,50,null,null,{"$f":"-G84*H84*(J84/I84)*(3600*24*365)","v":-722008.42105263169},null,null,null,null,null,null,null,null,null,null,"Static water levels",null,null,null,"WP = variable 0 - 93 m bgs / avg 27.4 m bgs"]
[null,"QGW3 (B)","Out","Ocean",3200,10,{"$f":"3200*10","v":32000},{"$f":"10^-5","v":1.0000000000000001E-5},1500,70,null,null,{"$f":"-G85*H85*(J85/I85)*(3600*24*365)","v":-470937.60000000003},null,null,null,null,null,null,null,null,null,null,"Hydraulic connection with surface waters",null,null,null,"Near-surface unconfined / semi-confined AQ zones: moderate to high with radial creeks, depending on depths of incision.  Historical groundwater \"bursts\" recorded within Cowichan Bay ravines, resulting in periodic debris flows & flooding of coastal ravine termini areas.                                                                                                                                                                                                                                                Deeper semi-confined to confined AQ zones: low connectivity due to deep overburden cover;                                                                     Deep confined AQ zones at bedrock interface: negligible due to relative elevation differences (basal AQ zones often positioned below sea level)"]
[null,"QGW4 (C )","Out","AQ 199",2000,45,{"$f":"2000*45","v":90000},{"$f":"10^-4","v":1E-4},3200,20,null,null,{"$f":"-G86*H86*(J86/I86)*(3600*24*365)","v":-1773900},null,null,null,null,null,null,null,null,null,null,"Hydraulic connection to adjacent AQ"]
[null,"QGW5 (D)","Out","AQ 198 (QGW9)",5200,5,{"$f":"5200*5","v":26000},{"$f":"10^-5","v":1.0000000000000001E-5},400,10,null,null,{"$f":"-G87*H87*(J87/I87)*(3600*24*365)","v":-204984.00000000003},null,null,null,null,null,null,null,null,null,null,null,"Over / Under",null,null,"AQ is locally overlain by surficial AQ 199 to immediate northwest of Dougan's Lake;                                                                                                                                                                                                                        AQ overlies bedrock AQ 198 (north end), bedrock AQ 204 (southeast end)                                                                                                                                Central and southwest portions of AQ also underlain by undeveloped extensions of bedrock AQ 198 (Nanaimo Group sedimentary rocks) and bedrock AQ 204 (mixed intrusive / volcanic rocks) "]
[null,"QGW6","In","AQ 202 (QGW27)",{"$f":"'Bedrock 202'!E108","v":142.80000000000001},{"$f":"'Bedrock 202'!F108","v":200},{"$f":"'Bedrock 202'!G108","v":28560.000000000004},{"$f":"'Bedrock 202'!H108","v":9.9999999999999995E-8},{"$f":"'Bedrock 202'!I108","v":235},{"$f":"'Bedrock 202'!J108","v":20},null,null,{"$f":"-'Bedrock 202'!M108","v":7665.2609361702116},null,null,null,null,null,null,null,null,null,null,null,"Upgradient",null,null,"Near-surface unconfined / semi-confined AQ zones, southwest -central area: in contact with higher-elevation portions of  bedrock AQ 202 and bedrock AQ 204;                                                                                                                                                                                                  Deeper semi-confined to confined AQ zones:  likely receiving recharge from upgradient bedrock sources to the northwest (including bedrock AQ 196) , west, and southwest "]
[null,"QGW7","In","AQ 202 (QGW28)",{"$f":"'Bedrock 202'!E109","v":285.60000000000002},{"$f":"'Bedrock 202'!F109","v":200},{"$f":"'Bedrock 202'!G109","v":57120.000000000007},{"$f":"'Bedrock 202'!H109","v":1.0000000000000001E-9},{"$f":"'Bedrock 202'!I109","v":235},{"$f":"'Bedrock 202'!J109","v":20},null,null,{"$f":"-'Bedrock 202'!M109","v":153.30521872340427},null,null,null,null,null,null,null,null,null,null,null,"Downgradient",null,null,"Near-surface unconfined / semi-confined AQ zones: (1) North end of AQ = surrounded by lower-elevation surficial AQ 186; (2) southwest side of AQ in contact with lower elevation surficial AQ 199 and  its undeveloped triangular southeast extension; (3) southeast end of AQ: in contact with lower elevation bedrock AQ 204"]
[null,"QGW8","In","AQ 202 (QGW29)",{"$f":"'Bedrock 202'!E110","v":1178.0999999999999},{"$f":"'Bedrock 202'!F110","v":200},{"$f":"'Bedrock 202'!G110","v":235619.99999999997},{"$f":"'Bedrock 202'!H110","v":9.9999999999999995E-8},{"$f":"'Bedrock 202'!I110","v":335},{"$f":"'Bedrock 202'!J110","v":100},null,null,{"$f":"-'Bedrock 202'!M110","v":221806.33791044771},null,null,null,null,null,null,null,null,null,null,"Vulnerability to surface contamination",null,null,null,"Variable: (1) near-surface unconfined / semi-confined AQ zones = low-moderate based on surficial lithologies and presence of low-permeability surface soil horizons; (2) deeper semi-confined to confined AQ zones - low to negligible based on deep overburden cover"]
[null,"QGW9","In","AQ 202",250,20,{"$f":"E91*F91","v":5000},9.9999999999999995E-7,{"$f":"'Bedrock 202'!I111","v":525},{"$f":"'Bedrock 202'!J111","v":140},null,null,{"$f":"G91*H91*(J91/I91)*(3600*24*365)","v":42048},null,null,null,null,null,null,null,null,null,null,"Recharge"]
[null,"QGW14 (F1)","Out","AQ 204",750,10,{"$f":"750*10","v":7500},{"$f":"10^-5","v":1.0000000000000001E-5},680,10,null,null,{"$f":"-G92*H92*(J92/I92)*(3600*24*365)","v":-34782.352941176476},null,null,null,null,null,null,null,null,null,null,null,"Vertical inflow",null,null,"Variable: (1) near-surface unconfined / semi-confined AQ zones: moderate to high recharge from precipitation and irrigation-sewerage returns (high levels of rural residential and agricultural development), negligible from snowmelt due to low elevations.  Low to negligible from stream losses due to AQ area's domed topography and radial drainage; (2) deeper semi-confined to confined AQ zones: low to negligible from precipitation due to deep overburden cover"]
[null,"QGW15 (F2)","Out","AQ 204",625,10,{"$f":"625*10","v":6250},{"$f":"10^-5","v":1.0000000000000001E-5},600,5,null,null,{"$f":"-G93*H93*(J93/I93)*(3600*24*365)","v":-16425},null,null,null,null,null,null,null,null,null,null,null,"Lateral inflow",null,null,"Low - moderate lateral inflow from upgradient bedrock sources                                                                                                                          "]
[null,"QGW16 (F3)","Out","AQ 204",150,10,{"$f":"150*10","v":1500},{"$f":"10^-6","v":9.9999999999999995E-7},600,5,null,null,{"$f":"-G94*H94*(J94/I94)*(3600*24*365)","v":-394.20000000000005},null,null,null,null,null,null,null,null,null,null,null,"Temporal variability",null,null,"Variable:  (1) near-surface unconfined / semi-confined AQ zones: moderate to high depending on surficial lithologies and presence of low-permeability surface soil layers (2) Deeper semi-confined to confined AQ zones: negligible due to deep overburden cover"]
[null,"QGW17 (F4)","Out","AQ 204",750,10,{"$f":"750*10","v":7500},{"$f":"10^-4","v":1E-4},1500,40,null,null,{"$f":"-G95*H95*(J95/I95)*(3600*24*365)","v":-630720},null,null,null,null,null,null,null,null,null,null,null,"MBR",null,null,"Low along southwest side from upgradient rocky Cobble Hill (bedrock AQ 202) and exposed areas of bedrock AQ 204 - limited perimeter contact length"]
[null,"Total",null,null,null,null,null,null,null,null,null,null,{"$f":"SUM(M83:M95)","v":-5609792.9556427542},null,null,null,null,null,null,null,null,null,null,"Discharge"]
[null,null,null,null,null,null,null,null,null,null,null,null,null,null,null,null,null,null,null,null,null,null,null,null,"Evapotranspiration",null,null,"Variable: (1)  near-surface unconfined / semi-confined AQ zones: moderate (2) Deeper semi-confined to confined AQ zones: negligible"]
[null,"Surface Water Contributions","Cold Water Creek?","Observed Vertical Gradient","Percent Permeable","Length (m)","Width (m)","Flux (m/s)","SW Flow (m3/yr)",null,null,"Comment",null,null,null,null,null,null,null,null,null,null,null,null,"Outflow to marine",null,null,"Moderate to high due to domed topographic setting relative to Cowichan Bay"]
[null,null,null,null,null,null,null,null,"Year 1","Year 2","Year 3",null,null,null,null,null,null,null,null,null,null,null,null,null,"Outflow to surface waters",null,null,"Variable: (1)  near-surface unconfined / semi-confined AQ zones: moderate to high into radial creek systems (2) Deeper semi-confined to confined AQ zones: negligible"]
[null,"Granular Sediment Deposit","--","Upward",1,2471109,"--",0.3,{"$f":"-E100*F100*H100","v":-741332.7},null,null,"The creeks within AQ 197 run over soils with low permeability therefore it is assumed that creeks are fed by the water moving through the granular area of the aquifer close to Dugeon's Lake. ",null,null,null,null,null,null,null,null,null,null,null,null,"Outflow to other AQ",null,null,"Variable: (1)  near-surface unconfined / semi-confined AQ zones: moderate to lower elevation aquifers (2) Deeper semi-confined to confined AQ zones: low to moderate outflow to underlying bedrock aquifers"]
[null,"Total",null,null,null,null,null,null,{"$f":"SUM(I100:I100)","v":-741332.7},null,null,null,null,null,null,null,null,null,null,null,null,null,null,null,"Temporal variability",null,null,"Variable: (1)  near-surface unconfined / semi-confined AQ zones: moderate to high (2) Deeper semi-confined to confined AQ zones: negligible"]
[]
[null,"Water Well Usage","Water Well Usage Volume (m3/yr)",null,null,null,null,null,null,null,null,"Comments",null,null,null,null,null,null,null,null,null,null,"Groundwater Development"]
[null,null,"Year 1",null,null,"Year 2",null,null,"Year 3",null,null,null,null,null,null,null,null,null,null,null,null,null,null,null,"Nearest BCMOE Observation Wells; distance; completion / relevance",null,null,"AQ contains Well #233 (northwest end); Well #320 (central area); Well 345 (southeast area); high relevancy"]
[null,null,"Total Volume Removed","Adjustment Factor","Adjusted Volume Removed","Total Volume Removed","Adjustment Factor","Adjusted Volume Removed","Total Volume Removed","Adjustment Factor","Adjusted Volume Removed",null,null,null,null,null,null,null,null,null,null,null,null,null,"Total Annual Water Use (m3/yr) as reported by Hatfield (2015)",null,null,null,"  SUMS"]
[null,"Industrial",{"$f":"AB106","v":401500},1,{"$f":"C106*D106","v":401500},null,null,null,null,null,null,"Assuming 100% consumptive",null,null,null,null,null,null,null,null,null,null,null,null,null,"Industrial",null,401500,"Total Commercial and Industrial"]
[null,"Commercial",87600,1,{"$f":"C107*D107","v":87600},null,null,null,null,null,null,"Assuming 100% consumptive",null,null,null,null,null,null,null,null,null,null,null,null,null,"Commercial",null,87600,{"$f":"AB106+AB107","v":489100}]
[null,"Domestic",406867,1,406867,null,null,null,null,null,null,"Assuming 100% consumptive",null,null,null,null,null,null,null,null,null,null,null,null,null,"Domestic",null,406867,"Total Irrigation"]
[null,"Irrigation",2687689,1,2687689,null,null,null,null,null,null,"Assuming 100% consumptive",null,null,null,null,null,null,null,null,null,null,null,null,null,"Irrigation from groundwater (Ministry of AGRICULTURE)",null,2687689,{"$f":"AB109","v":2687689}]
[null,"BCMOE Obs",0,1,0,null,null,null,null,null,null,"Assuming 100% consumptive",null,null,null,null,null,null,null,null,null,null,null,null,null,"BCMOE Obs",null,0]
[null,"Other",149200,1,149200,null,null,null,null,null,null,"Assuming 100% consumptive",null,null,null,null,null,null,null,null,null,null,null,null,null,"Other",null,149200,"Total Domestic + Water Systems + Other"]
[null,"Water Supply Systems",843725,1,843725,null,null,null,null,null,null,"Assuming 100% consumptive",null,null,null,null,null,null,null,null,null,null,null,null,null,"Water Supply Systems",null,843725,{"$f":"AB108+AB111+AB112","v":1399792}]
[null,"Total",{"$f":"-SUM(C106:C112)","v":-4576581},null,{"$f":"-SUM(E106:E112)","v":-4576581}]

{"sheet":"Surficial AQ 199","index":13,"n_rows":108,"n_cols":29,"rows_kept":108,"cut":false,"hidden":false,"merged":[[4,2,4,4],[3,2,3,4],[2,2,2,4],[1,2,1,4],[95,1,97,1],[95,2,95,10],[96,2,96,4],[90,1,91,1],[90,2,91,2],[90,3,91,3],[90,4,91,4],[90,5,91,5],[79,1,80,1],[79,2,80,2],[79,3,80,3],[79,4,80,4],[79,5,80,5],[6,16,6,20],[21,16,21,20],[36,16,36,20],[96,5,96,7],[96,8,96,10],[79,12,79,14],[90,6,91,6],[90,7,91,7],[90,8,90,10],[90,11,91,11],[51,17,51,19],[79,9,79,11],[79,6,80,6],[79,7,80,7],[79,8,80,8]]}
[null,"CHM Aquifer Criteria: Aquifer #0199, Dougan's Lake (Surficial)",null,null,null,null,null,null,null,null,null,null,null,null,null,null,null,null,null,null,null,null,"TABLE H-1"]
[null,"AQ tag","199 Dougan's Lake",null,null,null,null,null,null,null,null,null,null,null,null,null,null,null,null,null,null,null,"CHM Aquifer Criteria: Aquifer #0199, Dougan's Lake (Surficial)"]
[null,"Perimeter (km)",9.35]
[null,"Area (km2)",3.4,null,null,null,null,null,null,null,null,null,null,null,null,null,null,null,null,null,null,null,"BCMOE Criteria"]
[null,"Aquifer materials","Sand and gravel",null,null,null,null,null,null,null,null,null,null,null,null,null,null,null,null,null,null,null,null,"AQ tag",null,null,null,"199 Dougan's Lake"]
[null,"Table H-4 Monthly  Summary of AQ199 Water Budgets",null,null,null,null,null,null,null,null,null,null,null,null,null,null,"Table H-3 Annual Summary of AQ199 Water Budgets",null,null,null,null,null,null,"AQ classification",null,null,null,"IIC (9)"]
[null,"Monthly Gains and Loses (m3)","Average Year",null,null,null,null,null,null,null,null,null,null,null,null,null,"Summary - 30 Year Average",null,null,null,null,null,null,"AQ type",null,null,null,"BCMOE Classification = 4b (SLR Classification = 4a / 4b)"]
[null,"Source","Jan","Feb","Mar","Apr","May","Jun","Jul","Aug","Sep","Oct","Nov","Dec","Total",null,"Gains and Losses","Source","Area (m2)","Infiltration Rate","Q (m3/yr)",null,null,"Location",null,null,null,"Cowichan Station"]
[{"$f":"$C$7&B9","v":"Average YearDirect Recharge to 199"},"Direct Recharge to 199",{"$f":"C55*$U$9","v":339949.18355507927},221429.80753946656,159799.48656008294,38376.011415484107,-46192.764800000012,-72842.436800000025,-71065.792000000016,-31979.606400000008,-10659.868800000002,116873.18828878552,358593.43331525952,349576.33628496423,{"$f":"SUM(C9:N9)","v":1351856.9781591219},null,"Gain","Direct Recharge to 199",{"$f":"10000*328","v":3280000},{"$f":"U9/S9","v":0.41215151773143971},{"$f":"S58","v":1351856.9781591222}]
["Average YearLeakage down to 198","Leakage down to 198",{"$f":"C56*$U$10","v":-6452.4362150385004},-6213.457095963,-6930.3944531894995,-6850.734746830999,-7169.3735722649999,-6850.734746830999,-6930.3944531894995,-6771.0750404725004,-6452.4362150385004,-6532.095921397,-6213.457095963,-6293.1168023215005,{"$f":"SUM(C10:N10)","v":-79659.706358499985},null,"Loss","Leakage down to 198",{"$f":"10000*79.6597063585","v":796597.063585},0.1,{"$f":"M88","v":-79659.7063585}]
["Average YearLeakage down to bedrock","Leakage down to bedrock",{"$f":"C56*$U$11","v":-20115.563784961501},-19370.542904037,-21605.605546810497,-21357.265253169,-22350.626427734998,-21357.265253169,-21605.605546810497,-21108.924959527503,-20115.563784961501,-20363.904078603002,-19370.542904037,-19618.8831976785,-248340.2936415,null,"Loss","Leakage down to bedrock",{"$f":"S9-S10","v":2483402.9364149999},0.1,{"$f":"-S11*T11","v":-248340.2936415},null,null,"Perimeter (km)",null,null,null,9.35]
["Average YearLateral Groundwater ","Lateral Groundwater ",{"$f":"C56*$U$12","v":-166567.20181132076},-160398.04618867926,-178905.51305660376,-176849.12784905659,-185074.66867924528,-176849.12784905659,-178905.51305660376,-174792.74264150945,-166567.20181132076,-168623.58701886793,-160398.04618867926,-162454.43139622643,-2056385.2075471701,null,"Loss","Lateral Groundwater ","--","--",{"$f":"SUMIF(M82:M87, \"<0\")","v":-2056385.2075471699},null,null,"Area (km2)",null,null,null,3.4]
["Average YearLateral Groundwater ","Lateral Groundwater ",{"$f":"C56*$U$13","v":144036.33538587767},138701.65629751183,154705.69356260935,152927.46719982073,160040.37265097519,152927.46719982073,154705.69356260935,151149.24083703212,144036.33538587767,145814.56174866628,138701.65629751183,140479.88266030044,1778226.3627886134,null,"Gain","Lateral Groundwater ","--","--",{"$f":"SUMIF(M82:M87, \">0\")","v":1778226.3627886132},null,null,"Aquifer materials",null,null,null,"Sand and gravel"]
["Average YearSurface Water","Surface Water",{"$f":"C57*$U$14","v":0},0,0,0,0,0,0,0,0,0,0,0,0,null,"Loss","Surface Water","--","--",{"$f":"SUMIF(I93,\"<0\")","v":0},null,null,"Lithostratographic unit",null,null,null,"Vashon Drift"]
["Average YearSurface Water","Surface Water",{"$f":"C57*$U$15","v":0},0,0,0,0,0,0,0,0,0,0,0,0,null,"Gain ","Surface Water","--","--",{"$f":"SUMIF(I94,\">0\")","v":0},null,null,"Productivity",null,null,null,"Moderate"]
["Average YearWell Water Useage","Well Water Useage",{"$f":"C58*$U$16","v":-17715.059999999998},-19191.315000000002,-22143.825000000001,-23620.080000000002,-26572.59,-29525.100000000002,-32477.61,-33953.864999999998,-29525.100000000002,-23620.080000000002,-20667.570000000003,-16238.805,-295251,null,"Loss","Water Usage","--","--",{"$f":"E106","v":-295251},null,null,"Vulnerability",null,null,null,"Low"]
["Average YearNet Gain","Net Gain",{"$f":"SUMIF(C9:C16, \">0\")","v":483985.51894095691},360131.46383697842,314505.18012269225,191303.47861530483,160040.37265097519,152927.46719982073,154705.69356260935,151149.24083703212,144036.33538587767,262687.7500374518,497295.08961277135,490056.2189452647,3362823.8097477355,null,"Net Gain",null,null,null,{"$f":"SUMIF(U8:U16, \">0\")","v":3130083.3409477351},null,null,"Demand",null,null,null,"Moderate"]
["Average YearNet Loss","Net Loss",{"$f":"SUMIF(C9:C16, \"<0\")","v":-210850.26181132076},-205173.36118867926,-229585.33805660377,-228677.20784905658,-287360.02347924531,-307424.66464905662,-310984.91505660373,-268606.21404150949,-233320.17061132076,-219139.66701886791,-206649.61618867927,-204605.23639622642,-2912376.67634717,null,"Net Loss",null,null,null,{"$f":"SUMIF(U8:U16, \"<0\")","v":-2679636.2075471701},null,null,"Use",null,null,null,"Multiple"]
["Average YearNet Total (Gain - Loss)","Net Total (Gain - Loss)",{"$f":"SUM(C17:C18)","v":273135.25712963613},{"$f":"SUM(D17:D18)","v":154958.10264829916},84919.842066088488,-37373.729233751743,-127319.65082827013,-154497.19744923589,-156279.22149399438,-117456.97320447737,-89283.835225443094,43548.083018583886,290645.47342409205,285450.98254903825,450447.13340056536,null,"Net Total (Gain - Loss)",null,null,null,{"$f":"SUM(U17:U18)","v":450447.13340056501}]
[null,null,null,null,null,null,null,null,null,null,null,null,null,null,null,null,null,null,null,null,null,null,"Location"]
[null,null,null,null,null,null,null,null,null,null,null,null,null,null,null,null,null,null,null,null,null,null,null,"NTS 50000",null,null,null,"092B/12"]
[null,"Monthly Gains and Loses (m3)","Hot/Dry (1989)",null,null,null,null,null,null,null,null,null,null,null,null,null,"Summary - Hot/Dry (1989)",null,null,null,null,null,null,"TRIM 20000",null,null,null,"092B.072"]
[null,"Source","Jan","Feb","Mar","Apr","May","Jun","Jul","Aug","Sep","Oct","Nov","Dec","Total",null,"Gains and Losses","Source","Area (m2)","Infiltration Rate","Q (m3/yr)",null,null,"Lat / Long (Centre)",null,null,null,"48o43'02\" / 123o38'36\""]
[{"$f":"$C$22&B24","v":"Hot/Dry (1989)Direct Recharge to 199"},"Direct Recharge to 199",{"$f":"C62*$U$24","v":278842.45812622429},{"$f":"D62*$U$24","v":159898.03200000001},248626.23112553338,14923.816320000004,-58629.27840000001,-74619.081600000005,-63959.212800000008,-26649.672000000002,-17766.448,45304.4424,177842.14447999999,225633.88960000002,{"$f":"SUM(C24:N24)","v":909447.32125175756},null,"Gain","Direct Recharge to 199",{"$f":"10000*328","v":3280000},{"$f":"U24/S24","v":0.2772705247718773},{"$f":"R58","v":909447.32125175756},null,null,"UTM Zone 10 (Centre)",null,null,null,"452678E / 5396234N"]
["Hot/Dry (1989)Leakage down to 198","Leakage down to 198",{"$f":"C63*$U$25","v":-6532.095921397},{"$f":"D63*$U$25","v":-6054.1376832460001},-6691.415334114,-6611.7556277555004,-6930.3944531894995,-6691.415334114,-6930.3944531894995,-6850.734746830999,-6532.095921397,-6771.0750404725004,-6452.4362150385004,-6611.7556277555004,{"$f":"SUM(C25:N25)","v":-79659.706358499985},null,"Loss","Leakage down to 198",{"$f":"10000*79.6597063585","v":796597.063585},0.1,{"$f":"M88","v":-79659.7063585}]
["Hot/Dry (1989)Leakage down to bedrock","Leakage down to bedrock",{"$f":"C63*$U$26","v":-20363.904078603002},{"$f":"D63*$U$26","v":-18873.862316753999},-20860.584665886003,-20612.244372244502,-21605.605546810497,-20860.584665886003,-21605.605546810497,-21357.265253169,-20363.904078603002,-21108.924959527503,-20115.563784961501,-20612.244372244502,-248340.2936415,null,"Loss","Leakage down to bedrock",{"$f":"S24-S25","v":2483402.9364149999},0.1,{"$f":"-S11*T11","v":-248340.2936415},null,"Climate"]
["Hot/Dry (1989)Lateral Groundwater ","Lateral Groundwater ",{"$f":"C63*$U$27","v":-168623.58701886793},{"$f":"D63*$U$27","v":-156285.2757735849},-172736.35743396229,-170679.97222641512,-178905.51305660376,-172736.35743396229,-178905.51305660376,-176849.12784905659,-168623.58701886793,-174792.74264150945,-166567.20181132076,-170679.97222641512,-2056385.2075471701,null,"Loss","Lateral Groundwater ","--","--",{"$f":"SUMIF(M82:M87, \"<0\")","v":-2056385.2075471699},null,null,"Nearest active EC weather station / distance / elevation",null,null,null,"EC1012573 Duncan Kelvin Creek / 4.3 km to west;                                                                                                                                                             EC1017230 Shawnigan Lake / 6.4 km to south"]
["Hot/Dry (1989)Lateral Groundwater ","Lateral Groundwater ",{"$f":"C63*$U$28","v":145814.56174866628},{"$f":"D63*$U$28","v":135145.2035719346},149371.01447424351,147592.78811145489,154705.69356260935,149371.01447424351,154705.69356260935,152927.46719982073,145814.56174866628,151149.24083703212,144036.33538587767,147592.78811145489,1778226.3627886132,null,"Gain","Lateral Groundwater ","--","--",{"$f":"SUMIF(M82:M87, \">0\")","v":1778226.3627886132},null,null,"IDF Curve",null,null,null,"Unknown"]
["Hot/Dry (1989)Surface Water","Surface Water",{"$f":"C64*$U$29","v":0},{"$f":"D64*$U$29","v":0},0,0,0,0,0,0,0,0,0,0,0,null,"Loss","Surface Water","--","--",{"$f":"SUMIF(I93,\"<0\")","v":0}]
["Hot/Dry (1989)Surface Water","Surface Water",{"$f":"C64*$U$30","v":0},{"$f":"D64*$U$30","v":0},0,0,0,0,0,0,0,0,0,0,0,null,"Gain ","Surface Water","--","--",{"$f":"SUMIF(I94,\">0\")","v":0},null,"Physiography"]
["Hot/Dry (1989)Well Water Useage","Well Water Useage",{"$f":"$U$31*C65","v":-17715.059999999998},{"$f":"$U$31*D65","v":-19191.315000000002},-22143.825000000001,-23620.080000000002,-26572.59,-29525.100000000002,-32477.61,-33953.864999999998,-29525.100000000002,-23620.080000000002,-20667.570000000003,-16238.805,-295251,null,"Loss","Water Usage","--","--",{"$f":"E106","v":-295251},null,null,"Physiographic zone",null,null,null,"Canadian Cordillera / Western System / Coastal Trough / Georgia Depression / Nanaimo Lowland"]
["Hot/Dry (1989)Net Gain","Net Gain",{"$f":"SUMIF(C24:C31, \">0\")","v":424657.01987489057},295043.23557193461,397997.24559977686,162516.60443145491,154705.69356260935,149371.01447424351,154705.69356260935,152927.46719982073,145814.56174866628,196453.68323703212,321878.47986587766,373226.67771145492,2929297.3768403716,null,"Net Gain",null,null,null,{"$f":"SUMIF(U23:U31, \">0\")","v":2687673.6840403709},null,null,"Elevation range (m amsl)",null,null,null,"60 m (planar area)"]
["Hot/Dry (1989)Net Loss","Net Loss",{"$f":"SUMIF(C24:C31, \"<0\")","v":-213234.64701886792},-200404.5907735849,-222432.1824339623,-221524.05222641514,-292643.38145660382,-304432.5390339623,-303878.33585660375,-265660.66484905657,-242811.13501886794,-226292.82264150947,-213802.77181132077,-214142.77722641511,-2921259.90034717,null,"Net Loss",null,null,null,{"$f":"SUMIF(U23:U31, \"<0\")","v":-2679636.2075471701},null,null,"Distance to marine",null,null,null,"Cowichan Bay is 2.3 km to northeast"]
["Hot/Dry (1989)Net Total (Gain - Loss)","Net Total (Gain - Loss)",{"$f":"SUM(C32:C33)","v":211422.37285602264},{"$f":"SUM(D32:D33)","v":94638.644798349706},175565.06316581456,-59007.44779496023,-137937.68789399447,-155061.52455971879,-149172.6422939944,-112733.19764923584,-96996.573270201654,-29839.139404477348,108075.70805455689,159083.90048503981,8037.4764932009275,null,"Net Total (Gain - Loss)",null,null,null,{"$f":"SUM(U32:U33)","v":8037.4764932007529},null,null,"Geomorphological setting",null,null,null,"Triangular, flat-bottomed bench overlooking Koksilah River to the south.  AQ is flanked to the south by Cobble Hill uplands,  west by Glenora-Kelvin hillsides, and east/ northeast by Cowichan Bay / Cherry Point domed area "]
[null,null,null,null,null,null,null,null,null,null,null,null,null,null,null,null,null,null,null,null,null,null,null,"Topography",null,null,null,"Generally planar bench overlooking Koksilah River to south"]
[null,null,null,null,null,null,null,null,null,null,null,null,null,null,null,null,null,null,null,null,null,null,null,"Terrain",null,null,null,"Generally planar to gently undulating"]
[null,"Monthly Gains and Loses (m3)","Cold/Wet (1999)",null,null,null,null,null,null,null,null,null,null,null,null,null,"Summary - Wet/Cold (1999)",null,null,null,null,null,null,"Aspect",null,null,null,"Generally level, slight slope to the northwest and southwest"]
[null,"Source","Jan","Feb","Mar","Apr","May","Jun","Jul","Aug","Sep","Oct","Nov","Dec","Total",null,"Gains and Losses","Source","Area (m2)","Infiltration Rate","Q (m3/yr)",null,null,"Slope",null,null,null,"Planar to broadly concave"]
[{"$f":"$C$37&B39","v":"Cold/Wet (1999)Direct Recharge to 199"},"Direct Recharge to 199",{"$f":"C69*$U$39","v":630886.56848000013},{"$f":"D69*$U$39","v":638737.4143195902},236885.60651994441,-28426.316800000004,-23096.382400000002,-60405.923200000005,-78172.371200000009,-31979.606400000004,-14213.158400000002,224034.90928000002,362080.21024000004,387130.90192000009,{"$f":"SUM(C39:N39)","v":2243461.8523595352},null,"Gain","Direct Recharge to 199",{"$f":"10000*328","v":3280000},{"$f":"U39/S39","v":0.68398227206083384},{"$f":"T58","v":2243461.8523595352},null,null,"XS max grade (m/m)",null,null,null,"0.005 WNW through centre axis of valley"]
["Cold/Wet (1999)Leakage down to 198","Leakage down to 198",{"$f":"C70*$U$40","v":-6452.4362150385004},{"$f":"D70*$U$40","v":-6213.457095963},-6930.3944531894995,-6850.734746830999,-7169.3735722649999,-6850.734746830999,-6930.3944531894995,-6771.0750404725004,-6452.4362150385004,-6532.095921397,-6213.457095963,-6293.1168023215005,{"$f":"SUM(C40:N40)","v":-79659.706358499985},null,"Loss","Leakage down to 198",{"$f":"10000*79.6597063585","v":796597.063585},0.1,{"$f":"M88","v":-79659.7063585},null,null,"Roughness coefficient",null,null,null,"0.30 (cleared agricultural fields & rural residential properties)"]
["Cold/Wet (1999)Leakage down to bedrock","Leakage down to bedrock",{"$f":"C70*$U$41","v":-20115.563784961501},{"$f":"D70*$U$41","v":-19370.542904037},-21605.605546810497,-21357.265253169,-22350.626427734998,-21357.265253169,-21605.605546810497,-21108.924959527503,-20115.563784961501,-20363.904078603002,-19370.542904037,-19618.8831976785,-248340.2936415,null,"Loss","Leakage down to bedrock",{"$f":"S39-S40","v":2483402.9364149999},0.1,{"$f":"-S11*T11","v":-248340.2936415}]
["Cold/Wet (1999)Lateral Groundwater ","Lateral Groundwater ",{"$f":"C70*$U$42","v":-166567.20181132076},{"$f":"D70*$U$42","v":-160398.04618867926},-178905.51305660376,-176849.12784905659,-185074.66867924528,-176849.12784905659,-178905.51305660376,-174792.74264150945,-166567.20181132076,-168623.58701886793,-160398.04618867926,-162454.43139622643,-2056385.2075471701,null,"Loss","Lateral Groundwater ","--","--",{"$f":"SUMIF(M82:M87, \"<0\")","v":-2056385.2075471699},null,"Geology"]
["Cold/Wet (1999)Lateral Groundwater ","Lateral Groundwater ",{"$f":"C70*$U$43","v":144036.33538587767},{"$f":"D70*$U$43","v":138701.65629751183},154705.69356260935,152927.46719982073,160040.37265097519,152927.46719982073,154705.69356260935,151149.24083703212,144036.33538587767,145814.56174866628,138701.65629751183,140479.88266030044,1778226.3627886134,null,"Gain","Lateral Groundwater ","--","--",{"$f":"SUMIF(M82:M87, \">0\")","v":1778226.3627886132},null,null,"Terrane",null,null,null,"Overlap"]
["Cold/Wet (1999)Surface Water","Surface Water",{"$f":"C71*$U$44","v":0},{"$f":"D71*$U$44","v":0},0,0,0,0,0,0,0,0,0,0,0,null,"Loss","Surface Water","--","--",{"$f":"SUMIF(I93,\"<0\")","v":0},null,null,"Bedrock (type ; age ; formation ; lithology)",null,null,null,"Upper Cretaceous; Nanaimo Group (uKN); shale"]
["Cold/Wet (1999)Surface Water","Surface Water",{"$f":"C71*$U$45","v":0},{"$f":"D71*$U$45","v":0},0,0,0,0,0,0,0,0,0,0,0,null,"Gain ","Surface Water","--","--",{"$f":"SUMIF(I94,\">0\")","v":0},null,null,"Structure",null,null,null,"No mapped BCGS structures - possible west / northwest trending thrust faults due to linearity of AQ outline"]
["Cold/Wet (1999)Well Water Useage","Well Water Useage",{"$f":"$U$46*C72","v":-17715.059999999998},{"$f":"$U$46*D72","v":-19191.315000000002},-22143.825000000001,-23620.080000000002,-26572.59,-29525.100000000002,-32477.61,-33953.864999999998,-29525.100000000002,-23620.080000000002,-20667.570000000003,-16238.805,-295251,null,"Loss","Water Usage","--","--",{"$f":"E106","v":-295251},null,null,"Surficial (formation; lithology; thickness)",null,null,null,"Capilano Formation glaciofluvial-glaciolacustrine ice contact deposit, likely related to Dougan's Lake kame/kettle deposits to east"]
["Cold/Wet (1999)Net Gain","Net Gain",{"$f":"SUMIF(C39:C46, \">0\")","v":774922.90386587777},777439.07061710209,391591.30008255376,152927.46719982073,160040.37265097519,152927.46719982073,154705.69356260935,151149.24083703212,144036.33538587767,369849.4710286663,500781.86653751187,527610.78458030056,4257981.9735481478,null,"Net Gain",null,null,null,{"$f":"SUMIF(U38:U46, \">0\")","v":4021688.2151481481},null,null,"Surficial designation (1993)",null,null,null,"$LGp  - extends southeast of AQ to south & around Dougan's Lake"]
["Cold/Wet (1999)Net Loss","Net Loss",{"$f":"SUMIF(C39:C46, \"<0\")","v":-210850.26181132076},-205173.36118867926,-229585.33805660377,-257103.52464905661,-264263.64107924531,-294988.15104905656,-318091.49425660376,-268606.21404150943,-236873.46021132075,-219139.66701886791,-206649.61618867927,-204605.23639622642,-2915929.9659471703,null,"Net Loss",null,null,null,{"$f":"SUMIF(U38:U46, \"<0\")","v":-2679636.2075471701},null,null,"Soils (association; parent; texture; drainage; type; comments)",null,null,null,"East 4/5 = AZ1/b (Azilian organics), moderately decomposed organic materials, T.M;                                                                                                                                                                                                                    West 1/5 = QU1/c (Quamichan fluvial), very gravelly-sandy loam, DU.DYB;                                                                                                                                                                                                                                                                                                       "]
["Cold/Wet (1999)Net Total (Gain - Loss)","Net Total (Gain - Loss)",{"$f":"SUM(C47:C48)","v":564072.64205455699},{"$f":"SUM(D47:D48)","v":572265.70942842285},162005.96202594999,-104176.05744923587,-104223.26842827012,-142060.68384923582,-163385.80069399442,-117456.97320447731,-92837.124825443083,150709.80400979839,294132.25034883257,323005.54818407411,1342052.0076009785,null,"Net Total (Gain - Loss)",null,null,null,{"$f":"SUM(U47:U48)","v":1342052.007600978},null,null,"Restrictive layers",null,null,null,"Yes - low permeability organic and/or clay-rich soil layers / subsurface silt-clay aquitards (complex internal stratigraphy) / local surface duric layers in Quamichan soil areas"]
[null,null,null,null,null,null,null,null,null,null,null,null,null,null,null,null,null,null,null,null,null,null,null,"Estimated permeability",null,null,null,"Variable at surface & subsurface due to stratigraphic complexity"]
[null,null,null,null,null,null,null,null,null,null,null,null,null,null,null,null,"Table H-2.  Direct Recharge Calculation for AQ199"]
[null,"Table H-5  Monthly  Coefficients used in Calculations for AQ199",null,null,null,null,null,null,null,null,null,null,null,null,null,null,null,"Direct Recharge Calculation",null,null,null,null,"Hydrology"]
[null,"Monthly Factors","30 Year Average",null,null,null,null,null,null,null,null,null,null,null,null,null,null,"Hot/Dry","Average","Cold/Wet",null,null,null,"GW / SW basin coincidence",null,null,null,"Yes - contained  within Koksilah River watershed (north side only)"]
[null,null,"Jan","Feb","Mar","Apr","May","Jun","Jul","Aug","Sep","Oct","Nov","Dec",null,null,"Surplus (mm)",{"$f":"SUM('Climate Dashboard'!AA42:AL42)","v":511.89034592156941},{"$f":"SUM('Climate Dashboard'!C48:AL48)/3","v":760.90447463619182},{"$f":"SUM('Climate Dashboard'!AA54:AL54)","v":1262.7520438297711},null,null,null,"Catchments",null,null,null,"Koksilah River watershed, Patrolas Creek & Dougan's Lake catchment"]
[null,"Surplus Water",{"$f":"'Monthly Factors'!B16","v":0.25146830548450599},{"$f":"'Monthly Factors'!C16","v":0.16379677075085},{"$f":"'Monthly Factors'!D16","v":0.1182073911233482},{"$f":"'Monthly Factors'!E16","v":2.8387626824061124E-2},{"$f":"'Monthly Factors'!F16","v":-3.4169860825738051E-2},{"$f":"'Monthly Factors'!G16","v":-5.3883242071356162E-2},{"$f":"'Monthly Factors'!H16","v":-5.2569016654981621E-2},{"$f":"'Monthly Factors'!I16","v":-2.3656057494741728E-2},{"$f":"'Monthly Factors'!J16","v":-7.8853524982472421E-3},{"$f":"'Monthly Factors'!K16","v":8.6453811443823317E-2},{"$f":"'Monthly Factors'!L16","v":0.26525988999485034},{"$f":"'Monthly Factors'!M16","v":0.25858973392362583},null,null,"Station Coeffiecient Factor",1.06,1.06,1.06,null,null,null,"Drainage regime",null,null,null,"Rectilinear to trellised, man-made / natural ditching system  centred on Patrolas Creek, drains west-northwest into Koksilah River at west end of AQ"]
[null,"Leakance/\nLateral Ground Water",{"$f":"'Monthly Factors'!B42","v":8.1000000000000003E-2},{"$f":"'Monthly Factors'!C42","v":7.8E-2},{"$f":"'Monthly Factors'!D42","v":8.6999999999999994E-2},{"$f":"'Monthly Factors'!E42","v":8.5999999999999993E-2},{"$f":"'Monthly Factors'!F42","v":0.09},{"$f":"'Monthly Factors'!G42","v":8.5999999999999993E-2},{"$f":"'Monthly Factors'!H42","v":8.6999999999999994E-2},{"$f":"'Monthly Factors'!I42","v":8.5000000000000006E-2},{"$f":"'Monthly Factors'!J42","v":8.1000000000000003E-2},{"$f":"'Monthly Factors'!K42","v":8.2000000000000003E-2},{"$f":"'Monthly Factors'!L42","v":7.8E-2},{"$f":"'Monthly Factors'!M42","v":7.9000000000000001E-2},null,null,"Infiltration Coefficient",0.51100000000000001,0.51100000000000001,0.51100000000000001,null,null,null,"Surface waters",null,null,null,"Patrolas Creek, northwest corner bordered by Koksilah River"]
[null,"Surface Water",{"$f":"'Monthly Factors'!B26","v":0.22068086457424585},{"$f":"'Monthly Factors'!C26","v":0.19373952223030552},{"$f":"'Monthly Factors'!D26","v":0.13994869625957773},{"$f":"'Monthly Factors'!E26","v":6.7665632372012466E-2},{"$f":"'Monthly Factors'!F26","v":2.399263439717373E-2},{"$f":"'Monthly Factors'!G26","v":9.7313744914725147E-3},{"$f":"'Monthly Factors'!H26","v":5.7792933459831003E-3},{"$f":"'Monthly Factors'!I26","v":1.8772385441074731E-3},{"$f":"'Monthly Factors'!J26","v":1.5783311410150771E-3},{"$f":"'Monthly Factors'!K26","v":1.4486378451963268E-2},{"$f":"'Monthly Factors'!L26","v":0.10238016286421177},{"$f":"'Monthly Factors'!M26","v":0.21813987132793164},null,null,"Area (m2)",{"$f":"S9","v":3280000},{"$f":"S9","v":3280000},{"$f":"S9","v":3280000},null,null,null,"Runoff coefficient",null,null,null,"Flat-lying, cleared agricultural & rural residential land = 0.30"]
[null,"Water Usage",{"$f":"'Monthly Factors'!B31","v":0.06},{"$f":"'Monthly Factors'!C31","v":6.5000000000000002E-2},{"$f":"'Monthly Factors'!D31","v":7.4999999999999997E-2},{"$f":"'Monthly Factors'!E31","v":0.08},{"$f":"'Monthly Factors'!F31","v":0.09},{"$f":"'Monthly Factors'!G31","v":0.1},{"$f":"'Monthly Factors'!H31","v":0.11},{"$f":"'Monthly Factors'!I31","v":0.115},{"$f":"'Monthly Factors'!J31","v":0.1},{"$f":"'Monthly Factors'!K31","v":0.08},{"$f":"'Monthly Factors'!L31","v":7.0000000000000007E-2},{"$f":"'Monthly Factors'!M31","v":5.5E-2},null,null,"Q (m3/yr)",{"$f":"(R54/1000)*R55*R56*R57","v":909447.32125175756},{"$f":"(S54/1000)*S55*S56*S57","v":1351856.9781591222},{"$f":"(T54/1000)*T55*T56*T57","v":2243461.8523595352},null,null,null,"Nearest Active EC hydrometric station; distance; type",null,null,null,"EC 08HA003 Koksilah River  @ Cowichan Station adjacent to northwest corner of AQ, active realtime;                                                                                                      "]
[null,null,null,null,null,null,null,null,null,null,null,null,null,null,null,null,"Average Infiltration Rate",{"$f":"R58/R57","v":0.2772705247718773},{"$f":"S58/S57","v":0.41215151773143971},{"$f":"T58/T57","v":0.68398227206083384},null,null,null,"Surface water diversions ; relevance",null,null,null,"> 20 licences along Patrolas Creek; moderate to high relevance for upper unconfined AQ zones"]
[null,"Monthly Factors","Hot/Dry (1989)"]
[null,null,"Jan","Feb","Mar","Apr","May","Jun","Jul","Aug","Sep","Oct","Nov","Dec",null,null,null,null,null,null,null,null,"Land Cover"]
[null,"Surplus Water",{"$f":"'Monthly Factors'!B11","v":0.30660649782598431},{"$f":"'Monthly Factors'!C11","v":0.17581890480464263},{"$f":"'Monthly Factors'!D11","v":0.27338167402959174},{"$f":"'Monthly Factors'!E11","v":1.6409764448433315E-2},{"$f":"'Monthly Factors'!F11","v":-6.4466931761702304E-2},{"$f":"'Monthly Factors'!G11","v":-8.2048822242166558E-2},{"$f":"'Monthly Factors'!H11","v":-7.032756192185706E-2},{"$f":"'Monthly Factors'!I11","v":-2.9303150800773774E-2},{"$f":"'Monthly Factors'!J11","v":-1.9535433867182515E-2},{"$f":"'Monthly Factors'!K11","v":4.9815356361315413E-2},{"$f":"'Monthly Factors'!L11","v":0.19554969301049696},{"$f":"'Monthly Factors'!M11","v":0.24810001011321794},null,null,null,null,null,null,null,null,null,"Vegetation zone",null,null,null,"Cgf-wC "]
[null,"Leakance/\nLateral Ground Water",{"$f":"'Monthly Factors'!B43","v":8.2000000000000003E-2},{"$f":"'Monthly Factors'!C43","v":7.5999999999999998E-2},{"$f":"'Monthly Factors'!D43","v":8.4000000000000005E-2},{"$f":"'Monthly Factors'!E43","v":8.3000000000000004E-2},{"$f":"'Monthly Factors'!F43","v":8.6999999999999994E-2},{"$f":"'Monthly Factors'!G43","v":8.4000000000000005E-2},{"$f":"'Monthly Factors'!H43","v":8.6999999999999994E-2},{"$f":"'Monthly Factors'!I43","v":8.5999999999999993E-2},{"$f":"'Monthly Factors'!J43","v":8.2000000000000003E-2},{"$f":"'Monthly Factors'!K43","v":8.5000000000000006E-2},{"$f":"'Monthly Factors'!L43","v":8.1000000000000003E-2},{"$f":"'Monthly Factors'!M43","v":8.3000000000000004E-2},null,null,null,null,null,null,null,null,null,"Primary land uses",null,null,null,"Dominantly agricultural and rural residential"]
[null,"Surface Water",{"$f":"'Monthly Factors'!B26","v":0.22068086457424585},{"$f":"'Monthly Factors'!C26","v":0.19373952223030552},{"$f":"'Monthly Factors'!D26","v":0.13994869625957773},{"$f":"'Monthly Factors'!E26","v":6.7665632372012466E-2},{"$f":"'Monthly Factors'!F26","v":2.399263439717373E-2},{"$f":"'Monthly Factors'!G26","v":9.7313744914725147E-3},{"$f":"'Monthly Factors'!H26","v":5.7792933459831003E-3},{"$f":"'Monthly Factors'!I26","v":1.8772385441074731E-3},{"$f":"'Monthly Factors'!J26","v":1.5783311410150771E-3},{"$f":"'Monthly Factors'!K26","v":1.4486378451963268E-2},{"$f":"'Monthly Factors'!L26","v":0.10238016286421177},{"$f":"'Monthly Factors'!M26","v":0.21813987132793164},null,null,null,null,null,null,null,null,null,"Degree of development",null,null,null,"Extensive agricultural / rural residential clearing.  Very low impervious cover"]
[null,"Water Usage",{"$f":"'Monthly Factors'!B31","v":0.06},{"$f":"'Monthly Factors'!C31","v":6.5000000000000002E-2},{"$f":"'Monthly Factors'!D31","v":7.4999999999999997E-2},{"$f":"'Monthly Factors'!E31","v":0.08},{"$f":"'Monthly Factors'!F31","v":0.09},{"$f":"'Monthly Factors'!G31","v":0.1},{"$f":"'Monthly Factors'!H31","v":0.11},{"$f":"'Monthly Factors'!I31","v":0.115},{"$f":"'Monthly Factors'!J31","v":0.1},{"$f":"'Monthly Factors'!K31","v":0.08},{"$f":"'Monthly Factors'!L31","v":7.0000000000000007E-2},{"$f":"'Monthly Factors'!M31","v":5.5E-2},null,null,null,null,null,null,null,null,null,"Evapotranspiration potential",null,null,null,"High"]
[null,null,null,null,null,null,null,null,null,null,null,null,null,null,null,null,null,null,null,null,null,null,null,"Relative environmental sensitivity",null,null,null,"Cgf-wC "]
[null,"Monthly Factors","Cold/Wet (1999)"]
[null,null,"Jan","Feb","Mar","Apr","May","Jun","Jul","Aug","Sep","Oct","Nov","Dec",null,null,null,null,null,null,null,null,"Hydrogeology"]
[null,"Surplus Water",{"$f":"'Monthly Factors'!B21","v":0.28121118610350893},{"$f":"'Monthly Factors'!C21","v":0.28471061972718881},{"$f":"'Monthly Factors'!D21","v":0.1055893178084587},{"$f":"'Monthly Factors'!E21","v":-1.2670737757409583E-2},{"$f":"'Monthly Factors'!F21","v":-1.0294974427895285E-2},{"$f":"'Monthly Factors'!G21","v":-2.6925317734495361E-2},{"$f":"'Monthly Factors'!H21","v":-3.4844528832876351E-2},{"$f":"'Monthly Factors'!I21","v":-1.425457997708578E-2},{"$f":"'Monthly Factors'!J21","v":-6.3353688787047913E-3},{"$f":"'Monthly Factors'!K21","v":9.9861251950584262E-2},{"$f":"'Monthly Factors'!L21","v":0.16139352218500455},{"$f":"'Monthly Factors'!M21","v":0.17255960983372176},null,null,null,null,null,null,null,null,null,"Groundwater occurrence (primary / secondary)",null,null,null,"Granular pore space infillings"]
[null,"Leakance/\nLateral Ground Water",{"$f":"'Monthly Factors'!B44","v":8.1000000000000003E-2},{"$f":"'Monthly Factors'!C44","v":7.8E-2},{"$f":"'Monthly Factors'!D44","v":8.6999999999999994E-2},{"$f":"'Monthly Factors'!E44","v":8.5999999999999993E-2},{"$f":"'Monthly Factors'!F44","v":0.09},{"$f":"'Monthly Factors'!G44","v":8.5999999999999993E-2},{"$f":"'Monthly Factors'!H44","v":8.6999999999999994E-2},{"$f":"'Monthly Factors'!I44","v":8.5000000000000006E-2},{"$f":"'Monthly Factors'!J44","v":8.1000000000000003E-2},{"$f":"'Monthly Factors'!K44","v":8.2000000000000003E-2},{"$f":"'Monthly Factors'!L44","v":7.8E-2},{"$f":"'Monthly Factors'!M44","v":7.9000000000000001E-2},null,null,null,null,null,null,null,null,null,"Primary porosity",null,null,null,"Variable: low in glaciolacustrine materials, moderate to high in glaciofluvial materials.  Suspected  multiple stacked AQ zones separated by aquitards, moderate  lateral continuity along northwest-southeast axis due to glacial outwash wasting patterns"]
[null,"Surface Water",{"$f":"'Monthly Factors'!B26","v":0.22068086457424585},{"$f":"'Monthly Factors'!C26","v":0.19373952223030552},{"$f":"'Monthly Factors'!D26","v":0.13994869625957773},{"$f":"'Monthly Factors'!E26","v":6.7665632372012466E-2},{"$f":"'Monthly Factors'!F26","v":2.399263439717373E-2},{"$f":"'Monthly Factors'!G26","v":9.7313744914725147E-3},{"$f":"'Monthly Factors'!H26","v":5.7792933459831003E-3},{"$f":"'Monthly Factors'!I26","v":1.8772385441074731E-3},{"$f":"'Monthly Factors'!J26","v":1.5783311410150771E-3},{"$f":"'Monthly Factors'!K26","v":1.4486378451963268E-2},{"$f":"'Monthly Factors'!L26","v":0.10238016286421177},{"$f":"'Monthly Factors'!M26","v":0.21813987132793164},null,null,null,null,null,null,null,null,null,"Secondary porosity",null,null,null,"Not applicable - surficial AQ"]
[null,"Water Usage",{"$f":"'Monthly Factors'!B31","v":0.06},{"$f":"'Monthly Factors'!C31","v":6.5000000000000002E-2},{"$f":"'Monthly Factors'!D31","v":7.4999999999999997E-2},{"$f":"'Monthly Factors'!E31","v":0.08},{"$f":"'Monthly Factors'!F31","v":0.09},{"$f":"'Monthly Factors'!G31","v":0.1},{"$f":"'Monthly Factors'!H31","v":0.11},{"$f":"'Monthly Factors'!I31","v":0.115},{"$f":"'Monthly Factors'!J31","v":0.1},{"$f":"'Monthly Factors'!K31","v":0.08},{"$f":"'Monthly Factors'!L31","v":7.0000000000000007E-2},{"$f":"'Monthly Factors'!M31","v":5.5E-2},null,null,null,null,null,null,null,null,null,"Confinement",null,null,null,"                           Suspected variable degrees of confinement based on the composite nature of the AQ: (1)  surface and near-surface glaciofluvial components may be unconfined to semi-confined by silt-clay horizons and duric soil layers;                                                                                                                          (2) subsurface glaciofluvial components may be semi-confined to confined due to overlying silt-clay aquitards.                                                                                                             No WP data - variable aquitard lateral continuities, thicknesses, and depths/  Estimated at 0 - 25 m, avg 10 m                                                                                                                                                          "]
[null,null,null,null,null,null,null,null,null,null,null,null,null,null,null,null,null,null,null,null,null,null,null,"Aquifer thickness",null,null,null,"Thickness of composite AQ  variable - locally up to 35 m along southwest side, shallows towards northeast and northwest.                                                                                                                                             Individual \"sub-aquifer\" water-bearing zones likely much thinner (<5 m)"]
[null,null,null,null,null,null,null,null,null,null,null,null,null,null,null,null,null,null,null,null,null,null,null,"Hydraulic anisotropy",null,null,null,"Moderate to high due to probable stratigraphic complexity"]
[null,null,null,null,null,null,null,null,null,null,null,null,null,null,null,null,null,null,null,null,null,null,null,"Hydraulic gradient",null,null,null,"Variable: likely very low based on local terrain / possibly higher at northwest corner adjacent to incised Koksilah River"]
[null,null,null,null,null,null,null,null,null,null,null,null,null,null,null,null,null,null,null,null,null,null,null,"Storage potential",null,null,null,"Variably low to high due to probable stratigraphic complexity"]
[null,"TABLE H-6",null,null,null,null,null,null,null,null,null,null,null,null,null,null,null,null,null,null,null,null,null,"Yield potential",null,null,null,"Variable low-high depending on AQ host materials; No WP data, estimated at 0.01 - 3.15 L/s / average 0.63 L/s"]
[null,"Groundwater Flow Components: Aquifer #0199, Dougan's Lake (Surficial)",null,null,null,null,null,null,null,null,null,null,null,null,null,null,null,null,null,null,null,null,null,"Flow velocities",null,null,null,"Variable: likely very low based on local terrain / possibly higher at northwest corner adjacent to incised Koksilah River"]
[null,null,null,null,null,null,null,null,null,null,null,null,null,null,null,null,null,null,null,null,null,null,null,"Flow directions",null,null,null,"Near-surface unconfined / semi-confined AQ zones: flow likely mirrors topography towards the west-northwest and southwest towards Koksilah River                                                                                                                                                                                                                                                                 Deeper semi-confined to confined AQ zones: flow direction uncertain,  may be influenced by bedrock surface irregularities + regional northwest-trending structural and stratigraphic fabrics "]
[null,"Groundwater Flow","Direction of Flow","Source or Receptor of Water","Length (m)","Depth (m)","Area (m)","Hydraulic Conductivity (m/s) - K","Distance (m) - dL","Hydraulic Head (m) - dh",null,null,"GW Flow (m3/yr)",null,null,null,null,null,null,null,null,null,null,"Static water levels",null,null,null,"WP no data / estimated at 0 - 30 m bgs / avg 10 m bgs"]
[null,null,null,null,null,null,null,null,null,"Year 1","Year 2","Year 3","Year 1","Year 2","Year 3",null,null,null,null,null,null,null,null,"Hydraulic connection with surface waters",null,null,null,"Near-surface unconfined / semi-confined AQ zones: moderate to high with Patrolas Creek and Koksilah River.                                                                                                                                                                                                                                                 Deeper semi-confined to confined AQ zones: negligible connectivity to Patrolas Creek due to deep overburden cover / possible connection to incised portions of Koksilah River at AQ northwest corner."]
[null,"QGW1","In","AQ 197","--","--",{"$f":"'Surficial AQ 197'!G86","v":90000},{"$f":"'Surficial AQ 197'!H86","v":1E-4},{"$f":"'Surficial AQ 197'!I86","v":3200},{"$f":"'Surficial AQ 197'!J86","v":20},"--","--",{"$f":"-'Surficial AQ 197'!M86","v":1773900},null,null,null,null,null,null,null,null,null,null,"Hydraulic connection to adjacent AQ"]
[null,"QGW2","Out","Koksilah River",3200,6,{"$f":"E83*F83","v":19200},1E-4,1060,36,null,null,{"$f":"-(G83*H83*(J83/I83))*60*60*24*365","v":-2056385.2075471699},null,null,null,null,null,null,null,null,null,null,null,"Over / Under",null,null,"                                                AQ overlies surficial AQ 197 at its extreme east end / bedrock AQ 198 along much of its northeast side                                                                                                                                                                                                                        Central, northwest, and southwest portions of AQ also underlain by undeveloped extensions of bedrock AQ 198"]
[null,"QGW4","In","AQ 202 (QGW23)",{"$f":"'Bedrock 202'!E104","v":107.1},{"$f":"'Bedrock 202'!F104","v":200},{"$f":"'Bedrock 202'!G104","v":21420},{"$f":"'Bedrock 202'!H104","v":1E-8},{"$f":"'Bedrock 202'!I104","v":510},{"$f":"'Bedrock 202'!J104","v":60},"--","--",{"$f":"-'Bedrock 202'!M104","v":794.70719999999983},null,null,null,null,null,null,null,null,null,null,null,"Upgradient",null,null,"AQ in contact with bedrock AQ 198 and surficial AQ 197 along its northwest side.  Deeper zones of AQ likely also receive basal recharge from bedrock AQ 196, bedrock AQ 200, and bedrock AQ 202 to the southwest, although BCMOE does not indicate their contact with AQ199.                                "]
[null,"QGW5","In","AQ 202 (QGW24)",{"$f":"'Bedrock 202'!E105","v":214.2},{"$f":"'Bedrock 202'!F105","v":200},{"$f":"'Bedrock 202'!G105","v":42840},{"$f":"'Bedrock 202'!H105","v":1.0000000000000001E-9},{"$f":"'Bedrock 202'!I105","v":600},{"$f":"'Bedrock 202'!J105","v":80},null,null,{"$f":"-'Bedrock 202'!M105","v":180.13363200000001},null,null,null,null,null,null,null,null,null,null,null,"Downgradient",null,null,"Near-surface unconfined / semi-confined AQ zones: north end of AQ in contact with surficial AQ 186, possible cross-gradient contact with bedrock AQ198"]
[null,"QGW6","In","AQ 202 (QGW25)",{"$f":"'Bedrock 202'!E106","v":142.80000000000001},{"$f":"'Bedrock 202'!F106","v":200},{"$f":"'Bedrock 202'!G106","v":28560.000000000004},{"$f":"'Bedrock 202'!H106","v":1E-8},{"$f":"'Bedrock 202'!I106","v":665},{"$f":"'Bedrock 202'!J106","v":100},null,null,{"$f":"-'Bedrock 202'!M106","v":1354.388210526316},null,null,null,null,null,null,null,null,null,null,"Vulnerability to surface contamination",null,null,null,"Variable: (1) near-surface unconfined / semi-confined AQ zones = low-moderate based on surficial lithologies and presence of low-permeability surface soil horizons; (2) deeper semi-confined to confined AQ zones - low to negligible based on deep overburden cover"]
[null,"QGW7","In","AQ 202 (QGW26)",{"$f":"'Bedrock 202'!E107","v":1820.6999999999998},{"$f":"'Bedrock 202'!F107","v":200},{"$f":"'Bedrock 202'!G107","v":364139.99999999994},{"$f":"'Bedrock 202'!H107","v":1.0000000000000001E-9},{"$f":"'Bedrock 202'!I107","v":575},{"$f":"'Bedrock 202'!J107","v":100},null,null,{"$f":"-'Bedrock 202'!M107","v":1997.1337460869561},null,null,null,null,null,null,null,null,null,null,"Recharge"]
[null,"QGW8","Out","Leakage to AQ 198","Leakance Factor (m/yr) = ",0.1,{"$f":"10000*79.6597063585","v":796597.063585},"--","--","--","--","--",{"$f":"-F88*G88","v":-79659.7063585},null,null,null,null,null,null,null,null,null,null,null,"Vertical inflow",null,null,"Variable: (1) near-surface unconfined / semi-confined AQ zones: moderate to high recharge from precipitation and irrigation-sewerage returns (high levels of rural residential and agricultural development) and well-documented seasonal flooding, negligible from snowmelt due to low elevations.  Low to negligible from stream losses due to AQ area's low-permeability surface soils (2) deeper semi-confined to confined AQ zones: low to negligible from precipitation due to deep overburden cover. "]
[null,"Total",null,null,null,null,null,null,null,null,null,null,{"$f":"SUM(M82:M88)","v":-357818.55111705657},null,null,null,null,null,null,null,null,null,null,null,"Lateral inflow",null,null,"Low - moderate lateral inflow from upgradient bedrock and surficial sources, possible lateral surface water inflow from Dougan's Lake at east end of AQ"]
[null,null,null,null,null,null,null,null,null,null,null,null,null,null,null,null,null,null,null,null,null,null,null,null,"Temporal variability",null,null,"Variable:  (1) near-surface unconfined / semi-confined AQ zones: moderate to high depending on surficial lithologies and presence of low-permeability surface soil layers (2) Deeper semi-confined to confined AQ zones: negligible due to deep overburden cover"]
[null,"Surface Water Contributions","Cold Water Creek?","Observed Vertical Gradient","Percent Permeable","Length (m)","Width (m)","Flux (m/s)","SW Flow (m3/yr)",null,null,"Comment",null,null,null,null,null,null,null,null,null,null,null,null,"MBR",null,null,"Low to moderate along south side from upgradient rocky Cobble Hill (bedrock AQ 202) - limited perimeter contact length"]
[null,null,null,null,null,null,null,null,"Year 1","Year 2","Year 3",null,null,null,null,null,null,null,null,null,null,null,null,"Discharge"]
[null,"Patrolas Creek","Yes","Zero",0,2600,2,3.0000000000000001E-5,{"$f":"-(E93*F93*G93)*(H93*60*60*24*365)","v":0},null,null,"Conveyance feature",null,null,null,null,null,null,null,null,null,null,null,null,"Evapotranspiration",null,null,"Variable: (1)  near-surface unconfined / semi-confined AQ zones: moderate to high (2) Deeper semi-confined to confined AQ zones: negligible"]
[null,"Total",null,null,null,null,null,null,{"$f":"SUM(I93:I93)","v":0},null,null,null,null,null,null,null,null,null,null,null,null,null,null,null,"Outflow to marine",null,null,"Negligible due to distance from marine shoreline"]
[null,null,null,null,null,null,null,null,null,null,null,null,null,null,null,null,null,null,null,null,null,null,null,null,"Outflow to surface waters",null,null,"Variable: (1)  near-surface unconfined / semi-confined AQ zones: moderate to high into Patrolas Creek and Koksilah River (2) Deeper semi-confined to confined AQ zones: low to deeply incised portions of Koksilah River at AQ's west end"]
[null,"Water Well Usage","Water Well Usage Volume (m3/yr)",null,null,null,null,null,null,null,null,"Comments",null,null,null,null,null,null,null,null,null,null,null,null,"Outflow to other AQ",null,null,"Variable: (1)  near-surface unconfined / semi-confined AQ zones: moderate to lower elevation aquifers (2) Deeper semi-confined to confined AQ zones: low to moderate outflow to underlying bedrock aquifers"]
[null,null,"Year 1",null,null,"Year 2",null,null,"Year 3",null,null,null,null,null,null,null,null,null,null,null,null,null,null,null,"Temporal variability",null,null,"Variable: (1)  near-surface unconfined / semi-confined AQ zones: moderate to high (2) Deeper semi-confined to confined AQ zones: negligible"]
[null,null,"Total Volume Removed","Adjustment Factor","Adjusted Volume Removed","Total Volume Removed","Adjustment Factor","Adjusted Volume Removed","Total Volume Removed","Adjustment Factor","Adjusted Volume Removed"]
[null,"Industrial",{"$f":"AB102","v":109500},1,{"$f":"C99*D99","v":109500},null,null,null,null,null,null,"Assuming 100% consumptive",null,null,null,null,null,null,null,null,null,null,"Groundwater Development"]
[null,"Commercial",0,1,0,null,null,null,null,null,null,"Assuming 100% consumptive",null,null,null,null,null,null,null,null,null,null,null,null,"Nearest BCMOE Observation Wells; distance; completion / relevance",null,null,"Well #233 is 2.1 km to northeast; Well #320 is 3.1 km to southeast; negligible to low relevancy, both wells completed within surficial AQ197"]
[null,"Domestic",16747,1,16747,null,null,null,null,null,null,"Assuming 100% percent goes to septic beds",null,null,null,null,null,null,null,null,null,null,null,null,"Total Annual Water Use (m3/yr) as reported by Hatfield (2015)",null,null,null,"  SUMS"]
[null,"Irrigation",161704,1,161704,null,null,null,null,null,null,"Assuming 80% efficiency",null,null,null,null,null,null,null,null,null,null,null,null,null,"Industrial",null,109500,"Total Commercial and Industrial"]
[null,"BCMOE Obs",0,1,0,null,null,null,null,null,null,"Assuming 100% consumptive",null,null,null,null,null,null,null,null,null,null,null,null,null,"Commercial",null,0,{"$f":"AB102+AB103","v":109500}]
[null,"Other",7300,1,7300,null,null,null,null,null,null,"Assuming 100% consumptive",null,null,null,null,null,null,null,null,null,null,null,null,null,"Domestic",null,16747,"Total Irrigation"]
[null,"Water Supply Systems",0,1,0,null,null,null,null,null,null,"Assuming 100% percent goes to septic beds",null,null,null,null,null,null,null,null,null,null,null,null,null,"Irrigation from Groundwater (MoAg)",null,161704,{"$f":"AB105","v":161704}]
[null,"Total",{"$f":"-SUM(C99:C105)","v":-295251},null,{"$f":"-SUM(E99:E105)","v":-295251},null,null,null,null,null,null,null,null,null,null,null,null,null,null,null,null,null,null,null,null,"BCMOE Obs",null,0]
[null,null,null,null,null,null,null,null,null,null,null,null,null,null,null,null,null,null,null,null,null,null,null,null,null,"Other",null,7300,"Total Domestic + Water Systems + Other"]
[null,null,null,null,null,null,null,null,null,null,null,null,null,null,null,null,null,null,null,null,null,null,null,null,null,"Water Supply Systems",null,0,{"$f":"AB104+AB107+AB108","v":24047}]

{"sheet":"Surficial AQ 201","index":14,"n_rows":111,"n_cols":29,"rows_kept":111,"cut":false,"hidden":false,"merged":[[90,1,92,1],[90,2,90,10],[91,2,91,4],[79,1,80,1],[79,2,80,2],[79,6,80,6],[79,7,80,7],[79,3,80,3],[79,4,80,4],[79,5,80,5],[85,1,86,1],[85,2,86,2],[85,3,86,3],[85,4,86,4],[85,5,86,5],[91,5,91,7],[4,2,4,4],[3,2,3,4],[2,2,2,4],[1,2,1,4],[79,9,79,11],[91,8,91,10],[6,16,6,20],[21,16,21,20],[36,16,36,20],[85,11,86,11],[85,6,86,6],[85,7,86,7],[85,8,85,10],[51,17,51,19],[79,12,79,14],[77,16,77,18],[79,8,80,8]]}
[null,"CHM Aquifer Criteria: Aquifer #0201, Kingburne (Surficial)",null,null,null,null,null,null,null,null,null,null,null,null,null,null,null,null,null,null,null,null,"TABLE I-1"]
[null,"AQ tag","201 Kingburne",null,null,null,null,null,null,null,null,null,null,null,null,null,null,null,null,null,null,null,"CHM Aquifer Criteria: Aquifer #0201, Kingburne (Surficial)"]
[null,"Perimeter (km)",6.77]
[null,"Area (km2)",2.11,null,null,null,null,null,null,null,null,null,null,null,null,null,null,null,null,null,null,null,"BCMOE Criteria"]
[null,"Aquifer materials","Sand and gravel",null,null,null,null,null,null,null,null,null,null,null,null,null,null,null,null,null,null,null,null,"AQ tag",null,null,null,"201 Kingburne"]
[null,"Table I-4 Monthly  Summary of AQ201 Water Budgets",null,null,null,null,null,null,null,null,null,null,null,null,null,null,"Table I-3 Annual Summary of AQ201 Water Budgets",null,null,null,null,null,null,"AQ classification",null,null,null,"IIC (8)"]
[null,"Monthly Gains and Loses (m3)","Average Year",null,null,null,null,null,null,null,null,null,null,null,null,null,"Summary - 30 Year Average",null,null,null,null,null,null,"AQ type",null,null,null,"BCMOE Classification = 4b - erroneously includes bedrock quarry area at south end of AQ                                                                                                                                                                                                                              (SLR Classification = 4a / 4b / 5b - thin morainal-colluvial overburder in southeast corner only over limestone quarry)"]
[null,"Source","Jan","Feb","Mar","Apr","May","Jun","Jul","Aug","Sep","Oct","Nov","Dec","Total",null,"Gains and Losses","Source","Area (m2)","Infiltration Rate","Q (m3/yr)",null,null,"Location",null,null,null,"Cobble Hill"]
[{"$f":"$C$7&B9","v":"Average YearDirect Recharge to 201"},"Direct Recharge to 201",{"$f":"C55*$U$9","v":212942.97648323994},138702.85495751255,100097.83801432262,24038.598977967395,-28934.985887114261,-45628.24697583403,-44515.362903252717,-20031.913306463721,-6677.3044354879066,73208.955306309275,224621.66915345329,218973.39119382066,{"$f":"SUM(C9:N9)","v":846798.47057847306},null,"Gain","Direct Recharge to 201",{"$f":"10000*211.263304865","v":2112633.0486500002},{"$f":"U9/S9","v":0.40082610234635313},{"$f":"S58","v":846798.47057847306},null,null,"Perimeter (km)",null,null,null,6.77]
[{"$f":"$C$7&B10","v":"Average YearLeakage down to 202"},"Leakage down to 202",{"$f":"C56*$U$10","v":-51336.981900000006},-49435.612200000003,-55139.721299999997,-54505.931399999994,-57041.091,-54505.931399999994,-55139.721299999997,-53872.141500000005,-51336.981900000006,-51970.771800000002,-49435.612200000003,-50069.402099999999,{"$f":"SUM(C10:N10)","v":-633789.9},null,"Loss","Leakage down to 202",{"$f":"10000*211.263304865","v":2112633.0486500002},0.2,{"$f":"M83","v":-633789.9},null,null,"Area (km2)",null,null,null,2.11]
["Average YearLateral Groundwater","Lateral Groundwater",{"$f":"C56*$U$11","v":-223.51140000000004},-215.23320000000004,-240.06780000000003,-237.30840000000003,-248.34600000000003,-237.30840000000003,-240.06780000000003,-234.54900000000006,-223.51140000000004,-226.27080000000007,-215.23320000000004,-217.99260000000004,-2759.4000000000005,null,"Loss","Lateral Groundwater","--","--",{"$f":"SUMIF(M82:M82,\"<0\")","v":-2759.4000000000005},null,null,"Aquifer materials",null,null,null,"Sand and gravel"]
["Average YearLateral Groundwater","Lateral Groundwater",{"$f":"C56*$U$12","v":0},0,0,0,0,0,0,0,0,0,0,0,0,null,"Gain","Lateral Groundwater","--","--",{"$f":"SUMIF(M82:M82,\">0\")","v":0},null,null,"Lithostratigraphic unit",null,null,null,"Vashon Drift"]
["Average YearSurface Water","Surface Water",{"$f":"C57*$U$13","v":0},0,0,0,0,0,0,0,0,0,0,0,0,null,"Loss","Surface Water","--","--",{"$f":"SUMIF(I88,\"<0\")","v":0},null,null,"Productivity",null,null,null,"Moderate"]
["Average YearSurface Water","Surface Water",{"$f":"C57*$U$14","v":34796.958726067089},30548.847865274576,22067.110426210216,10669.516912418925,3783.158591746354,1534.4431298153861,911.27897479461524,296.00297363486635,248.87125431525735,2284.2121543055682,16143.304080428912,34396.294910988261,157680,null,"Gain","Surface Water","--","--",{"$f":"SUMIF(I88,\">0\")","v":157680},null,null,"Vulnerability",null,null,null,"Low"]
["Average YearWell Water Usage","Well Water Usage",{"$f":"C58*$U$15","v":-2648.1},-2868.7750000000001,-3310.125,-3530.8,-3972.1499999999996,-4413.5,-4854.8500000000004,-5075.5250000000005,-4413.5,-3530.8,-3089.4500000000003,-2427.4250000000002,-44135,null,"Losses","Water Usage","--","--",{"$f":"E101","v":-44135},null,null,"Demand",null,null,null,"Moderate"]
["Average YearNet Gain","Net Gain",{"$f":"SUMIF(C9:C15, \">0\")","v":247739.93520930703},169251.70282278713,122164.94844053284,34708.115890386318,3783.158591746354,1534.4431298153861,911.27897479461524,296.00297363486635,248.87125431525735,75493.167460614844,240764.97323388219,253369.68610480893,1150266.2840866258,null,"Net Gain",null,null,null,{"$f":"SUMIF(U8:U15, \">0\")","v":1004478.4705784731},null,null,"Use",null,null,null,"Domestic"]
["Average YearNet Loss","Net Loss",{"$f":"SUMIF(C9:C15, \"<0\")","v":-54208.593300000008},-52519.620400000007,-58689.914099999995,-58274.039799999999,-90196.572887114264,-104784.98677583401,-104750.00200325272,-79214.128806463719,-62651.297735487919,-55727.842600000004,-52740.295400000003,-52714.8197,-826472.11350815266,null,"Net Loss",null,null,null,{"$f":"SUMIF(U8:U15, \"<0\")","v":-680684.3}]
["Average YearNet Total (Gain - Loss)","Net Total (Gain - Loss)",{"$f":"SUM(C16:C17)","v":193531.34190930703},116732.08242278712,63475.034340532846,-23565.923909613681,-86413.414295367911,-103250.54364601863,-103838.72302845812,-78918.125832828853,-62402.426481172661,19765.324860614841,188024.67783388219,200654.86640480894,323794.17057847313,null,"Net Total (Gain - Loss)",null,null,null,{"$f":"SUM(U16:U17)","v":323794.17057847301},null,"Location"]
[null,null,null,null,null,null,null,null,null,null,null,null,null,null,null,null,null,null,null,null,null,null,null,"NTS 50000",null,null,null,"092B/12"]
[null,null,null,null,null,null,null,null,null,null,null,null,null,null,null,null,null,null,null,null,null,null,null,"TRIM 20000",null,null,null,"092B.062"]
[null,null,null,null,null,null,null,null,null,null,null,null,null,null,null,null,null,null,null,null,null,null,null,"Lat / Long (Centre)",null,null,null,"48o41'05\" / 123o38'33\""]
[null,"Monthly Gains and Loses (m3)","Hot/Dry (1989)",null,null,null,null,null,null,null,null,null,null,null,null,null,"Summary - Hot/Dry (1989)",null,null,null,null,null,null,"UTM Zone 10 (Centre)",null,null,null,"452725E / 5392602N"]
[null,"Source","Jan","Feb","Mar","Apr","May","Jun","Jul","Aug","Sep","Oct","Nov","Dec","Total",null,"Gains and Losses","Source","Area (m2)","Infiltration Rate","Q (m3/yr)"]
[{"$f":"$C$22&B24","v":"Hot/Dry (1989)Direct Recharge to 201"},"Direct Recharge to 201",{"$f":"C62*$U$24","v":174665.937956815},{"$f":"D62*$U$24","v":100159.5665323186},155738.59932245745,9348.2262096830709,-36725.174395183487,-46741.131048415344,-40063.826612927442,-16693.261088719766,-11128.840725813177,28378.543850823604,111399.6956653899,141336.27721782736,{"$f":"SUM(C24:N24)","v":569674.61288425571},null,"Gain","Direct Recharge to 201",{"$f":"10000*211.263304865","v":2112633.0486500002},{"$f":"U24/S24","v":0.26965147271945078},{"$f":"R58","v":569674.61288425571},null,"Climate"]
[{"$f":"$C$22&B25","v":"Hot/Dry (1989)Leakage down to 202"},"Leakage down to 202",{"$f":"C63*$U$25","v":-51970.771800000002},{"$f":"D63*$U$25","v":-48168.032400000004},-53238.351600000002,-52604.561700000006,-55139.721299999997,-53238.351600000002,-55139.721299999997,-54505.931399999994,-51970.771800000002,-53872.141500000005,-51336.981900000006,-52604.561700000006,{"$f":"SUM(C25:N25)","v":-633789.9},null,"Loss","Leakage down to 202",{"$f":"10000*211.263304865","v":2112633.0486500002},0.2,{"$f":"M83","v":-633789.9},null,null,"Nearest active EC weather station / distance / elevation",null,null,null,"EC1017230 Shawnigan Lake / 2.6 km to south-southeast;                                                                                                                                            EC1012573 Duncan Kelvin Creek / 7.3 km to northwest                                                                                                                                                             "]
["Hot/Dry (1989)Lateral Groundwater","Lateral Groundwater",{"$f":"C63*$U$26","v":-226.27080000000007},{"$f":"D63*$U$26","v":-209.71440000000004},-231.78960000000006,-229.03020000000006,-240.06780000000003,-231.78960000000006,-240.06780000000003,-237.30840000000003,-226.27080000000007,-234.54900000000006,-223.51140000000004,-229.03020000000006,-2759.4000000000005,null,"Loss","Lateral Groundwater","--","--",{"$f":"SUMIF(M82:M82,\"<0\")","v":-2759.4000000000005},null,null,"IDF Curve",null,null,null,"Unknown"]
["Hot/Dry (1989)Lateral Groundwater","Lateral Groundwater",{"$f":"C63*$U$27","v":0},{"$f":"D63*$U$27","v":0},0,0,0,0,0,0,0,0,0,0,0,null,"Gain","Lateral Groundwater","--","--",{"$f":"SUMIF(M82:M82,\">0\")","v":0}]
["Hot/Dry (1989)Surface Water","Surface Water",{"$f":"C64*$U$28","v":0},{"$f":"D64*$U$28","v":0},0,0,0,0,0,0,0,0,0,0,0,null,"Loss","Surface Water","--","--",{"$f":"SUMIF(I88,\"<0\")","v":0},null,"Physiography"]
["Hot/Dry (1989)Surface Water","Surface Water",{"$f":"C64*$U$29","v":34796.958726067089},{"$f":"D64*$U$29","v":30548.847865274576},22067.110426210216,10669.516912418925,3783.158591746354,1534.4431298153861,911.27897479461524,296.00297363486635,248.87125431525735,2284.2121543055682,16143.304080428912,34396.294910988261,157680,null,"Gain","Surface Water","--","--",{"$f":"SUMIF(I88,\">0\")","v":157680},null,null,"Physiographic zone",null,null,null,"Canadian Cordillera / Western System / Coastal Trough / Georgia Depression / Nanaimo Lowland"]
["Hot/Dry (1989)Well Water Usage","Well Water Usage",{"$f":"C65*$U$30","v":-2648.1},{"$f":"D65*$U$30","v":-2868.7750000000001},-3310.125,-3530.8,-3972.1499999999996,-4413.5,-4854.8500000000004,-5075.5250000000005,-4413.5,-3530.8,-3089.4500000000003,-2427.4250000000002,-44135,null,"Losses","Water Usage","--","--",{"$f":"E101","v":-44135},null,null,"Elevation range (m amsl)",null,null,null,"120 m (planar area)"]
["Hot/Dry (1989)Net Gain","Net Gain",{"$f":"SUMIF(C24:C30, \">0\")","v":209462.8966828821},130708.41439759318,177805.70974866766,20017.743122101994,3783.158591746354,1534.4431298153861,911.27897479461524,296.00297363486635,248.87125431525735,30662.756005129173,127542.99974581882,175732.57212881563,878706.84675531508,null,"Net Gain",null,null,null,{"$f":"SUMIF(U23:U30, \">0\")","v":727354.61288425571},null,null,"Distance to marine",null,null,null,"Cowichan Bay is 5.3 km to northeast"]
["Hot/Dry (1989)Net Loss","Net Loss",{"$f":"SUMIF(C24:C30, \"<0\")","v":-54845.142599999999},-51246.521800000002,-56780.266199999998,-56364.39190000001,-96077.113495183483,-104624.77224841535,-100298.46571292744,-76512.025888719756,-67739.383325813178,-57637.490500000007,-54649.943300000006,-55261.01690000001,-832036.53387105931,null,"Net Loss",null,null,null,{"$f":"SUMIF(U23:U30, \"<0\")","v":-680684.3},null,null,"Geomorphological setting",null,null,null,"Bean-shaped, flat-bottomed bench overlooking Koksilah River to the northwest.  AQ is flanked to the north, east, and south by Cobble Hill uplands "]
["Hot/Dry (1989)Net Total (Gain - Loss)","Net Total (Gain - Loss)",{"$f":"SUM(C31:C32)","v":154617.75408288211},79461.892597593178,121025.44354866767,-36346.648777898015,-92293.95490343713,-103090.32911859997,-99387.186738132834,-76216.02291508489,-67490.512071497928,-26974.734494870834,72893.056445818802,120471.55522881562,46670.312884255778,null,"Net Total (Gain - Loss)",null,null,null,{"$f":"SUM(U31:U32)","v":46670.312884255662},null,null,"Topography",null,null,null,"Generally planar bench overlooking Koksilah River to northwest, with low, northwest-elongated hill in northwest portion"]
[null,null,null,null,null,null,null,null,null,null,null,null,null,null,null,null,null,null,null,null,null,null,null,"Terrain",null,null,null,"Generally planar to gently undulating"]
[null,null,null,null,null,null,null,null,null,null,null,null,null,null,null,null,null,null,null,null,null,null,null,"Aspect",null,null,null,"Generally level, slight slope to the northwest; low, northwest-elongated hill bisected by the AQ's northwest edge"]
[null,null,null,null,null,null,null,null,null,null,null,null,null,null,null,null,null,null,null,null,null,null,null,"Slope",null,null,null,"Planar to broadly concave"]
[null,"Monthly Gains and Loses (m3)","Cold/Wet (1999)",null,null,null,null,null,null,null,null,null,null,null,null,null,"Summary - Wet/Cold (1999)",null,null,null,null,null,null,"XS max grade (m/m)",null,null,null,"0.005 NW through centre short axis of valley"]
[null,"Source","Jan","Feb","Mar","Apr","May","Jun","Jul","Aug","Sep","Oct","Nov","Dec","Total",null,"Gains and Losses","Source","Area (m2)","Infiltration Rate","Q (m3/yr)",null,null,"Roughness coefficient",null,null,null,"0.45 (65% mostly cleared agricultural fields & rural residential properties / 35% forested)"]
[{"$f":"$C$37&B39","v":"Cold/Wet (1999)Direct Recharge to 201"},"Direct Recharge to 201",{"$f":"C69*$U$39","v":395185.13417362591},{"$f":"D69*$U$39","v":400102.8764770797},148384.31324022182,-17806.145161301083,-14467.49294355713,-37838.0584677648,-48966.899193577978,-20031.913306463717,-8903.0725806505416,140334.68155250416,226805.77399207253,242497.43941546913,{"$f":"SUM(C39:N39)","v":1405296.637197658},null,"Gain","Direct Recharge to 201",{"$f":"10000*211.263304865","v":2112633.0486500002},{"$f":"U39/S39","v":0.66518728280600403},{"$f":"T58","v":1405296.6371976582}]
[{"$f":"$C$37&B40","v":"Cold/Wet (1999)Leakage down to 202"},"Leakage down to 202",{"$f":"C70*$U$40","v":-51336.981900000006},{"$f":"D70*$U$40","v":-49435.612200000003},-55139.721299999997,-54505.931399999994,-57041.091,-54505.931399999994,-55139.721299999997,-53872.141500000005,-51336.981900000006,-51970.771800000002,-49435.612200000003,-50069.402099999999,{"$f":"SUM(C40:N40)","v":-633789.9},null,"Loss","Leakage down to 202",{"$f":"10000*211.263304865","v":2112633.0486500002},0.2,{"$f":"M83","v":-633789.9},null,"Geology"]
["Cold/Wet (1999)Lateral Groundwater","Lateral Groundwater",{"$f":"C70*$U$41","v":-223.51140000000004},{"$f":"D70*$U$41","v":-215.23320000000004},-240.06780000000003,-237.30840000000003,-248.34600000000003,-237.30840000000003,-240.06780000000003,-234.54900000000006,-223.51140000000004,-226.27080000000007,-215.23320000000004,-217.99260000000004,-2759.4000000000005,null,"Loss","Lateral Groundwater","--","--",{"$f":"SUMIF(M82:M82,\"<0\")","v":-2759.4000000000005},null,null,"Terrane",null,null,null,"Wrangellia"]
["Cold/Wet (1999)Lateral Groundwater","Lateral Groundwater",{"$f":"C70*$U$42","v":0},{"$f":"D70*$U$42","v":0},0,0,0,0,0,0,0,0,0,0,0,null,"Gain","Lateral Groundwater","--","--",{"$f":"SUMIF(M82:M82,\">0\")","v":0},null,null,"Bedrock (type ; age ; formation ; lithology)"]
["Cold/Wet (1999)Surface Water","Surface Water",{"$f":"C71*$U$43","v":0},{"$f":"D71*$U$43","v":0},0,0,0,0,0,0,0,0,0,0,0,null,"Loss","Surface Water","--","--",{"$f":"SUMIF(I88,\"<0\")","v":0},null,null,null,"Primary",null,null,"Northwest & north portions of AQ: Central NE-trending V belt = Devonian Sicker Group Volcanics (muDSiD); basaltic (70%)"]
["Cold/Wet (1999)Surface Water","Surface Water",{"$f":"C71*$U$44","v":34796.958726067089},{"$f":"D71*$U$44","v":30548.847865274576},22067.110426210216,10669.516912418925,3783.158591746354,1534.4431298153861,911.27897479461524,296.00297363486635,248.87125431525735,2284.2121543055682,16143.304080428912,34396.294910988261,157680,null,"Gain","Surface Water","--","--",{"$f":"SUMIF(I88,\">0\")","v":157680},null,null,null,"Secondary",null,null,"South & southeast portions of AQ = Triassic Karmutsen Volcanics (uTrVK); basaltic (10%) ; Carboniferous Buttle Lake Group (PnPBM); limestone (10%); Devonian Sicker Group Volcanics (muDSiD); basaltic (10%)"]
["Cold/Wet (1999)Well Water Usage","Well Water Usage",{"$f":"C72*$U$45","v":-2648.1},{"$f":"D72*$U$45","v":-2868.7750000000001},-3310.125,-3530.8,-3972.1499999999996,-4413.5,-4854.8500000000004,-5075.5250000000005,-4413.5,-3530.8,-3089.4500000000003,-2427.4250000000002,-44135,null,"Losses","Water Usage","--","--",{"$f":"E101","v":-44135},null,null,"Structure",null,null,null,"North splay of northeast-trending San Juan Fault crosses southeast side of AQ"]
["Cold/Wet (1999)Net Gain","Net Gain",{"$f":"SUMIF(C39:C45, \">0\")","v":429982.092899693},430651.72434235428,170451.42366643203,10669.516912418925,3783.158591746354,1534.4431298153861,911.27897479461524,296.00297363486635,248.87125431525735,142618.89370680973,242949.07807250143,276893.73432645737,1710990.2188509733,null,"Net Gain",null,null,null,{"$f":"SUMIF(U38:U45, \">0\")","v":1562976.6371976582},null,null,"Surficial (formation; lithology; thickness)",null,null,null,"Vashon Drift morainal-glaciofluvial-glaciolacustrine ice contact deposit"]
["Cold/Wet (1999)Net Loss","Net Loss",{"$f":"SUMIF(C39:C45, \"<0\")","v":-54208.593300000008},-52519.620400000007,-58689.914099999995,-76080.184961301071,-75729.079943557124,-96994.798267764781,-109201.53829357798,-79214.128806463719,-64877.065880650553,-55727.842600000004,-52740.295400000003,-52714.8197,-828697.88165331527,null,"Net Loss",null,null,null,{"$f":"SUMIF(U38:U45, \"<0\")","v":-680684.3},null,null,"Surficial designation (1993)",null,null,null,"Level areas = $LGp; low hill in northwest part of AQ = Cb/sgFG; quarry area in southeast corner = dMb/Cb/R"]
["Cold/Wet (1999)Net Total (Gain - Loss)","Net Total (Gain - Loss)",{"$f":"SUM(C46:C47)","v":375773.49959969299},378132.10394235427,111761.50956643204,-65410.668048882144,-71945.921351810772,-95460.355137949402,-108290.25931878337,-78918.125832828853,-64628.194626335295,86891.051106809726,190208.78267250143,224178.91462645738,882292.33719765791,null,"Net Total (Gain - Loss)",null,null,null,{"$f":"SUM(U46:U47)","v":882292.33719765814},null,null,"Soils (association; parent; texture; drainage; type; comments)",null,null,null,"Level areas = Mainly C18AR12/b, subordinate Q1/b (mainly Cowichan \"marine\"and lesser Arrowsmith organics; subordinate Qualicum) mainly silt-clay and organics; O.HG and T.M;                                                                                                                                                                                                                    Low hill in northwest part of AQ and quarry area in southeast corner = S16RL52D22/fe (Shawnigan morainal / Rosewall colluvium / Dashwood marine), predominantly gravelly-sandy loam, DU.DYB;                                                                                                                                                                                                                                                                                                       "]
[null,null,null,null,null,null,null,null,null,null,null,null,null,null,null,null,null,null,null,null,null,null,null,"Restrictive layers",null,null,null,"Yes - low permeability organic and/or clay-rich soil layers in level areas + subsurface silt-clay aquitards (complex internal stratigraphy) / local surface duric layers in Shawnigan soil areas"]
[null,null,null,null,null,null,null,null,null,null,null,null,null,null,null,null,null,null,null,null,null,null,null,"Estimated permeability",null,null,null,"Variable at surface & subsurface due to stratigraphic complexity; generally low due to extent of Cowichan soils"]
[null,null,null,null,null,null,null,null,null,null,null,null,null,null,null,null,"Table I-2.  Direct Recharge Calculation for AQ201"]
[null,"Table I-5  Monthly  Coefficients used in Calculations for AQ201",null,null,null,null,null,null,null,null,null,null,null,null,null,null,null,"Direct Recharge Calculation",null,null,null,null,"Hydrology"]
[null,"Monthly Factors","30 Year Average",null,null,null,null,null,null,null,null,null,null,null,null,null,null,"Hot/Dry","Average","Cold/Wet",null,null,null,"GW / SW basin coincidence",null,null,null,"Yes - contained  within Koksilah River watershed (west side only)"]
[null,null,"Jan","Feb","Mar","Apr","May","Jun","Jul","Aug","Sep","Oct","Nov","Dec",null,null,"Surplus (mm)",{"$f":"SUM('Climate Dashboard'!AA42:AL42)","v":511.89034592156941},{"$f":"SUM('Climate Dashboard'!C48:AL48)/3","v":760.90447463619182},{"$f":"SUM('Climate Dashboard'!AA54:AL54)","v":1262.7520438297711},null,null,null,"Catchments",null,null,null,"Koksilah River watershed, small internal stream catchment"]
[null,"Surplus Water",{"$f":"'Monthly Factors'!B16","v":0.25146830548450599},{"$f":"'Monthly Factors'!C16","v":0.16379677075085},{"$f":"'Monthly Factors'!D16","v":0.1182073911233482},{"$f":"'Monthly Factors'!E16","v":2.8387626824061124E-2},{"$f":"'Monthly Factors'!F16","v":-3.4169860825738051E-2},{"$f":"'Monthly Factors'!G16","v":-5.3883242071356162E-2},{"$f":"'Monthly Factors'!H16","v":-5.2569016654981621E-2},{"$f":"'Monthly Factors'!I16","v":-2.3656057494741728E-2},{"$f":"'Monthly Factors'!J16","v":-7.8853524982472421E-3},{"$f":"'Monthly Factors'!K16","v":8.6453811443823317E-2},{"$f":"'Monthly Factors'!L16","v":0.26525988999485034},{"$f":"'Monthly Factors'!M16","v":0.25858973392362583},null,null,"Station Coeffiecient Factor",1.08,1.08,1.08,null,null,null,"Drainage regime",null,null,null,"Rectilinear, man-made / natural ditching system centred on a north-flowing, unnamed stream, drains northwest into Koksilah River at north end of AQ"]
[null,"Leakance/\nLateral Ground Water",{"$f":"'Monthly Factors'!B42","v":8.1000000000000003E-2},{"$f":"'Monthly Factors'!C42","v":7.8E-2},{"$f":"'Monthly Factors'!D42","v":8.6999999999999994E-2},{"$f":"'Monthly Factors'!E42","v":8.5999999999999993E-2},{"$f":"'Monthly Factors'!F42","v":0.09},{"$f":"'Monthly Factors'!G42","v":8.5999999999999993E-2},{"$f":"'Monthly Factors'!H42","v":8.6999999999999994E-2},{"$f":"'Monthly Factors'!I42","v":8.5000000000000006E-2},{"$f":"'Monthly Factors'!J42","v":8.1000000000000003E-2},{"$f":"'Monthly Factors'!K42","v":8.2000000000000003E-2},{"$f":"'Monthly Factors'!L42","v":7.8E-2},{"$f":"'Monthly Factors'!M42","v":7.9000000000000001E-2},null,null,"Infiltration Coefficient",0.487755417824,0.487755417824,0.487755417824,null,null,null,"Surface waters",null,null,null,"Cobble Hill Quarry Lake, 3 internal unnamed srteams "]
[null,"Surface Water",{"$f":"'Monthly Factors'!B26","v":0.22068086457424585},{"$f":"'Monthly Factors'!C26","v":0.19373952223030552},{"$f":"'Monthly Factors'!D26","v":0.13994869625957773},{"$f":"'Monthly Factors'!E26","v":6.7665632372012466E-2},{"$f":"'Monthly Factors'!F26","v":2.399263439717373E-2},{"$f":"'Monthly Factors'!G26","v":9.7313744914725147E-3},{"$f":"'Monthly Factors'!H26","v":5.7792933459831003E-3},{"$f":"'Monthly Factors'!I26","v":1.8772385441074731E-3},{"$f":"'Monthly Factors'!J26","v":1.5783311410150771E-3},{"$f":"'Monthly Factors'!K26","v":1.4486378451963268E-2},{"$f":"'Monthly Factors'!L26","v":0.10238016286421177},{"$f":"'Monthly Factors'!M26","v":0.21813987132793164},null,null,"Area (m2)",{"$f":"S9","v":2112633.0486500002},{"$f":"S9","v":2112633.0486500002},{"$f":"S9","v":2112633.0486500002},null,null,null,"Runoff coefficient",null,null,null,"Genarlly flat-lying, mostly cleared agricultural & rural residential land = 0.40"]
[null,"Water Usage",{"$f":"'Monthly Factors'!B31","v":0.06},{"$f":"'Monthly Factors'!C31","v":6.5000000000000002E-2},{"$f":"'Monthly Factors'!D31","v":7.4999999999999997E-2},{"$f":"'Monthly Factors'!E31","v":0.08},{"$f":"'Monthly Factors'!F31","v":0.09},{"$f":"'Monthly Factors'!G31","v":0.1},{"$f":"'Monthly Factors'!H31","v":0.11},{"$f":"'Monthly Factors'!I31","v":0.115},{"$f":"'Monthly Factors'!J31","v":0.1},{"$f":"'Monthly Factors'!K31","v":0.08},{"$f":"'Monthly Factors'!L31","v":7.0000000000000007E-2},{"$f":"'Monthly Factors'!M31","v":5.5E-2},null,null,"Q (m3/yr)",{"$f":"(R54/1000)*R55*R56*R57","v":569674.61288425571},{"$f":"(S54/1000)*S55*S56*S57","v":846798.47057847306},{"$f":"(T54/1000)*T55*T56*T57","v":1405296.6371976582},null,null,null,"Nearest Active EC hydrometric station; distance; type",null,null,null,"EC 08HA003 Koksilah River  @ Cowichan Station; 4.4 km NNW; active realtime;                                                                                                          + Shawnigan Creek @ Mill Bay; 6.1 km SE (inactive)"]
[null,null,null,null,null,null,null,null,null,null,null,null,null,null,null,null,"Average Infiltration Rate",{"$f":"R58/R57","v":0.26965147271945078},{"$f":"S58/S57","v":0.40082610234635313},{"$f":"T58/T57","v":0.66518728280600403},null,null,null,"Surface water diversions ; relevance",null,null,null,"3 licences along internal unnamed stream and Cobble Hill Quarry Lake; moderate to high relevance for upper unconfined AQ zones"]
[null,"Monthly Factors","Hot/Dry (1989)"]
[null,null,"Jan","Feb","Mar","Apr","May","Jun","Jul","Aug","Sep","Oct","Nov","Dec",null,null,null,null,null,null,null,null,"Land Cover"]
[null,"Surplus Water",{"$f":"'Monthly Factors'!B11","v":0.30660649782598431},{"$f":"'Monthly Factors'!C11","v":0.17581890480464263},{"$f":"'Monthly Factors'!D11","v":0.27338167402959174},{"$f":"'Monthly Factors'!E11","v":1.6409764448433315E-2},{"$f":"'Monthly Factors'!F11","v":-6.4466931761702304E-2},{"$f":"'Monthly Factors'!G11","v":-8.2048822242166558E-2},{"$f":"'Monthly Factors'!H11","v":-7.032756192185706E-2},{"$f":"'Monthly Factors'!I11","v":-2.9303150800773774E-2},{"$f":"'Monthly Factors'!J11","v":-1.9535433867182515E-2},{"$f":"'Monthly Factors'!K11","v":4.9815356361315413E-2},{"$f":"'Monthly Factors'!L11","v":0.19554969301049696},{"$f":"'Monthly Factors'!M11","v":0.24810001011321794},null,null,null,null,null,null,null,null,null,"Vegetation zone",null,null,null,"CwH:a "]
[null,"Leakance/\nLateral Ground Water",{"$f":"'Monthly Factors'!B43","v":8.2000000000000003E-2},{"$f":"'Monthly Factors'!C43","v":7.5999999999999998E-2},{"$f":"'Monthly Factors'!D43","v":8.4000000000000005E-2},{"$f":"'Monthly Factors'!E43","v":8.3000000000000004E-2},{"$f":"'Monthly Factors'!F43","v":8.6999999999999994E-2},{"$f":"'Monthly Factors'!G43","v":8.4000000000000005E-2},{"$f":"'Monthly Factors'!H43","v":8.6999999999999994E-2},{"$f":"'Monthly Factors'!I43","v":8.5999999999999993E-2},{"$f":"'Monthly Factors'!J43","v":8.2000000000000003E-2},{"$f":"'Monthly Factors'!K43","v":8.5000000000000006E-2},{"$f":"'Monthly Factors'!L43","v":8.1000000000000003E-2},{"$f":"'Monthly Factors'!M43","v":8.3000000000000004E-2},null,null,null,null,null,null,null,null,null,"Primary land uses",null,null,null,"65% cleared agricultural, 20%rural residential,  20% forested / 5% industrial (quarrying)"]
[null,"Surface Water",{"$f":"'Monthly Factors'!B26","v":0.22068086457424585},{"$f":"'Monthly Factors'!C26","v":0.19373952223030552},{"$f":"'Monthly Factors'!D26","v":0.13994869625957773},{"$f":"'Monthly Factors'!E26","v":6.7665632372012466E-2},{"$f":"'Monthly Factors'!F26","v":2.399263439717373E-2},{"$f":"'Monthly Factors'!G26","v":9.7313744914725147E-3},{"$f":"'Monthly Factors'!H26","v":5.7792933459831003E-3},{"$f":"'Monthly Factors'!I26","v":1.8772385441074731E-3},{"$f":"'Monthly Factors'!J26","v":1.5783311410150771E-3},{"$f":"'Monthly Factors'!K26","v":1.4486378451963268E-2},{"$f":"'Monthly Factors'!L26","v":0.10238016286421177},{"$f":"'Monthly Factors'!M26","v":0.21813987132793164},null,null,null,null,null,null,null,null,null,"Degree of development",null,null,null,"Cgf-wC "]
[null,"Water Usage",{"$f":"'Monthly Factors'!B31","v":0.06},{"$f":"'Monthly Factors'!C31","v":6.5000000000000002E-2},{"$f":"'Monthly Factors'!D31","v":7.4999999999999997E-2},{"$f":"'Monthly Factors'!E31","v":0.08},{"$f":"'Monthly Factors'!F31","v":0.09},{"$f":"'Monthly Factors'!G31","v":0.1},{"$f":"'Monthly Factors'!H31","v":0.11},{"$f":"'Monthly Factors'!I31","v":0.115},{"$f":"'Monthly Factors'!J31","v":0.1},{"$f":"'Monthly Factors'!K31","v":0.08},{"$f":"'Monthly Factors'!L31","v":7.0000000000000007E-2},{"$f":"'Monthly Factors'!M31","v":5.5E-2},null,null,null,null,null,null,null,null,null,"Evapotranspiration potential",null,null,null,"High"]
[null,null,null,null,null,null,null,null,null,null,null,null,null,null,null,null,null,null,null,null,null,null,null,"Relative environmental sensitivity",null,null,null,"Moderate in terrestrial areas, high along internal creeks and Cobble Hill Quarry Lake"]
[null,"Monthly Factors","Cold/Wet (1999)"]
[null,null,"Jan","Feb","Mar","Apr","May","Jun","Jul","Aug","Sep","Oct","Nov","Dec",null,null,null,null,null,null,null,null,"Hydrogeology (not including bedrock quarry area)"]
[null,"Surplus Water",{"$f":"'Monthly Factors'!B21","v":0.28121118610350893},{"$f":"'Monthly Factors'!C21","v":0.28471061972718881},{"$f":"'Monthly Factors'!D21","v":0.1055893178084587},{"$f":"'Monthly Factors'!E21","v":-1.2670737757409583E-2},{"$f":"'Monthly Factors'!F21","v":-1.0294974427895285E-2},{"$f":"'Monthly Factors'!G21","v":-2.6925317734495361E-2},{"$f":"'Monthly Factors'!H21","v":-3.4844528832876351E-2},{"$f":"'Monthly Factors'!I21","v":-1.425457997708578E-2},{"$f":"'Monthly Factors'!J21","v":-6.3353688787047913E-3},{"$f":"'Monthly Factors'!K21","v":9.9861251950584262E-2},{"$f":"'Monthly Factors'!L21","v":0.16139352218500455},{"$f":"'Monthly Factors'!M21","v":0.17255960983372176},null,null,null,null,null,null,null,null,null,"Groundwater occurrence (primary / secondary)",null,null,null,"Granular pore space infillings"]
[null,"Leakance/\nLateral Ground Water",{"$f":"'Monthly Factors'!B44","v":8.1000000000000003E-2},{"$f":"'Monthly Factors'!C44","v":7.8E-2},{"$f":"'Monthly Factors'!D44","v":8.6999999999999994E-2},{"$f":"'Monthly Factors'!E44","v":8.5999999999999993E-2},{"$f":"'Monthly Factors'!F44","v":0.09},{"$f":"'Monthly Factors'!G44","v":8.5999999999999993E-2},{"$f":"'Monthly Factors'!H44","v":8.6999999999999994E-2},{"$f":"'Monthly Factors'!I44","v":8.5000000000000006E-2},{"$f":"'Monthly Factors'!J44","v":8.1000000000000003E-2},{"$f":"'Monthly Factors'!K44","v":8.2000000000000003E-2},{"$f":"'Monthly Factors'!L44","v":7.8E-2},{"$f":"'Monthly Factors'!M44","v":7.9000000000000001E-2},null,null,null,null,null,null,null,null,null,"Primary porosity",null,null,null,"Variable: low in glaciolacustrine and morainal materials, moderate to high in glaciofluvial materials.  "]
[null,"Surface Water",{"$f":"'Monthly Factors'!B26","v":0.22068086457424585},{"$f":"'Monthly Factors'!C26","v":0.19373952223030552},{"$f":"'Monthly Factors'!D26","v":0.13994869625957773},{"$f":"'Monthly Factors'!E26","v":6.7665632372012466E-2},{"$f":"'Monthly Factors'!F26","v":2.399263439717373E-2},{"$f":"'Monthly Factors'!G26","v":9.7313744914725147E-3},{"$f":"'Monthly Factors'!H26","v":5.7792933459831003E-3},{"$f":"'Monthly Factors'!I26","v":1.8772385441074731E-3},{"$f":"'Monthly Factors'!J26","v":1.5783311410150771E-3},{"$f":"'Monthly Factors'!K26","v":1.4486378451963268E-2},{"$f":"'Monthly Factors'!L26","v":0.10238016286421177},{"$f":"'Monthly Factors'!M26","v":0.21813987132793164},null,null,null,null,null,null,null,null,null,"Secondary porosity",null,null,null,"Not applicable - surficial AQ"]
[null,"Water Usage",{"$f":"'Monthly Factors'!B31","v":0.06},{"$f":"'Monthly Factors'!C31","v":6.5000000000000002E-2},{"$f":"'Monthly Factors'!D31","v":7.4999999999999997E-2},{"$f":"'Monthly Factors'!E31","v":0.08},{"$f":"'Monthly Factors'!F31","v":0.09},{"$f":"'Monthly Factors'!G31","v":0.1},{"$f":"'Monthly Factors'!H31","v":0.11},{"$f":"'Monthly Factors'!I31","v":0.115},{"$f":"'Monthly Factors'!J31","v":0.1},{"$f":"'Monthly Factors'!K31","v":0.08},{"$f":"'Monthly Factors'!L31","v":7.0000000000000007E-2},{"$f":"'Monthly Factors'!M31","v":5.5E-2},null,null,null,null,null,null,null,null,null,"Confinement",null,null,null,"                           Suspected variable degrees of confinement: (1)  Level areas = unconfined; (2) elevated hill in northwest part of AQ = semiconfined below a local, low-permeability morainal blanket.                                                                                                                                     WP = 0 - 48.2 m, avg 10.7 m                                                                                                                                                                                                                                                                                                                    "]
[null,null,null,null,null,null,null,null,null,null,null,null,null,null,null,null,null,null,null,null,null,null,null,"Aquifer thickness",null,null,null,"Thickness of composite AQ  (including unconfined and semi-confined zones) variable - generally between 6 m and 20 m thick, locally up to 30 m thick.                                                                                                                                                                                                                Irregular underlying bedrock surface = significant aquifer thickness variations over short horizontal distances "]
[null,null,null,null,null,null,null,null,null,null,null,null,null,null,null,null,null,null,null,null,null,null,null,"Hydraulic anisotropy",null,null,null,"Low to moderate due to lack of internal aquitards"]
[null,null,null,null,null,null,null,null,null,null,null,null,null,null,null,null,null,null,null,null,null,null,null,"Hydraulic gradient",null,null,null,"Variable: likely very low based on local terrain / possibly higher along northwest edge adjacent to incised Koksilah River"]
[null,null,null,null,null,null,null,null,null,null,null,null,null,null,null,null,null,null,null,null,null,null,null,"Storage potential",null,null,null,"Variably low to moderate due to elevated proportion of silty glaciofluvial - glaciolacustrine materials"]
[null,"TABLE I-6",null,null,null,null,null,null,null,null,null,null,null,null,null,null,null,null,null,null,null,null,null,"Yield potential",null,null,null,"Variable low-moderate depending on AQ host materials; WP = 0.38 - 4.73 L/s / average 0.76 L/s"]
[null,"Groundwater Flow Components: Aquifer #0201, Kingburne (Surficial)",null,null,null,null,null,null,null,null,null,null,null,null,null,null,"Q (m3/yr) - lateral flow out",null,null,null,null,null,null,"Flow velocities",null,null,null,"Variable: likely very low based on local terrain / possibly higher along northwest edge adjacent to incised Koksilah River"]
[null,null,null,null,null,null,null,null,null,null,null,null,null,null,null,null,"t (m)\\k",9.9999999999999995E-7,1.0000000000000001E-5,null,null,null,null,"Flow directions",null,null,null,"Near-surface unconfined / semi-confined AQ zones: flow likely mirrors topography towards the northwest towards the Koksilah River                                                                                                                                                                                                                                                                 Deeper semi-confined zones: flow direction uncertain,  may be influenced by bedrock surface irregularities and structural fabrics "]
[null,"Groundwater Flow","Direction of Flow","Source or Receptor of Water","Length (m)","Depth (m)","Area (m)","Hydraulic Conductivity (m/s) - K","Distance (m) - dL","Hydraulic Head (m) - dh",null,null,"GW Flow (m3/yr)",null,null,null,5,{"$f":"(R79*($J$82/$I$82)*(Q80*2100))*(3600*24*365)","v":2414.4749999999999},{"$f":"(S79*($J$82/$I$82)*(Q80*2100))*(3600*24*365)","v":24144.75},null,null,null,null,"Static water levels",null,null,null,"WP = variable 2.4 - 25.9 m bgs / avg 6.1 m bgs"]
[null,null,null,null,null,null,null,null,null,"Year 1","Year 2","Year 3","Year 1","Year 2","Year 3",null,10,{"$f":"(R79*($J$82/$I$82)*(Q81*2100))*(3600*24*365)","v":4828.95},{"$f":"(S79*($J$82/$I$82)*(Q81*2100))*(3600*24*365)","v":48289.5},null,null,null,null,"Hydraulic connection with surface waters",null,null,null,"Near-surface unconfined AQ zones: moderate to high with internal unnamed streams and Koksilah River.                                                                                                                                                                                                                                                 Deeper semi-confined AQ zones: negligible connectivity to internal; streams due to deep overburden cover / possible connection to incised portions of Koksilah River west and northwest of AQ "]
[null,"QGW1","Out","Koksilah River",240,5,{"$f":"E82*F82","v":1200},1.0000000000000001E-5,960,7,null,null,{"$f":"-(H82*($J$82/$I$82)*G82*(3600*24*365))","v":-2759.4000000000005},null,null,null,null,null,null,null,null,null,null,"Hydraulic connection to adjacent AQ"]
[null,"QGW2","Out","Leakage to AQ 202","Leakance Factor (m/yr) = ",0.3,2112633,"--","--","--","--","--",{"$f":"-F83*G83","v":-633789.9},null,null,null,null,null,null,null,null,null,null,null,"Over / Under",null,null,"                                                AQ overlies, and is entirely underlain by, bedrock AQ 202                                                                                                                                                                                                                       "]
[null,"Total",null,null,null,null,null,null,null,null,null,null,{"$f":"SUM(M82:M83)","v":-636549.30000000005},{"$f":"SUM(N82:N83)","v":0},{"$f":"SUM(O82:O83)","v":0},null,null,null,null,null,null,null,null,null,"Upgradient",null,null,"AQ in contact with upgradient bedrock AQ 202 along itssoutheast and east sides.  Deeper zones of AQ likely also receive basal recharge from bedrock AQ 200  to the west, although BCMOE does not indicate contact                              "]
[null,null,null,null,null,null,null,null,null,null,null,null,null,null,null,null,null,null,null,null,null,null,null,null,"Downgradient",null,null,"AQ in contact with downgradient bedrock AQ 202 along its west side.   "]
[null,"Surface Water Contributions","Cold Water Creek?","Observed Vertical Gradient","Percent Permeable","Length (m)","Width (m)","Flux (m/s)","SW Flow (m3/yr)",null,null,"Comment",null,null,null,null,null,null,null,null,null,null,null,"Vulnerability to surface contamination",null,null,null,"Variable: (1) near-surface unconfined AQ zones = low to moderate to high based on surficial lithologies and presence of low-permeability surface soil horizons; (2) deeper semi-confined AQ zones - low based on deep overburden cover and overlying morainal aquitard"]
[null,null,null,null,null,null,null,null,"Year 1","Year 2","Year 3",null,null,null,null,null,null,null,null,null,null,null,null,"Recharge"]
[null,"Heather Bank Brooks","Yes","Downward",0.1,2500,2,1.0000000000000001E-5,{"$f":"(E88*F88*G88)*(H88*60*60*24*365)","v":157680},null,null,"Half of the creek sits over impermeable soils, therefore is considered on conveyance feature across those soils.",null,null,null,null,null,null,null,null,null,null,null,null,"Vertical inflow",null,null,"Variable: (1) near-surface unconfined AQ zones: moderate to high recharge from precipitation and irrigation-sewerage returns (high levels of rural residential and agricultural development) and well-documented seasonal flooding, negligible from snowmelt due to low elevations.  Low to negligible from stream losses due to AQ area's low-permeability surface soils (2) deeper semi-confined AQ zones: low to negligible from precipitation due to deep overburden cover and overlying morainal aquitard. "]
[null,"Total",null,null,null,null,null,null,{"$f":"SUM(I88:I88)","v":157680},{"$f":"SUM(J88:J88)","v":0},{"$f":"SUM(K88:K88)","v":0},null,null,null,null,null,null,null,null,null,null,null,null,null,"Lateral inflow",null,null,"Low - moderate lateral inflow from upgradient bedrock AQ 202 to the east, south, and southwest.   Also upwelling inflow from underlying bedrock AQ 202  - documented bedrock artesian flow conditions along southwest border of AQ."]
[null,null,null,null,null,null,null,null,null,null,null,null,null,null,null,null,null,null,null,null,null,null,null,null,"Temporal variability",null,null,"Variable:  (1) near-surface unconfined AQ zones: moderate to high depending on surficial lithologies and presence of low-permeability surface soil layers (2) Deeper semi-confined AQ zones: low due to deep overburden cover and overlying morainal aquitard"]
[null,"Water Well Usage","Water Well Usage Volume (m3/yr)",null,null,null,null,null,null,null,null,"Comments",null,null,null,null,null,null,null,null,null,null,null,null,"MBR",null,null,"Moderate to high along southeast, south, and west sides from upgradient rocky Cobble Hill (bedrock AQ 202)"]
[null,null,"Year 1",null,null,"Year 2",null,null,"Year 3",null,null,null,null,null,null,null,null,null,null,null,null,null,null,"Discharge"]
[null,null,"Total Volume Removed","Adjustment Factor","Adjusted Volume Removed","Total Volume Removed","Adjustment Factor","Adjusted Volume Removed","Total Volume Removed","Adjustment Factor","Adjusted Volume Removed",null,null,null,null,null,null,null,null,null,null,null,null,null,"Evapotranspiration",null,null,"Variable: (1)  near-surface unconfined AQ zones: moderate to high (2) Deeper semi-confined AQ zones: low"]
[null,"Industrial",{"$f":"AB102","v":0},1,{"$f":"C94*D94","v":0},null,null,null,null,null,null,"Assuming 100% consumptive",null,null,null,null,null,null,null,null,null,null,null,null,"Outflow to marine",null,null,"Negligible due to distance from marine shoreline"]
[null,"Commercial",{"$f":"AB103","v":0},1,0,null,null,null,null,null,null,"Assuming 100% consumptive",null,null,null,null,null,null,null,null,null,null,null,null,"Outflow to surface waters",null,null,"Variable: (1) moderate to high along west side of AQ into Koksilah River based on unconfined to semi-confined AQ settings, elevated position relative to Koksilah River, and deeply incised nature of the Koksilah River;   (2)  low to internal streams due to low-permeability surface soils (streams primarily fed by Cobble Hill Quarry Lake outflow)"]
[null,"Domestic",15604,1,15604,null,null,null,null,null,null,"Assuming 100% consumptive",null,null,null,null,null,null,null,null,null,null,null,null,"Outflow to other AQ",null,null,"Possible basal outflow to bedrock AQ 202 in areas where artesian bedrock conditions are not apparent"]
[null,"Irrigation",28531,1,28531,null,null,null,null,null,null,"Assuming 100% consumptive",null,null,null,null,null,null,null,null,null,null,null,null,"Temporal variability",null,null,"Variable: (1)  near-surface unconfined AQ zones: moderate to high (2) Deeper semi-confined AQ zones: low"]
[null,"BCMOE Obs",0,1,0,null,null,null,null,null,null,"Assuming 100% consumptive"]
[null,"Other",0,1,0,null,null,null,null,null,null,"Assuming 100% consumptive",null,null,null,null,null,null,null,null,null,null,"Groundwater Development"]
[null,"Water Supply Systems",0,1,0,null,null,null,null,null,null,"Assuming 100% consumptive",null,null,null,null,null,null,null,null,null,null,null,null,"Nearest BCMOE Observation Wells; distance; completion / relevance",null,null,"Well #320 is 3.3 km to east-northeast; negligible relevancy, well completed within surficial AQ197"]
[null,"Total",{"$f":"-SUM(C94:C100)","v":-44135},null,{"$f":"-SUM(E94:E100)","v":-44135},null,null,null,null,null,null,null,null,null,null,null,null,null,null,null,null,null,null,null,"Total Annual Water Use (m3/yr) as reported by Hatfield (2015)",null,null,null,"  SUMS"]
[null,null,null,null,null,null,null,"Rest of the water going back into ground",null,null,null,null,null,null,null,null,null,null,null,null,null,null,null,null,null,"Industrial",null,0,"Total Commercial and Industrial"]
[null,null,null,null,null,null,null,null,null,null,null,null,null,null,null,null,null,null,null,null,null,null,null,null,null,"Commercial",null,0,{"$f":"AB102+AB103","v":0}]
[null,null,null,null,null,null,null,null,null,null,null,null,null,null,null,null,null,null,null,null,null,null,null,null,null,"Domestic",null,15604,"Total Irrigation"]
[null,null,null,null,null,null,{"$f":"AB105*0.8","v":22824.800000000003},null,null,null,null,null,null,null,null,null,null,null,null,null,null,null,null,null,null,"Irrigation from Groundwater (MoAg)",null,28531,{"$f":"AB105","v":28531}]
[null,null,null,null,null,null,null,null,null,null,null,null,null,null,null,null,null,null,null,null,null,null,null,null,null,"BCMOE Obs",null,0]
[null,null,null,null,null,null,null,null,null,null,null,null,null,null,null,null,null,null,null,null,null,null,null,null,null,"Other",null,0,"Total Domestic + Water Systems + Other"]
[null,null,null,null,null,null,null,null,null,null,null,null,null,null,null,null,null,null,null,null,null,null,null,null,null,"Water Supply Systems",null,0,{"$f":"AB104+AB107+AB108","v":15604}]
[null,null,null,null,null,null,null,null,null,null,null,null,null,null,null,null,null,null,null,null,null,null,null,null,null,null,"CVRD-managed"]
[null,null,null,null,null,null,null,null,null,null,null,null,null,null,null,null,null,null,null,null,null,null,null,null,null,null,"ID Managed"]
[null,null,null,null,null,null,null,null,null,null,null,null,null,null,null,null,null,null,null,null,null,null,null,null,null,null,"Private"]

{"sheet":"Surficial AQ 205","index":15,"n_rows":108,"n_cols":29,"rows_kept":108,"cut":false,"hidden":false,"merged":[[1,2,1,4],[51,17,51,19],[79,3,80,3],[79,4,80,4],[79,5,80,5],[79,12,79,14],[79,9,79,11],[2,2,2,4],[3,2,3,4],[4,2,4,4],[36,16,36,20],[21,16,21,20],[6,16,6,20],[79,1,80,1],[79,2,80,2],[79,6,80,6],[79,7,80,7],[79,8,80,8],[86,11,87,11],[91,1,93,1],[91,2,91,10],[92,2,92,4],[92,5,92,7],[92,8,92,10],[86,1,87,1],[86,2,87,2],[86,3,87,3],[86,4,87,4],[86,5,87,5],[86,6,87,6],[86,7,87,7],[86,8,86,10]]}
[null,"CHM Aquifer Criteria: Aquifer #0205, Carlton (Surficial)",null,null,null,null,null,null,null,null,null,null,null,null,null,null,null,null,null,null,null,null,"TABLE J-1"]
[null,"AQ tag","205 Carlton",null,null,null,null,null,null,null,null,null,null,null,null,null,null,null,null,null,null,null,"CHM Aquifer Criteria: Aquifer #0205, Carlton (Surficial)"]
[null,"Perimeter (km)","8.22 (BCMOE boundary defined by watercourses, not well log AQ lithologies - actual outline is more irregular)"]
[null,"Area (km2)","2.73  (BCMOE boundary defined by watercourses, does not match well log AQ lithologies - actual area is smaller)",null,null,null,null,null,null,null,null,null,null,null,null,null,null,null,null,null,null,null,"BCMOE Criteria"]
[null,"Aquifer materials","Sand and gravel",null,null,null,null,null,null,null,null,null,null,null,null,null,null,null,null,null,null,null,null,"AQ tag",null,null,null,"205 Carlton"]
[null,"Table J-4 Monthly  Summary of AQ205 Water Budgets",null,null,null,null,null,null,null,null,null,null,null,null,null,null,"Table J-3 Annual Summary of AQ205 Water Budgets",null,null,null,null,null,null,"AQ classification",null,null,null,"IIC (9)"]
[null,"Monthly Gains and Loses (m3)","Average Year",null,null,null,null,null,null,null,null,null,null,null,null,null,"Summary - 30 Year Average",null,null,null,null,null,null,"AQ type",null,null,null,"BCMOE Classification = 4b (SLR Classification = 4a / 4b)"]
[null,"Source","Jan","Feb","Mar","Apr","May","Jun","Jul","Aug","Sep","Oct","Nov","Dec","Total",null,"Gains and Losses","Source","Area (m2)","Infiltration Rate","Q (m3/yr)",null,null,"Location",null,null,null,"Cobble Hill / Shawnigan Lake"]
[{"$f":"$C$7&B9","v":"Average YearDirect Recharge to 205"},"Direct Recharge to 205",{"$f":"C55*$U$9","v":259166.13955856982},168810.84344155417,121825.90233668902,29256.616021833128,-35215.853156515463,-55532.691516043618,-54178.235625408408,-24380.206031433783,-8126.7353438112605,89100.29643238963,273379.9058185168,266505.56594533974,{"$f":"SUM(C9:N9)","v":1030611.5478816797},null,"Gain","Direct Recharge to 205",{"$f":"272.869159518*10000","v":2728691.5951800002},{"$f":"U9/S9","v":0.3776944047843907},{"$f":"S58","v":1030611.5478816797},null,null,"Perimeter (km)",null,null,null,"8.22 (BCMOE boundary defined by watercourses, not well log AQ lithologies - actual outline is more irregular)"]
[{"$f":"$C$7&B10","v":"Average YearLeakage down to 207"},"Leakage down to 207",{"$f":"C56*$U$10","v":-44204.803841916008},-42567.588884808007,-47479.233756132002,-46933.495437096004,-49116.448713240003,-46933.495437096004,-47479.233756132002,-46387.757118060006,-44204.803841916008,-44750.542160952005,-42567.588884808007,-43113.327203844005,{"$f":"SUM(C10:N10)","v":-545738.31903600006},null,"Loss","Leakage down to 207",{"$f":"272.869159518*10000","v":2728691.5951800002},0.2,{"$f":"M84","v":-545738.31903600006},null,null,"Area (km2)",null,null,null,"2.73  (BCMOE boundary defined by watercourses, does not match well log AQ lithologies - actual area is smaller)"]
["Average YearLateral Groundwater","Lateral Groundwater",{"$f":"C56*$U$11","v":-33462.849600000001},-32223.484800000002,-35941.5792,-35528.457600000002,-37180.944000000003,-35528.457600000002,-35941.5792,-35115.336000000003,-33462.849600000001,-33875.971200000007,-32223.484800000002,-32636.606400000004,-413121.60000000003,null,"Loss","Lateral Groundwater","--","--",{"$f":"SUMIF(M82:M83,\"<0\")","v":-413121.60000000003},null,null,"Aquifer materials",null,null,null,"Sand and gravel"]
["Average YearLateral Groundwater","Lateral Groundwater",{"$f":"C56*$U$12","v":0},0,0,0,0,0,0,0,0,0,0,0,0,null,"Gain","Lateral Groundwater","--","--",{"$f":"SUMIF(M82:M83,\">0\")","v":0},null,null,"Lithostratigraphic unit",null,null,null,"Vashon Drift"]
["Average YearSurface Water","Surface Water",{"$f":"C57*$U$13","v":-37580.715424152448},-32992.75569449654,-23832.479260307035,-11523.07826541244,-4085.8112790860619,-1657.198580200617,-984.18129277818446,-319.68321152565568,-268.78095466047796,-2466.9491266500136,-17434.768406863222,-37147.998503867319,-170294.40000000002,null,"Loss","Surface Water","--","--",{"$f":"SUMIF(I89,\"<0\")","v":-170294.39999999999},null,null,"Productivity",null,null,null,"Moderate"]
["Average YearSurface Water","Surface Water",{"$f":"C57*$U$14","v":0},0,0,0,0,0,0,0,0,0,0,0,0,null,"Gain","Surface Water","--","--",{"$f":"SUMIF(I89,\">0\")","v":0},null,null,"Vulnerability",null,null,null,"Low"]
["Average YearWater Well Useage","Water Well Useage",{"$f":"C58*$U$15","v":-7968.24},-8632.26,-9960.2999999999993,-10624.32,-11952.359999999999,-13280.400000000001,-14608.44,-15272.460000000001,-13280.400000000001,-10624.32,-9296.2800000000007,-7304.22,-132804,null,"Loss","Water Usage","--","--",{"$f":"E102","v":-132804},null,null,"Demand",null,null,null,"Moderate"]
["Average YearNet Gain","Net Gain",{"$f":"SUMIF(C9:C15, \">0\")","v":259166.13955856982},168810.84344155417,121825.90233668902,29256.616021833128,0,0,0,0,0,89100.29643238963,273379.9058185168,266505.56594533974,1208045.2695548926,null,"Net Gain",null,null,null,{"$f":"SUMIF(U8:U15, \">0\")","v":1030611.5478816797},null,null,"Use",null,null,null,"Multiple"]
["Average YearNet Loss","Net Loss",{"$f":"SUMIF(C9:C15, \"<0\")","v":-123216.60886606846},-116416.08937930454,-117213.59221643904,-104609.35130250844,-137551.41714884152,-152932.24313334023,-153191.66987431858,-121475.44236101946,-99343.569740387757,-91717.782487602031,-101522.12209167123,-120202.15210771133,-1439392.0407092127,null,"Net Loss",null,null,null,{"$f":"SUMIF(U8:U15, \"<0\")","v":-1261958.3190359999}]
["Average YearNet Total (Gain - Loss)","Net Total (Gain - Loss)",{"$f":"SUM(C16:C17)","v":135949.53069250134},{"$f":"SUM(D16:D17)","v":52394.754062249631},4612.310120249982,-75352.735280675319,-137551.41714884152,-152932.24313334023,-153191.66987431858,-121475.44236101946,-99343.569740387757,-2617.486055212401,171857.78372684558,146303.41383762841,-231346.7711543203,null,"Net Total (Gain - Loss)",null,null,null,{"$f":"SUM(U16:U17)","v":-231346.77115432022},null,"Location"]
[null,null,null,null,null,null,null,null,null,null,null,null,null,null,null,null,null,null,null,null,null,null,null,"NTS 50000",null,null,null,"092B/12"]
[null,null,null,null,null,null,null,null,null,null,null,null,null,null,null,null,null,null,null,null,null,null,null,"TRIM 20000",null,null,null,"092B.063"]
[null,null,null,null,null,null,null,null,null,null,null,null,null,null,null,null,null,null,null,null,null,null,null,"Lat / Long (Centre)",null,null,null,"48o39'26\" / 123o35'19\""]
[null,"Monthly Gains and Loses (m3)","Hot/Dry (1989)",null,null,null,null,null,null,null,null,null,null,null,null,null,"Summary - Hot/Dry (1989)",null,null,null,null,null,null,"UTM Zone 10 (Centre)",null,null,null,"456654E / 5389517N"]
[null,"Source","Jan","Feb","Mar","Apr","May","Jun","Jul","Aug","Sep","Oct","Nov","Dec","Total",null,"Gains and Losses","Source","Area (m2)","Infiltration Rate","Q (m3/yr)"]
[{"$f":"$C$22&B24","v":"Hot/Dry (1989)Direct Recharge to 205"},"Direct Recharge to 205",{"$f":"C62*$U$24","v":212580.37057731871},{"$f":"D62*$U$24","v":121901.03015716889},189544.50732887624,11377.429481335765,-44697.044390961928,-56887.147406678814,-48760.412062867559,-20316.838359528152,-13544.5589063521,34538.625211197854,135581.03465258449,172015.89811067167,{"$f":"SUM(C24:N24)","v":693332.89439276501},null,"Gain","Direct Recharge to 205",{"$f":"272.869159518*10000","v":2728691.5951800002},{"$f":"U24/S24","v":0.25408987062425015},{"$f":"R58","v":693332.89439276501},null,"Climate"]
[{"$f":"$C$22&B25","v":"Hot/Dry (1989)Leakage down to 207"},"Leakage down to 207",{"$f":"C63*$U$25","v":-44750.542160952005},{"$f":"D63*$U$25","v":-41476.112246736004},-45842.018799024008,-45296.28047998801,-47479.233756132002,-45842.018799024008,-47479.233756132002,-46933.495437096004,-44750.542160952005,-46387.757118060006,-44204.803841916008,-45296.28047998801,{"$f":"SUM(C25:N25)","v":-545738.31903600006},null,"Loss","Leakage down to 207",{"$f":"272.869159518*10000","v":2728691.5951800002},0.2,{"$f":"M84","v":-545738.31903600006},null,null,"Nearest active EC weather station / distance / elevation",null,null,null,"EC1015136 Mill Bay SW1  570 m to southeast                                                                                                                                                                      EC1017230 Shawnigan Lake 2.1 km to west"]
["Hot/Dry (1989)Lateral Groundwater","Lateral Groundwater",{"$f":"C63*$U$26","v":-33875.971200000007},{"$f":"D63*$U$26","v":-31397.241600000001},-34702.214400000004,-34289.092800000006,-35941.5792,-34702.214400000004,-35941.5792,-35528.457600000002,-33875.971200000007,-35115.336000000003,-33462.849600000001,-34289.092800000006,-413121.60000000009,null,"Loss","Lateral Groundwater","--","--",{"$f":"SUMIF(M82:M83,\"<0\")","v":-413121.60000000003},null,null,"IDF Curve",null,null,null,"Unknown"]
["Hot/Dry (1989)Lateral Groundwater","Lateral Groundwater",{"$f":"C63*$U$27","v":0},{"$f":"D63*$U$27","v":0},0,0,0,0,0,0,0,0,0,0,0,null,"Gain","Lateral Groundwater","--","--",{"$f":"SUMIF(M82:M83,\">0\")","v":0}]
["Hot/Dry (1989)Surface Water","Surface Water",{"$f":"C64*$U$28","v":-37580.715424152448},{"$f":"D64*$U$28","v":-32992.75569449654},-23832.479260307035,-11523.07826541244,-4085.8112790860619,-1657.198580200617,-984.18129277818446,-319.68321152565568,-268.78095466047796,-2466.9491266500136,-17434.768406863222,-37147.998503867319,-170294.40000000002,null,"Loss","Surface Water","--","--",{"$f":"SUMIF(I89,\"<0\")","v":-170294.39999999999},null,"Physiography"]
["Hot/Dry (1989)Surface Water","Surface Water",{"$f":"C64*$U$29","v":0},{"$f":"D64*$U$29","v":0},0,0,0,0,0,0,0,0,0,0,0,null,"Gain","Surface Water","--","--",{"$f":"SUMIF(I89,\">0\")","v":0},null,null,"Physiographic zone",null,null,null,"Canadian Cordillera / Western System / Coastal Trough / Georgia Depression / Nanaimo Lowland"]
["Hot/Dry (1989)Water Well Useage","Water Well Useage",{"$f":"C65*$U$30","v":-7968.24},{"$f":"D65*$U$30","v":-8632.26},-9960.2999999999993,-10624.32,-11952.359999999999,-13280.400000000001,-14608.44,-15272.460000000001,-13280.400000000001,-10624.32,-9296.2800000000007,-7304.22,-132804,null,"Loss","Water Usage","--","--",{"$f":"E102","v":-132804},null,null,"Elevation range (m amsl)",null,null,null,"50 - 120 m"]
["Hot/Dry (1989)Net Gain","Net Gain",{"$f":"SUMIF(C24:C30, \">0\")","v":212580.37057731871},121901.03015716889,189544.50732887624,11377.429481335765,0,0,0,0,0,34538.625211197854,135581.03465258449,172015.89811067167,877538.89551915356,null,"Net Gain",null,null,null,{"$f":"SUMIF(U23:U30, \">0\")","v":693332.89439276501},null,null,"Distance to marine",null,null,null,"Mill Bay is 1.6 km to the east"]
["Hot/Dry (1989)Net Loss","Net Loss",{"$f":"SUMIF(C24:C30, \"<0\")","v":-124175.46878510447},-114498.36954123255,-114337.01245933106,-101732.77154540044,-144156.02862617999,-152368.97918590342,-147773.84631177774,-118370.93460814981,-105720.25322196461,-94594.362244710006,-104398.70184877924,-124037.59178385533,-1446164.320162389,null,"Net Loss",null,null,null,{"$f":"SUMIF(U23:U30, \"<0\")","v":-1261958.3190359999},null,null,"Geomorphological setting",null,null,null,"East-southeast facing, rolling to hummocky area containing  several  low, conical hills separated by gently-incised, dendritic streams and depressional areas with small wetlands.  Probably represents a variably-thick morainal / glaciofluvial outwash blanket deposited on the east flanks for the Cobble Hill / Old Baldy Mountain upland area.  AQ is bounded to the southeast by Hollings Creek & extreme northwest corner by Shawnigan Creek"]
["Hot/Dry (1989)Net Total (Gain - Loss)","Net Total (Gain - Loss)",{"$f":"SUM(C31:C32)","v":88404.901792214238},{"$f":"SUM(D31:D32)","v":7402.6606159363437},75207.494869545175,-90355.342064064665,-144156.02862617999,-152368.97918590342,-147773.84631177774,-118370.93460814981,-105720.25322196461,-60055.737033512152,31182.332803805257,47978.306326816339,-568625.42464323516,null,"Net Total (Gain - Loss)",null,null,null,{"$f":"SUM(U31:U32)","v":-568625.42464323493},null,null,"Topography",null,null,null,"Generally rolling to undulating, east-southeast facing convex sidehill with broad, shallow, concave stream valleys"]
[null,null,null,null,null,null,null,null,null,null,null,null,null,null,null,null,null,null,null,null,null,null,null,"Terrain",null,null,null,"Generally rolling to undulating"]
[null,null,null,null,null,null,null,null,null,null,null,null,null,null,null,null,null,null,null,null,null,null,null,"Aspect",null,null,null,"Generally east-southeast facing"]
[null,null,null,null,null,null,null,null,null,null,null,null,null,null,null,null,null,null,null,null,null,null,null,"Slope",null,null,null,"Low concave / convex ground slopes"]
[null,"Monthly Gains and Loses (m3)","Cold/Wet (1999)",null,null,null,null,null,null,null,null,null,null,null,null,null,"Summary - Wet/Cold (1999)",null,null,null,null,null,null,"XS max grade (m/m)",null,null,null,"0.056 E through centre short axis of AQ"]
[null,"Source","Jan","Feb","Mar","Apr","May","Jun","Jul","Aug","Sep","Oct","Nov","Dec","Total",null,"Gains and Losses","Source","Area (m2)","Infiltration Rate","Q (m3/yr)",null,null,"Roughness coefficient",null,null,null,"0.40 (75% mostly cleared agricultural fields & rural residential properties / 25% forested)"]
[{"$f":"$C$37&B39","v":"Cold/Wet (1999)Direct Recharge to 205"},"Direct Recharge to 205",{"$f":"C69*$U$39","v":480967.28676456312},486952.51487200573,180593.83910483017,-21671.294250163362,-17607.926578257731,-46051.500281597138,-59596.059187949242,-24380.20603143378,-10835.647125081681,170796.88780909998,276038.1105114558,295135.93856941228,{"$f":"SUM(C39:N39)","v":1710341.9441768846},null,"Gain","Direct Recharge to 205",{"$f":"272.869159518*10000","v":2728691.5951800002},{"$f":"U39/S39","v":0.62679928622129988},{"$f":"T58","v":1710341.9441768844}]
[{"$f":"$C$37&B40","v":"Cold/Wet (1999)Leakage down to 207"},"Leakage down to 207",{"$f":"C70*$U$40","v":-44204.803841916008},{"$f":"D70*$U$40","v":-42567.588884808007},-47479.233756132002,-46933.495437096004,-49116.448713240003,-46933.495437096004,-47479.233756132002,-46387.757118060006,-44204.803841916008,-44750.542160952005,-42567.588884808007,-43113.327203844005,{"$f":"SUM(C40:N40)","v":-545738.31903600006},null,"Loss","Leakage down to 207",{"$f":"272.869159518*10000","v":2728691.5951800002},0.2,{"$f":"M84","v":-545738.31903600006},null,"Geology"]
["Cold/Wet (1999)Lateral Groundwater","Lateral Groundwater",{"$f":"C70*$U$41","v":-33462.849600000001},{"$f":"D70*$U$41","v":-32223.484800000002},-35941.5792,-35528.457600000002,-37180.944000000003,-35528.457600000002,-35941.5792,-35115.336000000003,-33462.849600000001,-33875.971200000007,-32223.484800000002,-32636.606400000004,-413121.60000000003,null,"Loss","Lateral Groundwater","--","--",{"$f":"SUMIF(M82:M83,\"<0\")","v":-413121.60000000003},null,null,"Terrane",null,null,null,"Wrangellia"]
["Cold/Wet (1999)Lateral Groundwater","Lateral Groundwater",{"$f":"C70*$U$42","v":0},{"$f":"D70*$U$42","v":0},0,0,0,0,0,0,0,0,0,0,0,null,"Gain","Lateral Groundwater","--","--",{"$f":"SUMIF(M82:M83,\">0\")","v":0},null,null,"Bedrock (type ; age ; formation ; lithology)"]
["Cold/Wet (1999)Surface Water","Surface Water",{"$f":"C71*$U$43","v":-37580.715424152448},{"$f":"D71*$U$43","v":-32992.75569449654},-23832.479260307035,-11523.07826541244,-4085.8112790860619,-1657.198580200617,-984.18129277818446,-319.68321152565568,-268.78095466047796,-2466.9491266500136,-17434.768406863222,-37147.998503867319,-170294.40000000002,null,"Loss","Surface Water","--","--",{"$f":"SUMIF(I89,\"<0\")","v":-170294.39999999999},null,null,null,"Primary",null,null,"West 2/3 =  Jurassic Bonanza Group Volcanics (IJBca); basaltic-andesitic (65%) - suspected more lithologies present than identified by BCGS - (limestone?)"]
["Cold/Wet (1999)Surface Water","Surface Water",{"$f":"C71*$U$44","v":0},{"$f":"D71*$U$44","v":0},0,0,0,0,0,0,0,0,0,0,0,null,"Gain","Surface Water","--","--",{"$f":"SUMIF(I89,\">0\")","v":0},null,null,null,"Secondary",null,null,"East 1/3 = Early to Middle Jurassic Island Plutonic Suite (EMJIgd); granodioritic intrusive rocks (35%)       "]
["Cold/Wet (1999)Water Well Useage","Water Well Useage",{"$f":"C72*$U$45","v":-7968.24},{"$f":"D72*$U$45","v":-8632.26},-9960.2999999999993,-10624.32,-11952.359999999999,-13280.400000000001,-14608.44,-15272.460000000001,-13280.400000000001,-10624.32,-9296.2800000000007,-7304.22,-132804,null,"Loss","Water Usage","--","--",{"$f":"E102","v":-132804},null,null,"Structure",null,null,null,"None mapped by BCGS.                                                                                                                                                                                                                              Suspected: northeast-trending trace of Shawnigan Fault approx  250 m southeast of AQ; northeast-trending , high-angle fault crossing extreme southwest corner of AQ"]
["Cold/Wet (1999)Net Gain","Net Gain",{"$f":"SUMIF(C39:C45, \">0\")","v":480967.28676456312},486952.51487200573,180593.83910483017,0,0,0,0,0,0,170796.88780909998,276038.1105114558,295135.93856941228,1890484.5776313671,null,"Net Gain",null,null,null,{"$f":"SUMIF(U38:U45, \">0\")","v":1710341.9441768844},null,null,"Surficial (formation; lithology; thickness)",null,null,null,"Vashon Drift morainal-glaciofluvial outwash deposit with minor glaciolacustrine component"]
["Cold/Wet (1999)Net Loss","Net Loss",{"$f":"SUMIF(C39:C45, \"<0\")","v":-123216.60886606846},-116416.08937930454,-117213.59221643904,-126280.64555267181,-119943.4905705838,-143451.05189889378,-158609.49343685943,-121475.44236101946,-102052.48152165819,-91717.782487602031,-101522.12209167123,-120202.15210771133,-1442100.9524904832,null,"Net Loss",null,null,null,{"$f":"SUMIF(U38:U45, \"<0\")","v":-1261958.3190359999},null,null,"Surficial designation (1993)",null,null,null,"Level areas & wetlands = $LGp; low hills between depressions = dMbh/R"]
["Cold/Wet (1999)Net Total (Gain - Loss)","Net Total (Gain - Loss)",{"$f":"SUM(C46:C47)","v":357750.67789849464},{"$f":"SUM(D46:D47)","v":370536.42549270118},63380.246888391135,-126280.64555267181,-119943.4905705838,-143451.05189889378,-158609.49343685943,-121475.44236101946,-102052.48152165819,79079.105321497947,174515.98841978458,174933.78646170095,448383.62514088384,null,"Net Total (Gain - Loss)",null,null,null,{"$f":"SUM(U46:U47)","v":448383.62514088443},null,null,"Soils (association; parent; texture; drainage; type; comments)",null,null,null,"Level areas & wetlands = AR1/b (Arrowsmith organic) T.M; low hills between depressions = FF1V8TT72/DE (Finlayson-Tagner marine) silty-clay, GLE.DYB/O.HG / subordinate S1v6Q5RL51/ef in ele vated areas (Shawnigan morainal & Quamichan fluvial, shallow lithic), gravelly-sandy loam, DU.DYB;                                                                                                                                                                                                                                                                                                       "]
[null,null,null,null,null,null,null,null,null,null,null,null,null,null,null,null,null,null,null,null,null,null,null,"Restrictive layers",null,null,null,"Yes, impersistent - low permeability organic and/or clay-rich soil layers in level areas + subsurface silt-clay aquitards (complex internal stratigraphy) / local surface duric layers in Shawnigan soil areas"]
[null,null,null,null,null,null,null,null,null,null,null,null,null,null,null,null,null,null,null,null,null,null,null,"Estimated permeability",null,null,null,"Variable at surface & subsurface due to stratigraphic complexity"]
[null,null,null,null,null,null,null,null,null,null,null,null,null,null,null,null,"Table J-2.  Direct Recharge Calculation for AQ205"]
[null,"Table J-5  Monthly  Coefficients used in Calculations for AQ205",null,null,null,null,null,null,null,null,null,null,null,null,null,null,null,"Direct Recharge Calculation",null,null,null,null,"Hydrology"]
[null,"Monthly Factors","30 Year Average",null,null,null,null,null,null,null,null,null,null,null,null,null,null,"Hot/Dry","Average","Cold/Wet",null,null,null,"GW / SW basin coincidence",null,null,null,"Yes - contained  within Shawnigan Creek watershed (south side), but contains several internal tributary subcatchments"]
[null,null,"Jan","Feb","Mar","Apr","May","Jun","Jul","Aug","Sep","Oct","Nov","Dec",null,null,"Surplus (mm)",{"$f":"SUM('Climate Dashboard'!AA42:AL42)","v":511.89034592156941},{"$f":"SUM('Climate Dashboard'!C48:AL48)/3","v":760.90447463619182},{"$f":"SUM('Climate Dashboard'!AA54:AL54)","v":1262.7520438297711},null,null,null,"Catchments",null,null,null,"Shawnigan Creek (south side), North & South Taggart Creeks, Ericson Creek, & unnamed streams"]
[null,"Surplus Water",{"$f":"'Monthly Factors'!B16","v":0.25146830548450599},{"$f":"'Monthly Factors'!C16","v":0.16379677075085},{"$f":"'Monthly Factors'!D16","v":0.1182073911233482},{"$f":"'Monthly Factors'!E16","v":2.8387626824061124E-2},{"$f":"'Monthly Factors'!F16","v":-3.4169860825738051E-2},{"$f":"'Monthly Factors'!G16","v":-5.3883242071356162E-2},{"$f":"'Monthly Factors'!H16","v":-5.2569016654981621E-2},{"$f":"'Monthly Factors'!I16","v":-2.3656057494741728E-2},{"$f":"'Monthly Factors'!J16","v":-7.8853524982472421E-3},{"$f":"'Monthly Factors'!K16","v":8.6453811443823317E-2},{"$f":"'Monthly Factors'!L16","v":0.26525988999485034},{"$f":"'Monthly Factors'!M16","v":0.25858973392362583},null,null,"Station Coeffiecient Factor",1.06,1.06,1.06,null,null,null,"Drainage regime",null,null,null,"Dendritic"]
[null,"Leakance/\nLateral Ground Water",{"$f":"'Monthly Factors'!B42","v":8.1000000000000003E-2},{"$f":"'Monthly Factors'!C42","v":7.8E-2},{"$f":"'Monthly Factors'!D42","v":8.6999999999999994E-2},{"$f":"'Monthly Factors'!E42","v":8.5999999999999993E-2},{"$f":"'Monthly Factors'!F42","v":0.09},{"$f":"'Monthly Factors'!G42","v":8.5999999999999993E-2},{"$f":"'Monthly Factors'!H42","v":8.6999999999999994E-2},{"$f":"'Monthly Factors'!I42","v":8.5000000000000006E-2},{"$f":"'Monthly Factors'!J42","v":8.1000000000000003E-2},{"$f":"'Monthly Factors'!K42","v":8.2000000000000003E-2},{"$f":"'Monthly Factors'!L42","v":7.8E-2},{"$f":"'Monthly Factors'!M42","v":7.9000000000000001E-2},null,null,"Infiltration Coefficient",0.468278855085,0.468278855085,0.468278855085,null,null,null,"Surface waters",null,null,null,"Shawnigan Creek (south side), North & South Taggart Creeks, Ericson Creek, & several unnamed streams  & wetlands + northwest corner = Cameron Wetland (contains Shawnigan Creek mainstem),"]
[null,"Surface Water",{"$f":"'Monthly Factors'!B26","v":0.22068086457424585},{"$f":"'Monthly Factors'!C26","v":0.19373952223030552},{"$f":"'Monthly Factors'!D26","v":0.13994869625957773},{"$f":"'Monthly Factors'!E26","v":6.7665632372012466E-2},{"$f":"'Monthly Factors'!F26","v":2.399263439717373E-2},{"$f":"'Monthly Factors'!G26","v":9.7313744914725147E-3},{"$f":"'Monthly Factors'!H26","v":5.7792933459831003E-3},{"$f":"'Monthly Factors'!I26","v":1.8772385441074731E-3},{"$f":"'Monthly Factors'!J26","v":1.5783311410150771E-3},{"$f":"'Monthly Factors'!K26","v":1.4486378451963268E-2},{"$f":"'Monthly Factors'!L26","v":0.10238016286421177},{"$f":"'Monthly Factors'!M26","v":0.21813987132793164},null,null,"Area (m2)",{"$f":"S9","v":2728691.5951800002},{"$f":"S9","v":2728691.5951800002},{"$f":"S9","v":2728691.5951800002},null,null,null,"Runoff coefficient",null,null,null,"Rolling terrain, 75% partly cleared agricultural + 25% subordinate forestry blocks & rural residential land = 0.45"]
[null,"Water Usage",{"$f":"'Monthly Factors'!B31","v":0.06},{"$f":"'Monthly Factors'!C31","v":6.5000000000000002E-2},{"$f":"'Monthly Factors'!D31","v":7.4999999999999997E-2},{"$f":"'Monthly Factors'!E31","v":0.08},{"$f":"'Monthly Factors'!F31","v":0.09},{"$f":"'Monthly Factors'!G31","v":0.1},{"$f":"'Monthly Factors'!H31","v":0.11},{"$f":"'Monthly Factors'!I31","v":0.115},{"$f":"'Monthly Factors'!J31","v":0.1},{"$f":"'Monthly Factors'!K31","v":0.08},{"$f":"'Monthly Factors'!L31","v":7.0000000000000007E-2},{"$f":"'Monthly Factors'!M31","v":5.5E-2},null,null,"Q (m3/yr)",{"$f":"(R54/1000)*R55*R56*R57","v":693332.89439276501},{"$f":"(S54/1000)*S55*S56*S57","v":1030611.5478816797},{"$f":"(T54/1000)*T55*T56*T57","v":1710341.9441768844},null,null,null,"Nearest Active EC hydrometric station; distance; type",null,null,null,"Shawnigan Creek @ Mill Bay; 450 m east (inactive)                                                                                                                                                                        EC 08HA003 Koksilah River  @ Cowichan Station; 8.9 km northwest; active realtime                                                                                                   "]
[null,null,null,null,null,null,null,null,null,null,null,null,null,null,null,null,"Average Infiltration Rate",{"$f":"R58/R57","v":0.25408987062425015},{"$f":"S58/S57","v":0.3776944047843907},{"$f":"T58/T57","v":0.62679928622129988},null,null,null,"Surface water diversions ; relevance",null,null,null,"14 licences along internal Shawnigan Creek tributaries (Taggart Creeks, Ericsopn Creek, and unnamed streams); moderate to high relevance for unconfined AQ zones (recorded low-elevation artesian well flows from unconfined AQ on east border)"]
[null,"Monthly Factors","Hot/Dry (1989)"]
[null,null,"Jan","Feb","Mar","Apr","May","Jun","Jul","Aug","Sep","Oct","Nov","Dec",null,null,null,null,null,null,null,null,"Land Cover"]
[null,"Surplus Water",{"$f":"'Monthly Factors'!B11","v":0.30660649782598431},{"$f":"'Monthly Factors'!C11","v":0.17581890480464263},{"$f":"'Monthly Factors'!D11","v":0.27338167402959174},{"$f":"'Monthly Factors'!E11","v":1.6409764448433315E-2},{"$f":"'Monthly Factors'!F11","v":-6.4466931761702304E-2},{"$f":"'Monthly Factors'!G11","v":-8.2048822242166558E-2},{"$f":"'Monthly Factors'!H11","v":-7.032756192185706E-2},{"$f":"'Monthly Factors'!I11","v":-2.9303150800773774E-2},{"$f":"'Monthly Factors'!J11","v":-1.9535433867182515E-2},{"$f":"'Monthly Factors'!K11","v":4.9815356361315413E-2},{"$f":"'Monthly Factors'!L11","v":0.19554969301049696},{"$f":"'Monthly Factors'!M11","v":0.24810001011321794},null,null,null,null,null,null,null,null,null,"Vegetation zone",null,null,null,"CgF-wC in Finlayson-Tagner soils / CwH:a in Arrowsmith-Quamichan-Shawnigan soils"]
[null,"Leakance/\nLateral Ground Water",{"$f":"'Monthly Factors'!B43","v":8.2000000000000003E-2},{"$f":"'Monthly Factors'!C43","v":7.5999999999999998E-2},{"$f":"'Monthly Factors'!D43","v":8.4000000000000005E-2},{"$f":"'Monthly Factors'!E43","v":8.3000000000000004E-2},{"$f":"'Monthly Factors'!F43","v":8.6999999999999994E-2},{"$f":"'Monthly Factors'!G43","v":8.4000000000000005E-2},{"$f":"'Monthly Factors'!H43","v":8.6999999999999994E-2},{"$f":"'Monthly Factors'!I43","v":8.5999999999999993E-2},{"$f":"'Monthly Factors'!J43","v":8.2000000000000003E-2},{"$f":"'Monthly Factors'!K43","v":8.5000000000000006E-2},{"$f":"'Monthly Factors'!L43","v":8.1000000000000003E-2},{"$f":"'Monthly Factors'!M43","v":8.3000000000000004E-2},null,null,null,null,null,null,null,null,null,"Primary land uses",null,null,null,"75% cleared agricultural, 25%rural residential & forested "]
[null,"Surface Water",{"$f":"'Monthly Factors'!B26","v":0.22068086457424585},{"$f":"'Monthly Factors'!C26","v":0.19373952223030552},{"$f":"'Monthly Factors'!D26","v":0.13994869625957773},{"$f":"'Monthly Factors'!E26","v":6.7665632372012466E-2},{"$f":"'Monthly Factors'!F26","v":2.399263439717373E-2},{"$f":"'Monthly Factors'!G26","v":9.7313744914725147E-3},{"$f":"'Monthly Factors'!H26","v":5.7792933459831003E-3},{"$f":"'Monthly Factors'!I26","v":1.8772385441074731E-3},{"$f":"'Monthly Factors'!J26","v":1.5783311410150771E-3},{"$f":"'Monthly Factors'!K26","v":1.4486378451963268E-2},{"$f":"'Monthly Factors'!L26","v":0.10238016286421177},{"$f":"'Monthly Factors'!M26","v":0.21813987132793164},null,null,null,null,null,null,null,null,null,"Degree of development",null,null,null,"Cgf-wC "]
[null,"Water Usage",{"$f":"'Monthly Factors'!B31","v":0.06},{"$f":"'Monthly Factors'!C31","v":6.5000000000000002E-2},{"$f":"'Monthly Factors'!D31","v":7.4999999999999997E-2},{"$f":"'Monthly Factors'!E31","v":0.08},{"$f":"'Monthly Factors'!F31","v":0.09},{"$f":"'Monthly Factors'!G31","v":0.1},{"$f":"'Monthly Factors'!H31","v":0.11},{"$f":"'Monthly Factors'!I31","v":0.115},{"$f":"'Monthly Factors'!J31","v":0.1},{"$f":"'Monthly Factors'!K31","v":0.08},{"$f":"'Monthly Factors'!L31","v":7.0000000000000007E-2},{"$f":"'Monthly Factors'!M31","v":5.5E-2},null,null,null,null,null,null,null,null,null,"Evapotranspiration potential",null,null,null,"High"]
[null,null,null,null,null,null,null,null,null,null,null,null,null,null,null,null,null,null,null,null,null,null,null,"Relative environmental sensitivity",null,null,null,"Moderate in terrestrial areas, high along internal creeks and wetlands"]
[null,"Monthly Factors","Cold/Wet (1999)"]
[null,null,"Jan","Feb","Mar","Apr","May","Jun","Jul","Aug","Sep","Oct","Nov","Dec",null,null,null,null,null,null,null,null,"Hydrogeology (not including bedrock quarry area)"]
[null,"Surplus Water",{"$f":"'Monthly Factors'!B21","v":0.28121118610350893},{"$f":"'Monthly Factors'!C21","v":0.28471061972718881},{"$f":"'Monthly Factors'!D21","v":0.1055893178084587},{"$f":"'Monthly Factors'!E21","v":-1.2670737757409583E-2},{"$f":"'Monthly Factors'!F21","v":-1.0294974427895285E-2},{"$f":"'Monthly Factors'!G21","v":-2.6925317734495361E-2},{"$f":"'Monthly Factors'!H21","v":-3.4844528832876351E-2},{"$f":"'Monthly Factors'!I21","v":-1.425457997708578E-2},{"$f":"'Monthly Factors'!J21","v":-6.3353688787047913E-3},{"$f":"'Monthly Factors'!K21","v":9.9861251950584262E-2},{"$f":"'Monthly Factors'!L21","v":0.16139352218500455},{"$f":"'Monthly Factors'!M21","v":0.17255960983372176},null,null,null,null,null,null,null,null,null,"Groundwater occurrence (primary / secondary)",null,null,null,"Granular pore space infillings"]
[null,"Leakance/\nLateral Ground Water",{"$f":"'Monthly Factors'!B44","v":8.1000000000000003E-2},{"$f":"'Monthly Factors'!C44","v":7.8E-2},{"$f":"'Monthly Factors'!D44","v":8.6999999999999994E-2},{"$f":"'Monthly Factors'!E44","v":8.5999999999999993E-2},{"$f":"'Monthly Factors'!F44","v":0.09},{"$f":"'Monthly Factors'!G44","v":8.5999999999999993E-2},{"$f":"'Monthly Factors'!H44","v":8.6999999999999994E-2},{"$f":"'Monthly Factors'!I44","v":8.5000000000000006E-2},{"$f":"'Monthly Factors'!J44","v":8.1000000000000003E-2},{"$f":"'Monthly Factors'!K44","v":8.2000000000000003E-2},{"$f":"'Monthly Factors'!L44","v":7.8E-2},{"$f":"'Monthly Factors'!M44","v":7.9000000000000001E-2},null,null,null,null,null,null,null,null,null,"Primary porosity",null,null,null,"Variable: low in glaciolacustrine and morainal materials, moderate to high in glaciofluvial materials.  "]
[null,"Surface Water",{"$f":"'Monthly Factors'!B26","v":0.22068086457424585},{"$f":"'Monthly Factors'!C26","v":0.19373952223030552},{"$f":"'Monthly Factors'!D26","v":0.13994869625957773},{"$f":"'Monthly Factors'!E26","v":6.7665632372012466E-2},{"$f":"'Monthly Factors'!F26","v":2.399263439717373E-2},{"$f":"'Monthly Factors'!G26","v":9.7313744914725147E-3},{"$f":"'Monthly Factors'!H26","v":5.7792933459831003E-3},{"$f":"'Monthly Factors'!I26","v":1.8772385441074731E-3},{"$f":"'Monthly Factors'!J26","v":1.5783311410150771E-3},{"$f":"'Monthly Factors'!K26","v":1.4486378451963268E-2},{"$f":"'Monthly Factors'!L26","v":0.10238016286421177},{"$f":"'Monthly Factors'!M26","v":0.21813987132793164},null,null,null,null,null,null,null,null,null,"Secondary porosity",null,null,null,"Not applicable - surficial AQ"]
[null,"Water Usage",{"$f":"'Monthly Factors'!B31","v":0.06},{"$f":"'Monthly Factors'!C31","v":6.5000000000000002E-2},{"$f":"'Monthly Factors'!D31","v":7.4999999999999997E-2},{"$f":"'Monthly Factors'!E31","v":0.08},{"$f":"'Monthly Factors'!F31","v":0.09},{"$f":"'Monthly Factors'!G31","v":0.1},{"$f":"'Monthly Factors'!H31","v":0.11},{"$f":"'Monthly Factors'!I31","v":0.115},{"$f":"'Monthly Factors'!J31","v":0.1},{"$f":"'Monthly Factors'!K31","v":0.08},{"$f":"'Monthly Factors'!L31","v":7.0000000000000007E-2},{"$f":"'Monthly Factors'!M31","v":5.5E-2},null,null,null,null,null,null,null,null,null,"Confinement",null,null,null,"                           Suspected variable degrees of confinement: (1)  unconfined in most areas; (2) semi-confined to confined in south-central area.                                                                                                                                                                                                                                                  WP = 0 - 65.5 m, avg 23.5 m                                                                                                                                                                                                                                                                                                                    "]
[null,null,null,null,null,null,null,null,null,null,null,null,null,null,null,null,null,null,null,null,null,null,null,"Aquifer thickness",null,null,null,"Thickness of composite AQ  (including unconfined and semi-confined zones) variable: generally shallow in north half of AQ (10 - 30 m) / thicker in south-central area (up to 66 m deep, although actual AQ thickness below aquitards likely 50% less).                                                                                                                                                                                                                Irregular underlying bedrock surface = significant aquifer thickness variations over short horizontal distances "]
[null,null,null,null,null,null,null,null,null,null,null,null,null,null,null,null,null,null,null,null,null,null,null,"Hydraulic anisotropy",null,null,null,"Low to moderate in unconfined areas, elevated in semi-confined to confined areas"]
[null,null,null,null,null,null,null,null,null,null,null,null,null,null,null,null,null,null,null,null,null,null,null,"Hydraulic gradient",null,null,null,"Variable: likely low-moderate based on irregular local terrain / higher in rolling, hilly areas"]
[null,null,null,null,null,null,null,null,null,null,null,null,null,null,null,null,null,null,null,null,null,null,null,"Storage potential",null,null,null,"Locally moderate to high due to elevated proportions of sand-gravel glaciofluvial & morainal materials"]
[null,"TABLE J-6",null,null,null,null,null,null,null,null,null,null,null,null,null,null,null,null,null,null,null,null,null,"Yield potential",null,null,null,"Variable low-moderate depending on AQ host materials; WP = 0.19 - 3.16 L/s / average 0.85 L/s"]
[null,"Groundwater Flow Components: Aquifer #0205, Carlton (Surficial)",null,null,null,null,null,null,null,null,null,null,null,null,null,null,null,null,null,null,null,null,null,"Flow velocities",null,null,null,"Variable: likely low to moderate based on irregular local terrain / possibly higher in hilly areas"]
[null,null,null,null,null,null,null,null,null,null,null,null,null,null,null,null,null,null,null,null,null,null,null,"Flow directions",null,null,null,"Regional flow towards the east and Mill Bay / local flow directions likely variable depending on position with stream subcatchments & proximity to Shawnigan Creek.                                                                                                                                                                                                                                                         Deeper semi-confined to confined zones: flow direction uncertain,  may be influenced by bedrock surface irregularities"]
[null,"Groundwater Flow","Direction of Flow","Source or Receptor of Water","Length (m)","Depth (m)","Area (m)","Hydraulic Conductivity (m/s) - K","Distance (m) - dL","Hydraulic Head (m) - dh",null,null,"GW Flow (m3/yr)",null,null,null,null,null,null,null,null,null,null,"Static water levels",null,null,null,"WP = variable artesian - 37.8 m bgs / avg 12.8 m bgs"]
[null,null,null,null,null,null,null,null,null,"Year 1","Year 2","Year 3","Year 1","Year 2","Year 3",null,null,null,null,null,null,null,null,"Hydraulic connection with surface waters",null,null,null,"Near-surface unconfined AQ zones: moderate to high with internal streams and Shawnigan Creek.                                                                                                                                                                                                                                                 Deeper semi-confined to confined AQ zones: low connectivity to internal streams due to deep overburden cover / possible connection to incised portions of creeks along east edge of AQ or where bedrock forces groundwater to surface "]
[null,"QGW1","Out","AQ 207",1400,10,{"$f":"E82*F82","v":14000},1.0000000000000001E-5,1200,30,null,null,{"$f":"-(G82*H82*(J82/I82))*60*60*24*365","v":-110376.00000000001},null,null,null,null,null,null,null,null,null,null,"Hydraulic connection to adjacent AQ"]
[null,"QGW2","Out","Shawnigan Creek",1600,2,{"$f":"E83*F83","v":3200},3.0000000000000001E-5,"--","--","--","--",{"$f":"-((G83*0.1)*H83)*60*60*24*365","v":-302745.60000000003},null,null,null,null,null,null,null,null,null,null,null,"Over / Under",null,null,"                                                AQ overlies an undeveloped portion of bedrock AQ 207                                                                                                                                                                                                                     "]
[null,"QGW3","Out","Leakage to AQ 207","Leakance Factor (m/yr) = ",0.2,{"$f":"272.869159518*10000","v":2728691.5951800002},"--","--","--","--","--",{"$f":"-F84*G84","v":-545738.31903600006},null,null,null,null,null,null,null,null,null,null,null,"Upgradient",null,null,"AQ in contact with upgradient bedrock AQ 204 along its northwest corner (also bounded by Shawnigan Creek).  AQ  likely receives basal and lateral recharge from upgradient portions of surrounding bedrock AQ 204 to the  south, west, and north"]
[null,"Total",null,null,null,null,null,null,null,null,null,null,{"$f":"SUM(M82:M84)","v":-958859.91903600004},null,null,null,null,null,null,null,null,null,null,null,"Downgradient",null,null,"AQ in contact with downgradient portions of surrounding bedrock AQ 207 along its east and southeast borders .  AQ may also locally provide basal recharge to undeveloped portions of bedrock AQ 207, depending on local bedrick AQ hydraulic heads (may be upwelling / artesian  in some areas approaching the Shawnigan Fault to the southeast)"]
[null,null,null,null,null,null,null,null,null,null,null,null,null,null,null,null,null,null,null,null,null,null,null,"Vulnerability to surface contamination",null,null,null,"Variable: (1) near-surface unconfined AQ zones = low to high based on variable surficial lithologies and presence of low-permeability surface soil horizons; (2) deeper semi-confined to confined AQ zones - low based on deep overburden cover and overlying morainal aquitard"]
[null,"Surface Water Contributions","Cold Water Creek?","Observed Vertical Gradient","Percent Permeable","Length (m)","Width (m)","Flux (m/s)","SW Flow (m3/yr)",null,null,"Comment",null,null,null,null,null,null,null,null,null,null,null,"Recharge"]
[null,null,null,null,null,null,null,null,"Year 1","Year 2","Year 3",null,null,null,null,null,null,null,null,null,null,null,null,null,"Vertical inflow",null,null,"Variable: (1) near-surface unconfined AQ zones: moderate to high recharge from precipitation and irrigation-sewerage returns (high levels of rural residential and agricultural development) and well-documented seasonal flooding, negligible from snowmelt due to low elevations.  Variably low to moderate from stream losses, depending on local AQ hydraulic heads (2) deeper semi-confined AQ zones: low to negligible from precipitation due to deep overburden cover and overlying morainal aquitard. "]
[null,"Taggart Creek","Yes","Upward",0.1,900,2,3.0000000000000001E-5,{"$f":"-(E89*F89*G89)*(H89*60*60*24*365)","v":-170294.39999999999},null,null,"Creek feeds into Shawnigan Creek",null,null,null,null,null,null,null,null,null,null,null,null,"Lateral inflow",null,null,"Low - moderate lateral inflow from upgradient portions of bedrock AQ 207 to the south, west, and north.   Also possible upwelling inflow from underlying undeveloped portion of bedrock AQ 207"]
[null,"Total",null,null,null,null,null,null,{"$f":"SUM(I89:I89)","v":-170294.39999999999},{"$f":"SUM(J89:J89)","v":0},{"$f":"SUM(K89:K89)","v":0},null,null,null,null,null,null,null,null,null,null,null,null,null,"Temporal variability",null,null,"Variable:  (1) near-surface unconfined AQ zones: moderate to high depending on surficial lithologies and presence of low-permeability surface soil layers (2) Deeper semi-confined  & confined AQ zones: low due to deep overburden cover and overlying morainal aquitard"]
[null,null,null,null,null,null,null,null,null,null,null,null,null,null,null,null,null,null,null,null,null,null,null,null,"MBR",null,null,"Negligible - no adjacent rocky upland areas"]
[null,"Water Well Usage","Water Well Usage Volume (m3/yr)",null,null,null,null,null,null,null,null,"Comments",null,null,null,null,null,null,null,null,null,null,null,"Discharge"]
[null,null,"Year 1",null,null,"Year 2",null,null,"Year 3",null,null,null,null,null,null,null,null,null,null,null,null,null,null,null,"Evapotranspiration",null,null,"Variable: (1)  near-surface unconfined AQ zones: moderate to high (2) Deeper semi-confined  to confined AQ zones: low"]
[null,null,"Total Volume Removed","Adjustment Factor","Adjusted Volume Removed","Total Volume Removed","Adjustment Factor","Adjusted Volume Removed","Total Volume Removed","Adjustment Factor","Adjusted Volume Removed",null,null,null,null,null,null,null,null,null,null,null,null,null,"Outflow to marine",null,null,"Negligible due to distance from marine shoreline"]
[null,"Industrial",{"$f":"AB102","v":7300},1,{"$f":"C95*D95","v":7300},null,null,null,null,null,null,"Assuming 100% consumptive",null,null,null,null,null,null,null,null,null,null,null,null,"Outflow to surface waters",null,null,"Variable: (1) moderate to high along east side of AQ into Taggart Creeks / northwest corner into Shawnigan Creek based on unconfined AQ settings & topography;  (2) moderate to high to internal streams  from unconfined AQ portions or where bedrock forces  semi-confined groundwater to surface "]
[null,"Commercial",10950,1,{"$f":"C96*D96","v":10950},null,null,null,null,null,null,"Assuming 100% consumptive",null,null,null,null,null,null,null,null,null,null,null,null,"Outflow to other AQ",null,null,"Possible basal outflow to bedrock AQ 207 in areas where artesian bedrock conditions are not apparent"]
[null,"Domestic",38011,1,38011,null,null,null,null,null,null,"Assuming 100% consumptive",null,null,null,null,null,null,null,null,null,null,null,null,"Temporal variability",null,null,"Variable: (1)  near-surface unconfined AQ zones: moderate to high (2) Deeper semi-confined AQ zones: low"]
[null,"Irrigation",55601,1,55601,null,null,null,null,null,null,"Assuming 100% consumptive"]
[null,"BCMOE Obs",0,1,0,null,null,null,null,null,null,"Assuming 100% consumptive",null,null,null,null,null,null,null,null,null,null,"Groundwater Development"]
[null,"Other",0,1,0,null,null,null,null,null,null,"Assuming 100% consumptive",null,null,null,null,null,null,null,null,null,null,null,null,"Nearest BCMOE Observation Wells; distance; completion / relevance",null,null,"Well #345 is 3.5 km to the northeast; negligible relevancy, well completed within surficial AQ197"]
[null,"Water Supply Systems",20942,1,20942,null,null,null,null,null,null,"Assuming 100% consumptive",null,null,null,null,null,null,null,null,null,null,null,null,"Total Annual Water Use (m3/yr) as reported by Hatfield (2015)",null,null,null,"  SUMS"]
[null,"Total",{"$f":"-SUM(C95:C101)","v":-132804},null,{"$f":"-SUM(E95:E101)","v":-132804},null,null,{"$f":"-SUM(H95:H101)","v":0},null,null,{"$f":"-SUM(K95:K101)","v":0},null,null,null,null,null,null,null,null,null,null,null,null,null,null,"Industrial",null,7300,"Total Commercial and Industrial"]
[null,null,null,null,null,null,null,null,null,null,null,null,null,null,null,null,null,null,null,null,null,null,null,null,null,"Commercial",null,10950,{"$f":"AB102+AB103","v":18250}]
[null,null,null,null,null,null,null,null,null,null,null,null,null,null,null,null,null,null,null,null,null,null,null,null,null,"Domestic",null,38011,"Total Irrigation"]
[null,null,null,null,null,null,null,null,null,null,null,null,null,null,null,null,null,null,null,null,null,null,null,null,null,"Irrigation from Groundwater (MoAg)",null,55601,{"$f":"AB105","v":55601}]
[null,null,null,null,null,null,null,null,null,null,null,null,null,null,null,null,null,null,null,null,null,null,null,null,null,"BCMOE Obs",null,0]
[null,null,null,null,null,null,null,null,null,null,null,null,null,null,null,null,null,null,null,null,null,null,null,null,null,"Other",null,0,"Total Domestic + Water Systems + Other"]
[null,null,null,null,null,null,null,null,null,null,null,null,null,null,null,null,null,null,null,null,null,null,null,null,null,"Water Supply Systems",null,20942,{"$f":"AB104+AB107+AB108","v":58953}]

{"sheet":"Surficial AQ 206","index":16,"n_rows":107,"n_cols":29,"rows_kept":107,"cut":false,"hidden":false,"merged":[[4,2,4,4],[3,2,3,4],[2,2,2,4],[1,2,1,4],[86,1,87,1],[86,2,87,2],[86,3,87,3],[79,3,80,3],[79,4,80,4],[79,1,80,1],[79,2,80,2],[92,1,94,1],[92,2,92,10],[93,2,93,4],[93,5,93,7],[93,8,93,10],[6,16,6,20],[21,16,21,20],[36,16,36,20],[86,4,87,4],[86,5,87,5],[86,6,87,6],[86,7,87,7],[86,8,86,10],[51,17,51,19],[79,12,79,14],[79,9,79,11],[86,11,87,11],[79,6,80,6],[79,7,80,7],[79,8,80,8],[79,5,80,5]]}
[null,"CHM Aquifer Criteria: Aquifer #0206, Mill Bay (Surficial)",null,null,null,null,null,null,null,null,null,null,null,null,null,null,null,null,null,null,null,null,"TABLE K-1"]
[null,"AQ tag","206 Mill Bay",null,null,null,null,null,null,null,null,null,null,null,null,null,null,null,null,null,null,null,"CHM Aquifer Criteria: Aquifer #0206, Mill Bay (Surficial)"]
[null,"Perimeter (km)",6.4]
[null,"Area (km2)",2.57,null,null,null,null,null,null,null,null,null,null,null,null,null,null,null,null,null,null,null,"BCMOE Criteria"]
[null,"Aquifer materials","Sand and gravel",null,null,null,null,null,null,null,null,null,null,null,null,null,null,null,null,null,null,null,null,"AQ tag",null,null,null,"206 Mill Bay"]
[null,"Table K-4 Monthly  Summary of AQ206 Water Budgets",null,null,null,null,null,null,null,null,null,null,null,null,null,null,"Table K-3 Annual Summary of AQ206 Water Budgets",null,null,null,null,null,null,"AQ classification",null,null,null,"IIA (11)"]
[null,"Monthly Gains and Loses (m3)","Average Year",null,null,null,null,null,null,null,null,null,null,null,null,null,"Summary - 30 Year Average",null,null,null,null,null,null,"AQ type",null,null,null,"BCMOE Classification = 4a (SLR Classification = 4a / 4b locally stacked aquifers)"]
[null,"Source","Jan","Feb","Mar","Apr","May","Jun","Jul","Aug","Sep","Oct","Nov","Dec","Total",null,"Gains and Losses","Source","Area (m2)","Infiltration Rate","Q (m3/yr)",null,null,"Location",null,null,null,"Mill Bay"]
[{"$f":"$C$7&B9","v":"Average YearDirect Recharge to 206"},"Direct Recharge to 206",{"$f":"C55*$U$9","v":229577.03401795548},149537.63949793697,107916.98858753691,25916.376047947142,-31195.244609713282,-49192.5011153171,-47992.684014943516,-21596.707806724578,-7198.9026022415264,78927.678669403685,242168.00869443579,236078.51505300775,{"$f":"SUM(C9:N9)","v":912946.20041928382},null,"Gain","Direct Recharge to 206",{"$f":"257.351074878*10000","v":2573510.74878},{"$f":"U9/S9","v":0.35474738189925009},{"$f":"S58","v":912946.2004192837},null,null,"Perimeter (km)",null,null,null,6.4]
[{"$f":"$C$7&B10","v":"Average YearLeakage down to 207"},"Leakage down to 207",{"$f":"C56*$U$10","v":-62536.311195353999},-60220.151521451997,-67168.630543157997,-66396.577318523996,-69484.790217059999,-66396.577318523996,-67168.630543157997,-65624.52409389001,-62536.311195353999,-63308.364419988,-60220.151521451997,-60992.204746085998,{"$f":"SUM(C10:N10)","v":-772053.22463399998},null,"Loss","Leakage down to 207",{"$f":"257.351074878*10000","v":2573510.74878},0.3,{"$f":"M84","v":-772053.22463399998},null,null,"Area (km2)",null,null,null,2.57]
["Average YearLateral Groundwater","Lateral Groundwater",{"$f":"C56*$U$11","v":-30269.829600000005},-29148.724800000004,-32512.039199999999,-32138.337599999999,-33633.144,-32138.337599999999,-32512.039199999999,-31764.636000000006,-30269.829600000005,-30643.531200000005,-29148.724800000004,-29522.426400000004,-373701.60000000009,null,"Loss","Lateral Groundwater","--","--",{"$f":"SUMIF(M82:M83,\"<0\")","v":-373701.60000000003}]
["Average YearLateral Groundwater","Lateral Groundwater",{"$f":"C56*$U$12","v":0},0,0,0,0,0,0,0,0,0,0,0,0,null,"Gain","Lateral Groundwater","--","--",{"$f":"SUMIF(I89,\"<0\")","v":0},null,null,"Aquifer materials",null,null,null,"Sand and gravel"]
["Average YearSurface Water","Surface Water",{"$f":"C57*$U$13","v":-45931.985518408554},-40324.479182162439,-29128.585762597486,-14083.762324392983,-4993.7693411051869,-2025.4649313563098,-1202.8882467288922,-390.72392519802361,-328.51005569613972,-3015.1600436833501,-21309.161386166164,-45403.109282504505,-208137.60000000003,null,"Loss","Surface Water","--","--",{"$f":"SUMIF(I89:I90,\"<0\")","v":-208137.60000000001},null,null,"Lithostratigraphic unit",null,null,null,"Vashon Drift"]
["Average YearSurface Water","Surface Water",{"$f":"C57*$U$14","v":50107.620565536607},43990.340925995391,31776.639013742715,15364.104353883253,5447.7483721147501,2209.598106934156,1312.2417237042459,426.24428203420757,358.37460621397059,3289.2655022000181,23246.357875817634,49530.664671823099,227059.20000000004,null,"Gain","Surface Water","--","--",{"$f":"SUMIF(I89:I90,\">0\")","v":227059.20000000001},null,null,"Productivity",null,null,null,"Moderate"]
["Average YearWater Well Useage","Water Well Useage",{"$f":"C58*$U$15","v":-34535.4},-37413.35,-43169.25,-46047.200000000004,-51803.1,-57559,-63314.9,-66192.850000000006,-57559,-46047.200000000004,-40291.300000000003,-31657.45,-575590,null,"Loss","Water Well Useage","--","--",{"$f":"E103","v":-575590},null,null,"Vulnerability",null,null,null,"High"]
["Average YearNet Gain","Net Gain",{"$f":"SUMIF(C9:C15, \">0\")","v":279684.65458349208},193527.98042393237,139693.62760127962,41280.480401830398,5447.7483721147501,2209.598106934156,1312.2417237042459,426.24428203420757,358.37460621397059,82216.944171603711,265414.36657025345,285609.17972483084,1297181.4405682238,null,"Net Gain",null,null,null,{"$f":"SUMIF(U9:U15, \">0\")","v":1140005.4004192837},null,null,"Demand",null,null,null,"Moderate"]
["Average YearNet Loss","Net Loss",{"$f":"SUMIF(C9:C15, \"<0\")","v":-173273.52631376256},-167106.70550361444,-171978.50550575549,-158665.87724291699,-191110.04816787847,-207311.8809651974,-212191.14200483041,-185569.44182581262,-157892.55345329165,-143014.25566367136,-150969.33770761816,-167575.19042859052,-2086658.4647829407,null,"Net Loss",null,null,null,{"$f":"SUMIF(U9:U15, \"<0\")","v":-1929482.4246340001},null,null,"Use",null,null,null,"Multiple"]
["Average YearNet Total (Gain - Loss)","Net Total (Gain - Loss)",{"$f":"SUM(C16:C17)","v":106411.12826972952},{"$f":"SUM(D16:D17)","v":26421.274920317926},-32284.87790447587,-117385.39684108659,-185662.29979576371,-205102.28285826324,-210878.90028112617,-185143.19754377843,-157534.17884707768,-60797.311492067645,114445.02886263528,118033.98929624032,-789477.0242147164,null,"Net Total (Gain - Loss)",null,null,null,{"$f":"SUM(U16:U17)","v":-789477.0242147164}]
[null,null,null,null,null,null,null,null,null,null,null,null,null,null,null,null,null,null,null,null,null,null,"Location"]
[null,null,null,null,null,null,null,null,null,null,null,null,null,null,null,null,null,null,null,null,null,null,null,"NTS 50000",null,null,null,"092B/12"]
[null,null,null,null,null,null,null,null,null,null,null,null,null,null,null,null,null,null,null,null,null,null,null,"TRIM 20000",null,null,null,"092B.063"]
[null,"Monthly Gains and Loses (m3)","Hot/Dry (1989)",null,null,null,null,null,null,null,null,null,null,null,null,null,"Summary - Hot/Dry (1989)",null,null,null,null,null,null,"Lat / Long (Centre)",null,null,null,"48o38'42\" / 123o33'42\""]
[null,"Source","Jan","Feb","Mar","Apr","May","Jun","Jul","Aug","Sep","Oct","Nov","Dec","Total",null,"Gains and Losses","Source","Area (m2)","Infiltration Rate","Q (m3/yr)",null,null,"UTM Zone 10 (Centre)",null,null,null,"458641E / 5388146N"]
[{"$f":"$C$22&B24","v":"Hot/Dry (1989)Direct Recharge to 206"},"Direct Recharge to 206",{"$f":"C62*$U$24","v":188309.98158441685},{"$f":"D62*$U$24","v":107983.5390336229},167904.13238811208,10078.463643138139,-39593.964312328404,-50392.318215690684,-43193.415613449164,-17997.256505603818,-11998.171003735877,30595.336059526489,120101.69174739614,152376.77174744566,{"$f":"SUM(C24:N24)","v":614174.79055285035},null,"Gain","Direct Recharge to 206",{"$f":"257.351074878*10000","v":2573510.74878},{"$f":"U24/S24","v":0.23865250644241773},{"$f":"R58","v":614174.79055285023}]
[{"$f":"$C$22&B25","v":"Hot/Dry (1989)Leakage down to 207"},"Leakage down to 207",{"$f":"C63*$U$25","v":-63308.364419988},{"$f":"D63*$U$25","v":-58676.045072183995},-64852.470869256002,-64080.417644622001,-67168.630543157997,-64852.470869256002,-67168.630543157997,-66396.577318523996,-63308.364419988,-65624.52409389001,-62536.311195353999,-64080.417644622001,{"$f":"SUM(C25:N25)","v":-772053.22463399998},null,"Loss","Leakage down to 207",{"$f":"257.351074878*10000","v":2573510.74878},0.3,{"$f":"M84","v":-772053.22463399998},null,"Climate"]
["Hot/Dry (1989)Lateral Groundwater","Lateral Groundwater",{"$f":"C63*$U$26","v":-30643.531200000005},{"$f":"D63*$U$26","v":-28401.321600000003},-31390.934400000006,-31017.232800000005,-32512.039199999999,-31390.934400000006,-32512.039199999999,-32138.337599999999,-30643.531200000005,-31764.636000000006,-30269.829600000005,-31017.232800000005,-373701.60000000003,null,"Loss","Lateral Groundwater","--","--",{"$f":"SUMIF(M82:M83,\"<0\")","v":-373701.60000000003},null,null,"Nearest active EC weather station / distance / elevation",null,null,null,"EC1015136 Mill Bay SW1  within AQ - northwest corner                                                                                                                                                                     EC1017230 Shawnigan Lake 3.8 km to west"]
["Hot/Dry (1989)Lateral Groundwater","Lateral Groundwater",{"$f":"C63*$U$27","v":0},{"$f":"D63*$U$27","v":0},0,0,0,0,0,0,0,0,0,0,0,null,"Gain","Lateral Groundwater","--","--",{"$f":"SUMIF(I89,\"<0\")","v":0},null,null,"IDF Curve",null,null,null,"Unknown"]
["Hot/Dry (1989)Surface Water","Surface Water",{"$f":"C64*$U$28","v":-45931.985518408554},{"$f":"D64*$U$28","v":-40324.479182162439},-29128.585762597486,-14083.762324392983,-4993.7693411051869,-2025.4649313563098,-1202.8882467288922,-390.72392519802361,-328.51005569613972,-3015.1600436833501,-21309.161386166164,-45403.109282504505,-208137.60000000003,null,"Loss","Surface Water","--","--",{"$f":"SUMIF(I89:I90,\"<0\")","v":-208137.60000000001}]
["Hot/Dry (1989)Surface Water","Surface Water",{"$f":"C64*$U$29","v":50107.620565536607},{"$f":"D64*$U$29","v":43990.340925995391},31776.639013742715,15364.104353883253,5447.7483721147501,2209.598106934156,1312.2417237042459,426.24428203420757,358.37460621397059,3289.2655022000181,23246.357875817634,49530.664671823099,227059.20000000004,null,"Gain","Surface Water","--","--",{"$f":"SUMIF(I89:I90,\">0\")","v":227059.20000000001},null,"Physiography"]
["Hot/Dry (1989)Water Well Useage","Water Well Useage",{"$f":"C65*$U$30","v":-34535.4},{"$f":"D65*$U$30","v":-37413.35},-43169.25,-46047.200000000004,-51803.1,-57559,-63314.9,-66192.850000000006,-57559,-46047.200000000004,-40291.300000000003,-31657.45,-575590,null,"Loss","Water Well Useage","--","--",{"$f":"E103","v":-575590},null,null,"Physiographic zone",null,null,null,"Canadian Cordillera / Western System / Coastal Trough / Georgia Depression / Nanaimo Lowland"]
["Hot/Dry (1989)Net Gain","Net Gain",{"$f":"SUMIF(C24:C30, \">0\")","v":238417.60214995345},151973.87995961829,199680.77140185478,25442.56799702139,5447.7483721147501,2209.598106934156,1312.2417237042459,426.24428203420757,358.37460621397059,33884.601561726507,143348.04962321377,201907.43641926875,1004409.1162036582,null,"Net Gain",null,null,null,{"$f":"SUMIF(U24:U30, \">0\")","v":841233.9905528503},null,null,"Elevation range (m amsl)",null,null,null,"20 - 160 m"]
["Hot/Dry (1989)Net Loss","Net Loss",{"$f":"SUMIF(C24:C30, \"<0\")","v":-174419.28113839656},-164815.19585434644,-168541.24103185348,-155228.61276901499,-196071.50339659161,-206220.18841630299,-207391.87360333605,-183115.74534932582,-163837.57667942002,-146451.52013757336,-154406.60218152017,-172158.20972712652,-2092657.5502848076,null,"Net Loss",null,null,null,{"$f":"SUMIF(U24:U30, \"<0\")","v":-1929482.4246340001},null,null,"Distance to marine",null,null,null,"Saanich Inlet is 110 m to the northeast"]
["Hot/Dry (1989)Net Total (Gain - Loss)","Net Total (Gain - Loss)",{"$f":"SUM(C31:C32)","v":63998.321011556895},{"$f":"SUM(D31:D32)","v":-12841.315894728148},31139.530370001303,-129786.04477199359,-190623.75502447685,-204010.59030936882,-206079.63187963181,-182689.50106729163,-163479.20207320605,-112566.91857584685,-11058.552558306401,29749.226692142227,-1088248.4340811498,null,"Net Total (Gain - Loss)",null,null,null,{"$f":"SUM(U31:U32)","v":-1088248.4340811498},null,null,"Geomorphological setting",null,null,null,"North-northeast to northeast facing, dome-like series of rolling hills on the northeast flank of Malahat Ridge overlooking Mill Bay to the northeast.  Probably represents a variably-thick morainal / glaciofluvial outwash blanket deposited on an irregular bedrock surface northeast of Malahat Ridge.  AQ is bounded to the west by Handeysen Creek, at its north end by Shawnigan Creek, and to the south-southwest by uplands.   Incised at its north end by Hollings Creek & in its central-east portions by unnamed streams"]
[null,null,null,null,null,null,null,null,null,null,null,null,null,null,null,null,null,null,null,null,null,null,null,"Topography",null,null,null,"Generally rolling to undulating, north-northeast to northeast facing, convex hillside with central & north stream valley incisions"]
[null,null,null,null,null,null,null,null,null,null,null,null,null,null,null,null,null,null,null,null,null,null,null,"Terrain",null,null,null,"Generally rolling to undulating"]
[null,null,null,null,null,null,null,null,null,null,null,null,null,null,null,null,null,null,null,null,null,null,null,"Aspect",null,null,null,"Generally north-northeast facing"]
[null,"Monthly Gains and Loses (m3)","Cold/Wet (1999)",null,null,null,null,null,null,null,null,null,null,null,null,null,"Summary - Wet/Cold (1999)",null,null,null,null,null,null,"Slope",null,null,null,"Low relief, generally convex ground slopes with subordinate, concave stream incisions & bowl-like areas"]
[null,"Source","Jan","Feb","Mar","Apr","May","Jun","Jul","Aug","Sep","Oct","Nov","Dec","Total",null,"Gains and Losses","Source","Area (m2)","Infiltration Rate","Q (m3/yr)",null,null,"XS max grade (m/m)",null,null,null,"0.068 north-northeast central long axis of AQ"]
[{"$f":"$C$37&B39","v":"Cold/Wet (1999)Direct Recharge to 206"},"Direct Recharge to 206",{"$f":"C69*$U$39","v":426055.05234266096},431356.94447705778,159975.3656639742,-19197.073605977403,-15597.622304856637,-40793.781412701974,-52791.952416437853,-21596.707806724575,-9598.5368029887013,151296.93635710937,244522.72505613713,261440.14617140475,{"$f":"SUM(C39:N39)","v":1515071.495718657},null,"Gain","Direct Recharge to 206",{"$f":"257.351074878*10000","v":2573510.74878},{"$f":"U39/S39","v":0.58871776480315574},{"$f":"T58","v":1515071.4957186573},null,null,"Roughness coefficient",null,null,null,"0.40 (75% rural-residential  / 15% forested, 10% cleared & undeveloped)"]
[{"$f":"$C$37&B40","v":"Cold/Wet (1999)Leakage down to 207"},"Leakage down to 207",{"$f":"C70*$U$40","v":-62536.311195353999},{"$f":"D70*$U$40","v":-60220.151521451997},-67168.630543157997,-66396.577318523996,-69484.790217059999,-66396.577318523996,-67168.630543157997,-65624.52409389001,-62536.311195353999,-63308.364419988,-60220.151521451997,-60992.204746085998,{"$f":"SUM(C40:N40)","v":-772053.22463399998},null,"Loss","Leakage down to 207",{"$f":"257.351074878*10000","v":2573510.74878},0.3,{"$f":"M84","v":-772053.22463399998}]
["Cold/Wet (1999)Lateral Groundwater","Lateral Groundwater",{"$f":"C70*$U$41","v":-30269.829600000005},{"$f":"D70*$U$41","v":-29148.724800000004},-32512.039199999999,-32138.337599999999,-33633.144,-32138.337599999999,-32512.039199999999,-31764.636000000006,-30269.829600000005,-30643.531200000005,-29148.724800000004,-29522.426400000004,-373701.60000000009,null,"Loss","Lateral Groundwater","--","--",{"$f":"SUMIF(M82:M83,\"<0\")","v":-373701.60000000003},null,"Geology"]
["Cold/Wet (1999)Lateral Groundwater","Lateral Groundwater",{"$f":"C70*$U$42","v":0},{"$f":"D70*$U$42","v":0},0,0,0,0,0,0,0,0,0,0,0,null,"Gain","Lateral Groundwater","--","--",{"$f":"SUMIF(I89,\"<0\")","v":0},null,null,"Terrane",null,null,null,"Wrangellia"]
["Cold/Wet (1999)Surface Water","Surface Water",{"$f":"C71*$U$43","v":-45931.985518408554},{"$f":"D71*$U$43","v":-40324.479182162439},-29128.585762597486,-14083.762324392983,-4993.7693411051869,-2025.4649313563098,-1202.8882467288922,-390.72392519802361,-328.51005569613972,-3015.1600436833501,-21309.161386166164,-45403.109282504505,-208137.60000000003,null,"Loss","Surface Water","--","--",{"$f":"SUMIF(I89:I90,\"<0\")","v":-208137.60000000001},null,null,"Bedrock (type ; age ; formation ; lithology)",null,null,null,"Early to Middle Jurassic Island Plutonic Suite (EMJIgd); granodioritic intrusive rocks      "]
["Cold/Wet (1999)Surface Water","Surface Water",{"$f":"C71*$U$44","v":50107.620565536607},{"$f":"D71*$U$44","v":43990.340925995391},31776.639013742715,15364.104353883253,5447.7483721147501,2209.598106934156,1312.2417237042459,426.24428203420757,358.37460621397059,3289.2655022000181,23246.357875817634,49530.664671823099,227059.20000000004,null,"Gain","Surface Water","--","--",{"$f":"SUMIF(I89:I90,\">0\")","v":227059.20000000001},null,null,"Structure",null,null,null,"None mapped by BCGS -uncertain due to overburden masking.                                                                                                                                                                                                                           Productive bedrock wells in northwest portion suggests locally elevated rock fracturing - could be related to fault swarm adjacent to west AQ boundary within bedrock AQ 207 (intersection area of Shawnigan  Fault and north-trending Handysen Creek lineament within Island Intrusive rocks)"]
["Cold/Wet (1999)Water Well Useage","Water Well Useage",{"$f":"C72*$U$45","v":-34535.4},{"$f":"D72*$U$45","v":-37413.35},-43169.25,-46047.200000000004,-51803.1,-57559,-63314.9,-66192.850000000006,-57559,-46047.200000000004,-40291.300000000003,-31657.45,-575590,null,"Loss","Water Well Useage","--","--",{"$f":"E103","v":-575590},null,null,"Surficial (formation; lithology; thickness)",null,null,null,"Vashon Drift morainal-glaciofluvial outwash deposit"]
["Cold/Wet (1999)Net Gain","Net Gain",{"$f":"SUMIF(C39:C45, \">0\")","v":476162.67290819756},475347.28540305316,191752.0046777169,15364.104353883253,5447.7483721147501,2209.598106934156,1312.2417237042459,426.24428203420757,358.37460621397059,154586.2018593094,267769.08293195476,310970.81084322784,1901706.3700683443,null,"Net Gain",null,null,null,{"$f":"SUMIF(U39:U45, \">0\")","v":1742130.6957186572},null,null,"Surficial designation (1993)",null,null,null,"dMb/Cb//R"]
["Cold/Wet (1999)Net Loss","Net Loss",{"$f":"SUMIF(C39:C45, \"<0\")","v":-173273.52631376256},-167106.70550361444,-171978.50550575549,-177862.9508488944,-175512.42586302181,-198913.16126258229,-216990.41040632472,-185569.44182581262,-160292.18765403883,-143014.25566367136,-150969.33770761816,-167575.19042859052,-2089058.0989836873,null,"Net Loss",null,null,null,{"$f":"SUMIF(U39:U45, \"<0\")","v":-1929482.4246340001},null,null,"Soils (association; parent; texture; drainage; type; comments)",null,null,null,"DD1w/de (Dashwood Creek, marine), very gravelly sandy loam, DU.DYB                                                                                                                                                                                                                                                                                                       "]
["Cold/Wet (1999)Net Total (Gain - Loss)","Net Total (Gain - Loss)",{"$f":"SUM(C46:C47)","v":302889.14659443498},{"$f":"SUM(D46:D47)","v":308240.57989943872},19773.499171961419,-162498.84649501115,-170064.67749090705,-196703.56315564812,-215678.16868262048,-185143.19754377843,-159933.81304782486,11571.94619563804,116799.7452243366,143395.62041463732,-187351.728915343,null,"Net Total (Gain - Loss)",null,null,null,{"$f":"SUM(U46:U47)","v":-187351.72891534283},null,null,"Restrictive layers",null,null,null,"Yes, impersistent - low permeability, dense morainal and glaciofluvial silt-clay aquitards, complex internal stratigraphy over an irregular bedrock surface / local surface duric layers in Dashwood Creek soils"]
[null,null,null,null,null,null,null,null,null,null,null,null,null,null,null,null,null,null,null,null,null,null,null,"Estimated permeability",null,null,null,"Variable at surface & subsurface due to stratigraphic complexity"]
[]
[null,null,null,null,null,null,null,null,null,null,null,null,null,null,null,null,"Table K-2.  Direct Recharge Calculation for AQ206",null,null,null,null,null,"Hydrology"]
[null,"Table K-5  Monthly  Coefficients used in Calculations for AQ206",null,null,null,null,null,null,null,null,null,null,null,null,null,null,null,"Direct Recharge Calculation",null,null,null,null,null,"GW / SW basin coincidence",null,null,null,"No - straddles north-trending Shawnigan-Handysen-Hollings Creek / Saanich Inlet watersheds"]
[null,"Monthly Factors","30 Year Average",null,null,null,null,null,null,null,null,null,null,null,null,null,null,"Hot/Dry","Average","Cold/Wet",null,null,null,"Catchments",null,null,null,"Shawnigan Creek (west side) / Saanich Inlet (east side)"]
[null,null,"Jan","Feb","Mar","Apr","May","Jun","Jul","Aug","Sep","Oct","Nov","Dec",null,null,"Surplus (mm)",{"$f":"SUM('Climate Dashboard'!AA42:AL42)","v":511.89034592156941},{"$f":"SUM('Climate Dashboard'!C48:AL48)/3","v":760.90447463619182},{"$f":"SUM('Climate Dashboard'!AA54:AL54)","v":1262.7520438297711},null,null,null,"Drainage regime",null,null,null,"Radial in central part of AQ, chaotic at north end due to Hollings Creek bedrock-controlled meanders"]
[null,"Surplus Water",{"$f":"'Monthly Factors'!B16","v":0.25146830548450599},{"$f":"'Monthly Factors'!C16","v":0.16379677075085},{"$f":"'Monthly Factors'!D16","v":0.1182073911233482},{"$f":"'Monthly Factors'!E16","v":2.8387626824061124E-2},{"$f":"'Monthly Factors'!F16","v":-3.4169860825738051E-2},{"$f":"'Monthly Factors'!G16","v":-5.3883242071356162E-2},{"$f":"'Monthly Factors'!H16","v":-5.2569016654981621E-2},{"$f":"'Monthly Factors'!I16","v":-2.3656057494741728E-2},{"$f":"'Monthly Factors'!J16","v":-7.8853524982472421E-3},{"$f":"'Monthly Factors'!K16","v":8.6453811443823317E-2},{"$f":"'Monthly Factors'!L16","v":0.26525988999485034},{"$f":"'Monthly Factors'!M16","v":0.25858973392362583},null,null,"Station Coeffiecient Factor",1.04,1.04,1.04,null,null,null,"Surface waters",null,null,null,"Shawnigan Creek  borders north end.  Handysen Creek parallels west side.  Northeast and east parts of AQ contain small streams (Wheelbarrow, Bird) & several springs draining towards Saanich Inlet; small, central wetland area "]
[null,"Leakance/\nLateral Ground Water",{"$f":"'Monthly Factors'!B42","v":8.1000000000000003E-2},{"$f":"'Monthly Factors'!C42","v":7.8E-2},{"$f":"'Monthly Factors'!D42","v":8.6999999999999994E-2},{"$f":"'Monthly Factors'!E42","v":8.5999999999999993E-2},{"$f":"'Monthly Factors'!F42","v":0.09},{"$f":"'Monthly Factors'!G42","v":8.5999999999999993E-2},{"$f":"'Monthly Factors'!H42","v":8.6999999999999994E-2},{"$f":"'Monthly Factors'!I42","v":8.5000000000000006E-2},{"$f":"'Monthly Factors'!J42","v":8.1000000000000003E-2},{"$f":"'Monthly Factors'!K42","v":8.2000000000000003E-2},{"$f":"'Monthly Factors'!L42","v":7.8E-2},{"$f":"'Monthly Factors'!M42","v":7.9000000000000001E-2},null,null,"Infiltration Coefficient",0.44828656315799997,0.44828656315799997,0.44828656315799997,null,null,null,"Runoff coefficient",null,null,null,"Rolling terrain, 75% rural-residential  / 15% forested, 10% cleared & undeveloped = 0.45"]
[null,"Surface Water",{"$f":"'Monthly Factors'!B26","v":0.22068086457424585},{"$f":"'Monthly Factors'!C26","v":0.19373952223030552},{"$f":"'Monthly Factors'!D26","v":0.13994869625957773},{"$f":"'Monthly Factors'!E26","v":6.7665632372012466E-2},{"$f":"'Monthly Factors'!F26","v":2.399263439717373E-2},{"$f":"'Monthly Factors'!G26","v":9.7313744914725147E-3},{"$f":"'Monthly Factors'!H26","v":5.7792933459831003E-3},{"$f":"'Monthly Factors'!I26","v":1.8772385441074731E-3},{"$f":"'Monthly Factors'!J26","v":1.5783311410150771E-3},{"$f":"'Monthly Factors'!K26","v":1.4486378451963268E-2},{"$f":"'Monthly Factors'!L26","v":0.10238016286421177},{"$f":"'Monthly Factors'!M26","v":0.21813987132793164},null,null,"Area (m2)",{"$f":"S9","v":2573510.74878},{"$f":"S9","v":2573510.74878},{"$f":"S9","v":2573510.74878},null,null,null,"Nearest Active EC hydrometric station; distance; type",null,null,null,"Shawnigan Creek @ Mill Bay; 400 m northeast of north end (inactive)                                                                                                                                                                        EC 08HA003 Koksilah River  @ Cowichan Station; 11.4 km northwest; active realtime                                                                                                   "]
[null,"Water Usage",{"$f":"'Monthly Factors'!B31","v":0.06},{"$f":"'Monthly Factors'!C31","v":6.5000000000000002E-2},{"$f":"'Monthly Factors'!D31","v":7.4999999999999997E-2},{"$f":"'Monthly Factors'!E31","v":0.08},{"$f":"'Monthly Factors'!F31","v":0.09},{"$f":"'Monthly Factors'!G31","v":0.1},{"$f":"'Monthly Factors'!H31","v":0.11},{"$f":"'Monthly Factors'!I31","v":0.115},{"$f":"'Monthly Factors'!J31","v":0.1},{"$f":"'Monthly Factors'!K31","v":0.08},{"$f":"'Monthly Factors'!L31","v":7.0000000000000007E-2},{"$f":"'Monthly Factors'!M31","v":5.5E-2},null,null,"Q (m3/yr)",{"$f":"(R54/1000)*R55*R56*R57","v":614174.79055285023},{"$f":"(S54/1000)*S55*S56*S57","v":912946.2004192837},{"$f":"(T54/1000)*T55*T56*T57","v":1515071.4957186573},null,null,null,"Surface water diversions ; relevance",null,null,null,"> 30 licences along Hollings Creek & internal springs / streams draining towards Saanich Inlet;  moderate to high relevance for unconfined AQ zones "]
[null,null,null,null,null,null,null,null,null,null,null,null,null,null,null,null,"Average Infiltration Rate",{"$f":"R58/R57","v":0.23865250644241773},{"$f":"S58/S57","v":0.35474738189925009},{"$f":"T58/T57","v":0.58871776480315574}]
[null,"Monthly Factors","Hot/Dry (1989)",null,null,null,null,null,null,null,null,null,null,null,null,null,null,null,null,null,null,null,"Land Cover"]
[null,null,"Jan","Feb","Mar","Apr","May","Jun","Jul","Aug","Sep","Oct","Nov","Dec",null,null,null,null,null,null,null,null,null,"Vegetation zone",null,null,null,"CgF-wC "]
[null,"Surplus Water",{"$f":"'Monthly Factors'!B11","v":0.30660649782598431},{"$f":"'Monthly Factors'!C11","v":0.17581890480464263},{"$f":"'Monthly Factors'!D11","v":0.27338167402959174},{"$f":"'Monthly Factors'!E11","v":1.6409764448433315E-2},{"$f":"'Monthly Factors'!F11","v":-6.4466931761702304E-2},{"$f":"'Monthly Factors'!G11","v":-8.2048822242166558E-2},{"$f":"'Monthly Factors'!H11","v":-7.032756192185706E-2},{"$f":"'Monthly Factors'!I11","v":-2.9303150800773774E-2},{"$f":"'Monthly Factors'!J11","v":-1.9535433867182515E-2},{"$f":"'Monthly Factors'!K11","v":4.9815356361315413E-2},{"$f":"'Monthly Factors'!L11","v":0.19554969301049696},{"$f":"'Monthly Factors'!M11","v":0.24810001011321794},null,null,null,null,null,null,null,null,null,"Primary land uses",null,null,null,"75% rural-residential  / 15% forested, 10% cleared & undeveloped"]
[null,"Leakance/\nLateral Ground Water",{"$f":"'Monthly Factors'!B43","v":8.2000000000000003E-2},{"$f":"'Monthly Factors'!C43","v":7.5999999999999998E-2},{"$f":"'Monthly Factors'!D43","v":8.4000000000000005E-2},{"$f":"'Monthly Factors'!E43","v":8.3000000000000004E-2},{"$f":"'Monthly Factors'!F43","v":8.6999999999999994E-2},{"$f":"'Monthly Factors'!G43","v":8.4000000000000005E-2},{"$f":"'Monthly Factors'!H43","v":8.6999999999999994E-2},{"$f":"'Monthly Factors'!I43","v":8.5999999999999993E-2},{"$f":"'Monthly Factors'!J43","v":8.2000000000000003E-2},{"$f":"'Monthly Factors'!K43","v":8.5000000000000006E-2},{"$f":"'Monthly Factors'!L43","v":8.1000000000000003E-2},{"$f":"'Monthly Factors'!M43","v":8.3000000000000004E-2},null,null,null,null,null,null,null,null,null,"Degree of development",null,null,null,"Extensive agricultural / rural residential clearing.  Low impervious cover"]
[null,"Surface Water",{"$f":"'Monthly Factors'!B26","v":0.22068086457424585},{"$f":"'Monthly Factors'!C26","v":0.19373952223030552},{"$f":"'Monthly Factors'!D26","v":0.13994869625957773},{"$f":"'Monthly Factors'!E26","v":6.7665632372012466E-2},{"$f":"'Monthly Factors'!F26","v":2.399263439717373E-2},{"$f":"'Monthly Factors'!G26","v":9.7313744914725147E-3},{"$f":"'Monthly Factors'!H26","v":5.7792933459831003E-3},{"$f":"'Monthly Factors'!I26","v":1.8772385441074731E-3},{"$f":"'Monthly Factors'!J26","v":1.5783311410150771E-3},{"$f":"'Monthly Factors'!K26","v":1.4486378451963268E-2},{"$f":"'Monthly Factors'!L26","v":0.10238016286421177},{"$f":"'Monthly Factors'!M26","v":0.21813987132793164},null,null,null,null,null,null,null,null,null,"Evapotranspiration potential",null,null,null,"Cgf-wC "]
[null,"Water Usage",{"$f":"'Monthly Factors'!B31","v":0.06},{"$f":"'Monthly Factors'!C31","v":6.5000000000000002E-2},{"$f":"'Monthly Factors'!D31","v":7.4999999999999997E-2},{"$f":"'Monthly Factors'!E31","v":0.08},{"$f":"'Monthly Factors'!F31","v":0.09},{"$f":"'Monthly Factors'!G31","v":0.1},{"$f":"'Monthly Factors'!H31","v":0.11},{"$f":"'Monthly Factors'!I31","v":0.115},{"$f":"'Monthly Factors'!J31","v":0.1},{"$f":"'Monthly Factors'!K31","v":0.08},{"$f":"'Monthly Factors'!L31","v":7.0000000000000007E-2},{"$f":"'Monthly Factors'!M31","v":5.5E-2},null,null,null,null,null,null,null,null,null,"Relative environmental sensitivity",null,null,null,"Moderate in terrestrial areas / high along internal creeks, wetlands, springs"]
[]
[null,"Monthly Factors","Cold/Wet (1999)",null,null,null,null,null,null,null,null,null,null,null,null,null,null,null,null,null,null,null,"Hydrogeology (not including bedrock quarry area)"]
[null,null,"Jan","Feb","Mar","Apr","May","Jun","Jul","Aug","Sep","Oct","Nov","Dec",null,null,null,null,null,null,null,null,null,"Groundwater occurrence (primary / secondary)",null,null,null,"Granular pore space infillings"]
[null,"Surplus Water",{"$f":"'Monthly Factors'!B21","v":0.28121118610350893},{"$f":"'Monthly Factors'!C21","v":0.28471061972718881},{"$f":"'Monthly Factors'!D21","v":0.1055893178084587},{"$f":"'Monthly Factors'!E21","v":-1.2670737757409583E-2},{"$f":"'Monthly Factors'!F21","v":-1.0294974427895285E-2},{"$f":"'Monthly Factors'!G21","v":-2.6925317734495361E-2},{"$f":"'Monthly Factors'!H21","v":-3.4844528832876351E-2},{"$f":"'Monthly Factors'!I21","v":-1.425457997708578E-2},{"$f":"'Monthly Factors'!J21","v":-6.3353688787047913E-3},{"$f":"'Monthly Factors'!K21","v":9.9861251950584262E-2},{"$f":"'Monthly Factors'!L21","v":0.16139352218500455},{"$f":"'Monthly Factors'!M21","v":0.17255960983372176},null,null,null,null,null,null,null,null,null,"Primary porosity",null,null,null,"Variable: low in morainal materials, moderate to high in glaciofluvial materials.  "]
[null,"Leakance/\nLateral Ground Water",{"$f":"'Monthly Factors'!B44","v":8.1000000000000003E-2},{"$f":"'Monthly Factors'!C44","v":7.8E-2},{"$f":"'Monthly Factors'!D44","v":8.6999999999999994E-2},{"$f":"'Monthly Factors'!E44","v":8.5999999999999993E-2},{"$f":"'Monthly Factors'!F44","v":0.09},{"$f":"'Monthly Factors'!G44","v":8.5999999999999993E-2},{"$f":"'Monthly Factors'!H44","v":8.6999999999999994E-2},{"$f":"'Monthly Factors'!I44","v":8.5000000000000006E-2},{"$f":"'Monthly Factors'!J44","v":8.1000000000000003E-2},{"$f":"'Monthly Factors'!K44","v":8.2000000000000003E-2},{"$f":"'Monthly Factors'!L44","v":7.8E-2},{"$f":"'Monthly Factors'!M44","v":7.9000000000000001E-2},null,null,null,null,null,null,null,null,null,"Secondary porosity",null,null,null,"Not applicable - surficial AQ"]
[null,"Surface Water",{"$f":"'Monthly Factors'!B26","v":0.22068086457424585},{"$f":"'Monthly Factors'!C26","v":0.19373952223030552},{"$f":"'Monthly Factors'!D26","v":0.13994869625957773},{"$f":"'Monthly Factors'!E26","v":6.7665632372012466E-2},{"$f":"'Monthly Factors'!F26","v":2.399263439717373E-2},{"$f":"'Monthly Factors'!G26","v":9.7313744914725147E-3},{"$f":"'Monthly Factors'!H26","v":5.7792933459831003E-3},{"$f":"'Monthly Factors'!I26","v":1.8772385441074731E-3},{"$f":"'Monthly Factors'!J26","v":1.5783311410150771E-3},{"$f":"'Monthly Factors'!K26","v":1.4486378451963268E-2},{"$f":"'Monthly Factors'!L26","v":0.10238016286421177},{"$f":"'Monthly Factors'!M26","v":0.21813987132793164},null,null,null,null,null,null,null,null,null,"Confinement",null,null,null,"                           Suspected variable degrees of confinement due to aquifer \"stacking\": (1) most productive wells located in northwest portion of AQ, generally semi-confined to confined; (2) semi-confined to confined surficial aquifer above basal till / bedrock surface & within local bedrock surface embayments; (3)  mix of unconfined & semi-confined gw occurrences throughout AQ                                                                                                                                                                                                                                                       WP = 0 - ??? m, avg 7.5 m                                                                                                                                                                                                                                                                                                                    "]
[null,"Water Usage",{"$f":"'Monthly Factors'!B31","v":0.06},{"$f":"'Monthly Factors'!C31","v":6.5000000000000002E-2},{"$f":"'Monthly Factors'!D31","v":7.4999999999999997E-2},{"$f":"'Monthly Factors'!E31","v":0.08},{"$f":"'Monthly Factors'!F31","v":0.09},{"$f":"'Monthly Factors'!G31","v":0.1},{"$f":"'Monthly Factors'!H31","v":0.11},{"$f":"'Monthly Factors'!I31","v":0.115},{"$f":"'Monthly Factors'!J31","v":0.1},{"$f":"'Monthly Factors'!K31","v":0.08},{"$f":"'Monthly Factors'!L31","v":7.0000000000000007E-2},{"$f":"'Monthly Factors'!M31","v":5.5E-2},null,null,null,null,null,null,null,null,null,"Aquifer thickness",null,null,null,"Thickness of composite AQ  (including unconfined and semi-confined zones) highly variable: generally shallow in north half of AQ (< 20  m) / thicker in south-central area (up to 52 m deep, although actual AQ thickness below aquitards likely much less.                                                                                                                                                                                                                                                                                                                       Irregular underlying bedrock surface = significant aquifer thickness variations over short horizontal distances "]
[null,null,null,null,null,null,null,null,null,null,null,null,null,null,null,null,null,null,null,null,null,null,null,"Hydraulic anisotropy",null,null,null,"Low to moderate in unconfined areas, elevated in semi-confined to confined areas"]
[null,null,null,null,null,null,null,null,null,null,null,null,null,null,null,null,null,null,null,null,null,null,null,"Hydraulic gradient",null,null,null,"Variable: likely low-moderate based on irregular local terrain / higher in rolling, hilly areas & adjacent to incised watercourses"]
[null,null,null,null,null,null,null,null,null,null,null,null,null,null,null,null,null,null,null,null,null,null,null,"Storage potential",null,null,null,"Locally moderate to high due to elevated proportions of sand-gravel glaciofluvial materials; low in areas dominated by morainal materials"]
[null,null,null,null,null,null,null,null,null,null,null,null,null,null,null,null,null,null,null,null,null,null,null,"Yield potential",null,null,null,"Variable low- high depending on AQ host materials; WP = 0.09 - 22.1 L/s / average 0.75 L/s"]
[null,"TABLE K-6",null,null,null,null,null,null,null,null,null,null,null,null,null,null,null,null,null,null,null,null,null,"Flow velocities",null,null,null,"Variable: likely low to moderate based on irregular local terrain / possibly higher in hilly areas & adjacent to incised watercourses"]
[null,"Groundwater Flow Components: Aquifer #0206, Mill Bay (Surficial)",null,null,null,null,null,null,null,null,null,null,null,null,null,null,null,null,null,null,null,null,null,"Flow directions",null,null,null,"Regional flow towards the north-northeast and northeast / local flow directions likely variable depending on positions with stream subcatchments.                                                                                                                                                                                                                                                        Deeper semi-confined to confined zones: flow direction uncertain,  may be influenced by bedrock surface irregularities"]
[null,null,null,null,null,null,null,null,null,null,null,null,null,null,null,null,null,null,null,null,null,null,null,"Static water levels",null,null,null,"WP = variable artesian - 38.1 m bgs / avg 6.7 m bgs"]
[null,"Groundwater Flow","Direction of Flow","Source or Receptor of Water","Length (m)","Depth (m)","Area (m)","Hydraulic Conductivity (m/s) - K","Distance (m) - dL","Hydraulic Head (m) - dh",null,null,"GW Flow (m3/yr)",null,null,null,null,null,null,null,null,null,null,"Hydraulic connection with surface waters",null,null,null,"Near-surface unconfined AQ zones: moderate to high with Handeysen Creek to west, Hollings Creek at north, internal streams and springs.                                                                                                                                                                                                                                                  Deeper semi-confined to confined AQ zones: low connectivity to internal streams due to deep overburden cover / possible connection to incised portions of creeks along north edge of AQ or where bedrock forces groundwater to surface "]
[null,null,null,null,null,null,null,null,null,"Year 1","Year 2","Year 3","Year 1","Year 2","Year 3",null,null,null,null,null,null,null,null,"Hydraulic connection to adjacent AQ"]
[null,"QGW1","Out","To Mill Bay",2100,5,{"$f":"E82*F82","v":10500},1.0000000000000001E-5,750,60,null,null,{"$f":"-(G82*H82*(J82/I82))*60*60*24*365","v":-264902.40000000002},null,null,null,null,null,null,null,null,null,null,null,"Over / Under",null,null,"                                                AQ overlies bedrock AQ 207                                                                                                                                                                                                                     "]
[null,"QGW2","Out","Shawnigan Creek",230,20,{"$f":"E83*F83","v":4600},1.0000000000000001E-5,400,30,null,null,{"$f":"-(G83*H83*(J83/I83))*60*60*24*365","v":-108799.20000000001},null,null,null,null,null,null,null,null,null,null,null,"Upgradient",null,null,"AQ in contact with upgradient portions of bedrock AQ 207 along its south and west sides. AQ in particular may receive considerable lateral & basal recharge from fractured bedrock area to the west (intersection of Shawnigan Fault & Handysen Creek lineament)"]
[null,"QGW3","Out","Leakage to AQ 207","Leakance Factor (m/yr) = ",0.3,{"$f":"257.351074878*10000","v":2573510.74878},"--","--","--","--","--",{"$f":"-F84*G84","v":-772053.22463399998},null,null,null,null,null,null,null,null,null,null,null,"Downgradient",null,null,"AQ in contact with downgradient portions of surrounding bedrock AQ 207 along its west border) & posssibly cross-gradient with bedrock AQ 204 north of Shawnigan Creek (depending on local hydraulic heads)"]
[null,"Total",null,null,null,null,null,null,null,null,null,null,{"$f":"SUM(M82:M84)","v":-1145754.824634},null,null,null,null,null,null,null,null,null,null,"Vulnerability to surface contamination",null,null,null,"Variable: (1) near-surface unconfined AQ zones = low to high based on variable surficial lithologies and presence of low-permeability surface soil horizons; (2) deeper semi-confined to confined AQ zones - low based on deep overburden cover and overlying morainal aquitard"]
[null,null,null,null,null,null,null,null,null,null,null,null,null,null,null,null,null,null,null,null,null,null,null,"Recharge"]
[null,"Surface Water Contributions","Cold Water Creek?","Observed Vertical Gradient","Percent Permeable","Length (m)","Width (m)","Flux (m/s)","SW Flow (m3/yr)",null,null,"Comment",null,null,null,null,null,null,null,null,null,null,null,null,"Vertical inflow",null,null,"Variable: (1) near-surface unconfined AQ zones: moderate to high recharge from precipitation and irrigation-sewerage returns (high levels of rural residential development), negligible from snowmelt due to low elevations.  Variably low to moderate from stream losses, depending on local AQ hydraulic heads (2) deeper semi-confined AQ zones: low to negligible from precipitation due to deep overburden cover and overlying aquitards. "]
[null,null,null,null,null,null,null,null,"Year 1","Year 2","Year 3",null,null,null,null,null,null,null,null,null,null,null,null,null,"Lateral inflow",null,null,"Low to moderate to high lateral inflow from upgradient portions of bedrock AQ 207 to the south, west, and north.   Also possible upwelling inflow from underlying portions of bedrock AQ 207 - particular from the west (intersection of Shawnigan Fault & Handysen Creek lineament)"]
[null,"Handeyson Creek","Unknown","Downward",0.1,1200,2,3.0000000000000001E-5,{"$f":"(E89*F89*G89)*(H89*60*60*24*365)","v":227059.20000000001},null,null,null,null,null,null,null,null,null,null,null,null,null,null,null,"Temporal variability",null,null,"Variable:  (1) near-surface unconfined AQ zones: moderate to high depending on surficial lithologies and presence of low-permeability surface soil layers (2) Deeper semi-confined  & confined AQ zones: low due to deep overburden cover and overlying aquitards"]
[null,"Hollings Creek","Unknown","Upward",0.1,1100,2,3.0000000000000001E-5,{"$f":"-(E90*F90*G90)*(H90*60*60*24*365)","v":-208137.60000000001},null,null,null,null,null,null,null,null,null,null,null,null,null,null,null,"MBR",null,null,"Negligible to low - adjacent rocky upland area  approx 400 m to the south only"]
[null,"Total",null,null,null,null,null,null,{"$f":"SUM(I89:I90)","v":18921.600000000006},{"$f":"SUM(J90:J90)","v":0},{"$f":"SUM(K90:K90)","v":0},null,null,null,null,null,null,null,null,null,null,null,null,"Discharge"]
[null,null,null,null,null,null,null,null,null,null,null,null,null,null,null,null,null,null,null,null,null,null,null,null,"Evapotranspiration",null,null,"Variable: (1)  near-surface unconfined AQ zones: moderate to high (2) Deeper semi-confined  to confined AQ zones: low"]
[null,"Water Well Usage","Water Well Usage Volume (m3/yr)",null,null,null,null,null,null,null,null,"Comments",null,null,null,null,null,null,null,null,null,null,null,null,"Outflow to marine",null,null,"Negligible to low - separated  from marine shoreline by thin strip iof bedrock AQ 207"]
[null,null,"Year 1",null,null,"Year 2",null,null,"Year 3",null,null,null,null,null,null,null,null,null,null,null,null,null,null,null,"Outflow to surface waters",null,null,"Variable: (1) moderate to high along west (Handysen Ck), north (Hollings and Shawnigan Cks) and east (Bird, Wheelbarrow Cks) sides of AQ based on unconfined AQ settings & topography, or where bedrock forces  semi-confined groundwater to surface "]
[null,null,"Total Volume Removed","Adjustment Factor","Adjusted Volume Removed","Total Volume Removed","Adjustment Factor","Adjusted Volume Removed","Total Volume Removed","Adjustment Factor","Adjusted Volume Removed",null,null,null,null,null,null,null,null,null,null,null,null,null,"Outflow to other AQ",null,null,"Possible basal outflow to bedrock AQ 207 along east border & in areas where artesian bedrock conditions are not apparent"]
[null,"Industrial",{"$f":"AB101","v":0},1,{"$f":"C96*D96","v":0},null,null,null,null,null,null,"Assuming 100% consumptive",null,null,null,null,null,null,null,null,null,null,null,null,"Temporal variability",null,null,"Variable: (1)  near-surface unconfined AQ zones: moderate to high (2) Deeper semi-confined AQ zones: low"]
[null,"Commercial",18250,1,{"$f":"C97*D97","v":18250},null,null,null,null,null,null,"Assuming 100% consumptive"]
[null,"Domestic",15250,1,{"$f":"C98*D98","v":15250},null,null,null,null,null,null,"Assuming 100% consumptive",null,null,null,null,null,null,null,null,null,null,"Groundwater Development"]
[null,"Irrigation",43900,1,43900,null,null,null,null,null,null,"Assuming 100% consumptive",null,null,null,null,null,null,null,null,null,null,null,null,"Nearest BCMOE Observation Wells; distance; completion / relevance",null,null,"Well #345 is 3.6 km to the north-northeast; negligible relevancy, well completed within surficial AQ197"]
[null,"BCMOE Obs",0,1,0,null,null,null,null,null,null,"Assuming 100% consumptive",null,null,null,null,null,null,null,null,null,null,null,null,"Total Annual Water Use (m3/yr) as reported by Hatfield (2015)",null,null,null,"  SUMS"]
[null,"Other",7300,1,7300,null,null,null,null,null,null,"Assuming 100% consumptive",null,null,null,null,null,null,null,null,null,null,null,null,null,"Industrial",null,0,"Total Commercial and Industrial"]
[null,"Water Supply Systems",490890,1,490890,null,null,null,null,null,null,"Assuming 100% consumptive",null,null,null,null,null,null,null,null,null,null,null,null,null,"Commercial",null,18250,{"$f":"AB101+AB102","v":18250}]
[null,"Total",{"$f":"-SUM(C96:C102)","v":-575590},null,{"$f":"-SUM(E96:E102)","v":-575590},null,null,{"$f":"-SUM(H96:H102)","v":0},null,null,{"$f":"-SUM(K96:K102)","v":0},null,null,null,null,null,null,null,null,null,null,null,null,null,null,"Domestic",null,15250,"Total Irrigation"]
[null,null,null,null,null,null,null,null,null,null,null,null,null,null,null,null,null,null,null,null,null,null,null,null,null,"Irrigation (Hatfield)",null,43900,{"$f":"AB104","v":43900}]
[null,null,null,null,null,null,null,null,null,null,null,null,null,null,null,null,null,null,null,null,null,null,null,null,null,"BCMOE Obs",null,0]
[null,null,null,null,null,null,null,null,null,null,null,null,null,null,null,null,null,null,null,null,null,null,null,null,null,"Other",null,7300,"Total Domestic + Water Systems + Other"]
[null,null,null,null,null,null,null,null,null,null,null,null,null,null,null,null,null,null,null,null,null,null,null,null,null,"Water Supply Systems (2014 Mill Bay annual report)",null,490890,{"$f":"AB103+AB106+AB107","v":513440}]